cloudstack-commits mailing list archives

Site index · List index
Message view « Date » · « Thread »
Top « Date » · « Thread »
From Apache Jenkins Server <jenk...@builds.apache.org>
Subject Build failed in Jenkins: cloudstack-apidocs-master #269
Date Thu, 21 Feb 2013 18:20:47 GMT
See <https://builds.apache.org/job/cloudstack-apidocs-master/269/changes>

Changes:

[pranav.saxena] Reset a VM on reboot compute offering

[prachi] CLOUDSTACK-1331: Upgrade fails for a 2.2.14 Zone having multiple guest networks using
network_tags and Public Vlan

[chip.childers] Updating the java-ipv6 legal docs to reflect the newly added NOTICE and copyright
statements for version 0.10

[prachi] CLOUDSTACK-1344 Typo in use.external.dns setting description

[alex.huang] CLOUDSTACK-1273: Fixed the problem with the paths on the systemvm

[jessica.wang] CLOUDSTACK-1343: cloudstack UI - baremetal - enable baremetal providers who
are selected in the network offering.

[prachi] CLOUDSTACK-1346: Check to see if external devices are used in the network, is hardcoded
for specific devices

[sheng.yang] IPv6: Update java-ipv6 dependency to 0.10

[mice_xia] CLOUDSTACK-1334 global config vmware.root.disk.controller doesn't work

[aprateek] CLOUDSTACK-745: Reset a VM on reboot. On every reboot of VM, the root disk state
is reset. This is for the VMs created using service offering where an optional parameter isvolatile
is set true.

[bhaisaab] CLOUDSTACK-1347: Don't enforce not null rule on queue_proc_time of sync_item_queue

[aprateek] CLOUDSTACK-667: VM's base image update facility

[trippie] Commit review 9409 Added a global package name in the packaging script

[pranav.saxena] Reset a VM detail view display

[trippie] Prachi's commit 20a747601c2664b2b8128f7a180f7e94f6b0b1e1 introduced a

[david] CLOUDSTACK-1180: UI test automation using selenium

------------------------------------------
[...truncated 3167 lines...]
Tests run: 0, Failures: 0, Errors: 0, Skipped: 0

[JENKINS] Recording test results
[INFO] Building jar: <https://builds.apache.org/job/cloudstack-apidocs-master/ws/test/target/cloud-testclient-4.2.0-SNAPSHOT.jar>
[INFO] 
[INFO] --- maven-jar-plugin:2.4:jar (default-jar) @ cloud-testclient ---
[INFO] 
[INFO] --- maven-site-plugin:3.1:attach-descriptor (attach-descriptor) @ cloud-testclient
---
[INFO] [INFO] Building jar: <https://builds.apache.org/job/cloudstack-apidocs-master/ws/test/target/cloud-testclient-4.2.0-SNAPSHOT-tests.jar>

[INFO] --- maven-jar-plugin:2.4:test-jar (default) @ cloud-testclient ---
[INFO] [INFO] Installing <https://builds.apache.org/job/cloudstack-apidocs-master/ws/test/target/cloud-testclient-4.2.0-SNAPSHOT.jar>
to /home/jenkins/jenkins-slave/maven-repositories/1/org/apache/cloudstack/cloud-testclient/4.2.0-SNAPSHOT/cloud-testclient-4.2.0-SNAPSHOT.jar

[INFO] --- maven-install-plugin:2.3.1:install (default-install) @ cloud-testclient ---
[INFO] Installing <https://builds.apache.org/job/cloudstack-apidocs-master/ws/test/pom.xml>
to /home/jenkins/jenkins-slave/maven-repositories/1/org/apache/cloudstack/cloud-testclient/4.2.0-SNAPSHOT/cloud-testclient-4.2.0-SNAPSHOT.pom
[INFO] Installing <https://builds.apache.org/job/cloudstack-apidocs-master/ws/test/target/cloud-testclient-4.2.0-SNAPSHOT-tests.jar>
to /home/jenkins/jenkins-slave/maven-repositories/1/org/apache/cloudstack/cloud-testclient/4.2.0-SNAPSHOT/cloud-testclient-4.2.0-SNAPSHOT-tests.jar
[INFO]                                                                         
[INFO] ------------------------------------------------------------------------
[INFO] Building Apache CloudStack Client UI 4.2.0-SNAPSHOT
[INFO] ------------------------------------------------------------------------
[INFO] [INFO] Deleting <https://builds.apache.org/job/cloudstack-apidocs-master/ws/client/target>

[INFO] --- maven-clean-plugin:2.5:clean (default-clean) @ cloud-client-ui ---
[INFO] 
[INFO] --- maven-remote-resources-plugin:1.3:process (default) @ cloud-client-ui ---
Downloading: http://repo.maven.apache.org/maven2/org/libvirt/libvirt/0.4.9/libvirt-0.4.9.pom
[INFO] [INFO] Executing tasks

main:
     [copy] Copying 1 file to <https://builds.apache.org/job/cloudstack-apidocs-master/ws/client/target/generated-webapp/WEB-INF>

     [copy] Copying 7 files to <https://builds.apache.org/job/cloudstack-apidocs-master/ws/client/target/generated-webapp/WEB-INF/classes>
[INFO] --- maven-antrun-plugin:1.7:run (generate-resource) @ cloud-client-ui ---
     [copy] Copying 174 files to <https://builds.apache.org/job/cloudstack-apidocs-master/ws/client/target/generated-webapp/WEB-INF/classes/scripts>
     [copy] Copying 1 file to <https://builds.apache.org/job/cloudstack-apidocs-master/ws/client/target/generated-webapp/WEB-INF/classes/vms>
     [copy] Copying 183 files to <https://builds.apache.org/job/cloudstack-apidocs-master/ws/client/target/generated-webapp>
     [copy] Copying 24 files to <https://builds.apache.org/job/cloudstack-apidocs-master/ws/client/target/generated-webapp/WEB-INF/classes>
     [copy] Copying 24 files to <https://builds.apache.org/job/cloudstack-apidocs-master/ws/client/target/generated-webapp/WEB-INF/classes>
     [copy] Copying 6 files to <https://builds.apache.org/job/cloudstack-apidocs-master/ws/client/target/utilities/bin>
     [copy] Copying 2 files to <https://builds.apache.org/job/cloudstack-apidocs-master/ws/client/target/utilities/bin>
     [copy] Copying 60 files to <https://builds.apache.org/job/cloudstack-apidocs-master/ws/client/target/utilities/scripts/db>
[INFO] Executed tasks
[INFO] [debug] execute contextualize
[INFO] Using 'UTF-8' encoding to copy filtered resources.
[INFO] skip non existing resourceDirectory <https://builds.apache.org/job/cloudstack-apidocs-master/ws/client/src/main/resources>
[INFO] Copying 3 resources

[INFO] --- maven-resources-plugin:2.5:resources (default-resources) @ cloud-client-ui ---
[INFO] [INFO] Executing tasks

main:
[INFO] Executed tasks

[INFO] --- maven-antrun-plugin:1.7:run (process-nonoss) @ cloud-client-ui ---
[INFO] 
[INFO] --- maven-antrun-plugin:1.7:run (process-nonoss-spring-context) @ cloud-client-ui ---
[INFO] Executing tasks

main:
[INFO] Executed tasks
[INFO] [INFO] No sources to compile

[INFO] --- maven-compiler-plugin:2.5.1:compile (default-compile) @ cloud-client-ui ---
[INFO] [debug] execute contextualize
[INFO] Using 'UTF-8' encoding to copy filtered resources.
[INFO] skip non existing resourceDirectory <https://builds.apache.org/job/cloudstack-apidocs-master/ws/client/src/test/resources>
[INFO] Copying 3 resources

[INFO] --- maven-resources-plugin:2.5:testResources (default-testResources) @ cloud-client-ui
---
[INFO] [INFO] No sources to compile

[INFO] --- maven-compiler-plugin:2.5.1:testCompile (default-testCompile) @ cloud-client-ui
---
[INFO] [INFO] Surefire report directory: <https://builds.apache.org/job/cloudstack-apidocs-master/ws/client/target/surefire-reports>

-------------------------------------------------------
 T E S T S
-------------------------------------------------------

[INFO] --- maven-surefire-plugin:2.12:test (default-test) @ cloud-client-ui ---

Results :

Tests run: 0, Failures: 0, Errors: 0, Skipped: 0

[JENKINS] Recording test results
[INFO] 
[INFO] --- maven-war-plugin:2.3:war (default-war) @ cloud-client-ui ---
[INFO] Packaging webapp
[INFO] Assembling webapp [cloud-client-ui] in [<https://builds.apache.org/job/cloudstack-apidocs-master/ws/client/target/cloud-client-ui-4.2.0-SNAPSHOT]>
[INFO] Processing war project
[INFO] Copying webapp resources [<https://builds.apache.org/job/cloudstack-apidocs-master/ws/client/target/generated-webapp]>
[INFO] Webapp assembled in [2156 msecs]
[INFO] Building war: <https://builds.apache.org/job/cloudstack-apidocs-master/ws/client/target/cloud-client-ui-4.2.0-SNAPSHOT.war>
[INFO] 
[INFO] --- maven-site-plugin:3.1:attach-descriptor (attach-descriptor) @ cloud-client-ui ---
[INFO] [INFO] Configured Artifact: org.jasypt:jasypt:1.9.0:jar
[INFO] Configured Artifact: org.jasypt:jasypt:1.8:jar
[INFO] Copying jasypt-1.9.0.jar to <https://builds.apache.org/job/cloudstack-apidocs-master/ws/client/target/pythonlibs/jasypt-1.9.0.jar>
[INFO] Copying jasypt-1.8.jar to <https://builds.apache.org/job/cloudstack-apidocs-master/ws/client/target/pythonlibs/jasypt-1.8.jar>

[INFO] --- maven-dependency-plugin:2.5.1:copy (copy) @ cloud-client-ui ---
[INFO] [INFO] Installing <https://builds.apache.org/job/cloudstack-apidocs-master/ws/client/target/cloud-client-ui-4.2.0-SNAPSHOT.war>
to /home/jenkins/jenkins-slave/maven-repositories/1/org/apache/cloudstack/cloud-client-ui/4.2.0-SNAPSHOT/cloud-client-ui-4.2.0-SNAPSHOT.war

[INFO] --- maven-install-plugin:2.3.1:install (default-install) @ cloud-client-ui ---
[INFO] Installing <https://builds.apache.org/job/cloudstack-apidocs-master/ws/client/pom.xml>
to /home/jenkins/jenkins-slave/maven-repositories/1/org/apache/cloudstack/cloud-client-ui/4.2.0-SNAPSHOT/cloud-client-ui-4.2.0-SNAPSHOT.pom
[INFO] ------------------------------------------------------------------------
[INFO] Reactor Summary:
[INFO] 
[INFO] Apache CloudStack ................................. SUCCESS [25.349s]
[INFO] Apache CloudStack Utils ........................... SUCCESS [36.151s]
[INFO] Apache CloudStack API ............................. SUCCESS [15.145s]
[INFO] Apache CloudStack Core ............................ SUCCESS [8.189s]
[INFO] Apache CloudStack Agents .......................... SUCCESS [7.999s]
[INFO] Apache CloudStack Framework ....................... SUCCESS [0.726s]
[INFO] Apache CloudStack Framework - IPC ................. SUCCESS [4.224s]
[INFO] Apache CloudStack Framework - REST ................ SUCCESS [7.206s]
[INFO] Apache CloudStack Cloud Engine .................... SUCCESS [0.608s]
[INFO] Apache CloudStack Cloud Engine API ................ SUCCESS [3.648s]
[INFO] Apache CloudStack Framework - Event Notification .. SUCCESS [5.386s]
[INFO] Apache CloudStack Server .......................... SUCCESS [22.531s]
[INFO] Apache CloudStack Usage Server .................... SUCCESS [9.696s]
[INFO] Apache XenSource XAPI ............................. SUCCESS [4.664s]
[INFO] Apache CloudStack Plugin POM ...................... SUCCESS [1.636s]
[INFO] Apache CloudStack Plugin - API Rate Limit ......... SUCCESS [7.401s]
[INFO] Apache CloudStack Plugin - API Discovery .......... SUCCESS [5.135s]
[INFO] Apache CloudStack Plugin - ACL Static Role Based .. SUCCESS [3.913s]
[INFO] Apache CloudStack Plugin - User Concentrated Pod Deployment Planner  SUCCESS [3.726s]
[INFO] Apache CloudStack Plugin - User Dispersing Deployment Planner  SUCCESS [3.138s]
[INFO] Apache CloudStack Plugin - Host Allocator Random .. SUCCESS [3.968s]
[INFO] Apache CloudStack Plugin - Hypervisor OracleVM .... SUCCESS [3.780s]
[INFO] Apache CloudStack Cloud Engine Internal Components API  SUCCESS [3.005s]
[INFO] Apache CloudStack Engine Storage Component ........ SUCCESS [4.961s]
[INFO] Apache CloudStack Plugin - Open vSwitch ........... SUCCESS [3.256s]
[INFO] Apache CloudStack Plugin - Hypervisor Xen ......... SUCCESS [6.372s]
[INFO] Apache CloudStack Plugin - Hypervisor KVM ......... SUCCESS [15.148s]
[INFO] Apache CloudStack Plugin - RabbitMQ Event Bus ..... SUCCESS [3.725s]
[INFO] Apache CloudStack Plugin - Hypervisor Simulator ... SUCCESS [4.298s]
[INFO] Apache CloudStack Plugin - Hypervisor Baremetal ... SUCCESS [3.879s]
[INFO] Apache CloudStack Plugin - Hypervisor UCS ......... SUCCESS [4.597s]
[INFO] Apache CloudStack Plugin - Network Elastic Load Balancer  SUCCESS [3.516s]
[INFO] Apache CloudStack Plugin - Network Nicira NVP ..... SUCCESS [7.959s]
[INFO] Apache CloudStack Plugin - BigSwitch Virtual Network Segment  SUCCESS [6.052s]
[INFO] Apache CloudStack Plugin - Storage Allocator Random  SUCCESS [3.784s]
[INFO] Apache CloudStack Plugin - User Authenticator LDAP  SUCCESS [3.393s]
[INFO] Apache CloudStack Plugin - User Authenticator MD5 . SUCCESS [3.220s]
[INFO] Apache CloudStack Plugin - User Authenticator Plain Text  SUCCESS [4.506s]
[INFO] Apache CloudStack Plugin - User Authenticator SHA256 Salted  SUCCESS [7.769s]
[INFO] Apache CloudStack Plugin - Dns Notifier Example ... SUCCESS [3.782s]
[INFO] Apache CloudStack Engine Storage Image Component .. SUCCESS [3.776s]
[INFO] Apache CloudStack Plugin - Storage Image S3 ....... SUCCESS [3.096s]
[INFO] Apache CloudStack Engine Storage Volume Component . SUCCESS [4.301s]
[INFO] Apache CloudStack Plugin - Storage Volume solidfire  SUCCESS [4.220s]
[INFO] Apache CloudStack SystemVM Patches ................ SUCCESS [2.227s]
[INFO] Apache CloudStack Cloud Engine Compute Component .. SUCCESS [3.600s]
[INFO] Apache CloudStack Cloud Engine Orchestration Component  SUCCESS [4.688s]
[INFO] Apache CloudStack Engine Storage Image Motion Component  SUCCESS [3.953s]
[INFO] Apache CloudStack Engine Storage Backup Component . SUCCESS [3.165s]
[INFO] Apache CloudStack Engine Storage Snapshot Component  SUCCESS [3.669s]
[INFO] Apache CloudStack Engine Storage integration test Component  SUCCESS [6.004s]
[INFO] Apache CloudStack Cloud Engine Schema Component ... SUCCESS [2.064s]
[INFO] Apache CloudStack Cloud Engine API ................ SUCCESS [3.730s]
[INFO] Apache CloudStack Cloud Engine Service ............ SUCCESS [9.552s]
[INFO] Apache CloudStack Cloud Services .................. SUCCESS [1.083s]
[INFO] Apache CloudStack Console Proxy Service ........... SUCCESS [0.677s]
[INFO] Apache CloudStack Console Proxy Plugin ............ SUCCESS [0.694s]
[INFO] Apache CloudStack Console Proxy ................... SUCCESS [9.098s]
[INFO] Apache CloudStack Test ............................ SUCCESS [6.160s]
[INFO] Apache CloudStack Client UI ....................... SUCCESS [13.789s]
[INFO] ------------------------------------------------------------------------
[INFO] BUILD SUCCESS
[INFO] ------------------------------------------------------------------------
[INFO] Total time: 6:21.083s
[INFO] Finished at: Thu Feb 21 18:20:12 UTC 2013
[INFO] Final Memory: 40M/211M
[INFO] ------------------------------------------------------------------------
[JENKINS] Archiving disabled
[JENKINS] Archiving disabled
[JENKINS] Archiving disabled
[JENKINS] Archiving disabled
[JENKINS] Archiving disabled
[JENKINS] Archiving disabled
[JENKINS] Archiving disabled
[JENKINS] Archiving disabled
[JENKINS] Archiving disabled
[JENKINS] Archiving disabled
[JENKINS] Archiving disabled
[JENKINS] Archiving disabled
[JENKINS] Archiving disabled
[JENKINS] Archiving disabled
[JENKINS] Archiving disabled
[JENKINS] Archiving disabled
[JENKINS] Archiving disabled
[JENKINS] Archiving disabled
[JENKINS] Archiving disabled
[JENKINS] Archiving disabled
[JENKINS] Archiving disabled
[JENKINS] Archiving disabled
[JENKINS] Archiving disabled
[JENKINS] Archiving disabled
[JENKINS] Archiving disabled
[JENKINS] Archiving disabled
[JENKINS] Archiving disabled
[JENKINS] Archiving disabled
[JENKINS] Archiving disabled
[JENKINS] Archiving disabled
[JENKINS] Archiving disabled
[JENKINS] Archiving disabled
[JENKINS] Archiving disabled
[JENKINS] Archiving disabled
[JENKINS] Archiving disabled
[JENKINS] Archiving disabled
[JENKINS] Archiving disabled
[JENKINS] Archiving disabled
[JENKINS] Archiving disabled
[JENKINS] Archiving disabled
[JENKINS] Archiving disabled
[JENKINS] Archiving disabled
[JENKINS] Archiving disabled
[JENKINS] Archiving disabled
[JENKINS] Archiving disabled
[JENKINS] Archiving disabled
[JENKINS] Archiving disabled
[JENKINS] Archiving disabled
[JENKINS] Archiving disabled
[JENKINS] Archiving disabled
[JENKINS] Archiving disabled
[JENKINS] Archiving disabled
[JENKINS] Archiving disabled
[JENKINS] Archiving disabled
[JENKINS] Archiving disabled
[JENKINS] Archiving disabled
[JENKINS] Archiving disabled
[JENKINS] Archiving disabled
[JENKINS] Archiving disabled
[JENKINS] Archiving disabled
Waiting for Jenkins to finish collecting data
channel stopped
[cloudstack-apidocs-master] $ /bin/bash -xe /tmp/hudson6040104257582108674.sh
+ mvn -P developer -pl :cloud-apidoc
[INFO] Scanning for projects...
[ERROR] Could not find the selected project in the reactor: :cloud-apidoc -> [Help 1]
[ERROR] 
[ERROR] To see the full stack trace of the errors, re-run Maven with the -e switch.
[ERROR] Re-run Maven using the -X switch to enable full debug logging.
[ERROR] 
[ERROR] For more information about the errors and possible solutions, please read the following
articles:
[ERROR] [Help 1] http://cwiki.apache.org/confluence/display/MAVEN/MavenExecutionException
Build step 'Execute shell' marked build as failure
Archiving artifacts

Mime
View raw message