click-dev mailing list archives

Site index · List index
Message view « Date » · « Thread »
Top « Date » · « Thread »
From Apache Hudson Server <hud...@hudson.zones.apache.org>
Subject Build failed in Hudson: Click #142
Date Sun, 27 Jun 2010 06:18:25 GMT
See <http://hudson.zones.apache.org/hudson/job/Click/142/>

------------------------------------------
[...truncated 2380 lines...]
    [junit]     WEB root directory defined at -> /tmp/click802478167949814545
    [junit]     WEB temp directory defined at -> /tmp/click-temp
    [junit] click-servlet: init
    [junit] [Click] [info ] ***  Initializing Click 2.3.0-M1 in development mode  ***
    [junit] [Click] [info ] initialized LogService: org.apache.click.service.ConsoleLogService
    [junit] [Click] [info ] Click 2.3.0-M1 initialized in development mode
    [junit]     WEB root directory defined at -> /tmp/click5031554303419741511
    [junit]     WEB temp directory defined at -> /tmp/click-temp
    [junit] click-servlet: init
    [junit] [Click] [info ] ***  Initializing Click 2.3.0-M1 in development mode  ***
    [junit] [Click] [info ] initialized LogService: org.apache.click.service.ConsoleLogService
    [junit] java.lang.RuntimeException: java.lang.ClassNotFoundException: org.apache.click.service.ConfigServiceTest$MyMessagesMapService
    [junit] 	at org.apache.click.ClickServlet.initConfigService(ClickServlet.java:1989)
    [junit] 	at org.apache.click.ClickServlet.init(ClickServlet.java:197)
    [junit] 	at javax.servlet.GenericServlet.init(GenericServlet.java:258)
    [junit] 	at org.apache.click.MockContainer.configure(MockContainer.java:686)
    [junit] 	at org.apache.click.MockContainer.start(MockContainer.java:308)
    [junit] 	at org.apache.click.service.XmlConfigServiceTest.testMessagesMapService(XmlConfigServiceTest.java:520)
    [junit] 	at sun.reflect.NativeMethodAccessorImpl.invoke0(Native Method)
    [junit] 	at sun.reflect.NativeMethodAccessorImpl.invoke(NativeMethodAccessorImpl.java:39)
    [junit] 	at sun.reflect.DelegatingMethodAccessorImpl.invoke(DelegatingMethodAccessorImpl.java:25)
    [junit] 	at java.lang.reflect.Method.invoke(Method.java:597)
    [junit] 	at junit.framework.TestCase.runTest(TestCase.java:154)
    [junit] 	at junit.framework.TestCase.runBare(TestCase.java:127)
    [junit] 	at junit.framework.TestResult$1.protect(TestResult.java:106)
    [junit] 	at junit.framework.TestResult.runProtected(TestResult.java:124)
    [junit] 	at junit.framework.TestResult.run(TestResult.java:109)
    [junit] 	at junit.framework.TestCase.run(TestCase.java:118)
    [junit] 	at junit.framework.TestSuite.runTest(TestSuite.java:208)
    [junit] 	at junit.framework.TestSuite.run(TestSuite.java:203)
    [junit] 	at org.apache.tools.ant.taskdefs.optional.junit.JUnitTestRunner.run(JUnitTestRunner.java:422)
    [junit] 	at org.apache.tools.ant.taskdefs.optional.junit.JUnitTestRunner.launch(JUnitTestRunner.java:931)
    [junit] 	at org.apache.tools.ant.taskdefs.optional.junit.JUnitTestRunner.main(JUnitTestRunner.java:785)
    [junit] Caused by: java.lang.ClassNotFoundException: org.apache.click.service.ConfigServiceTest$MyMessagesMapService
    [junit] 	at java.net.URLClassLoader$1.run(URLClassLoader.java:202)
    [junit] 	at java.security.AccessController.doPrivileged(Native Method)
    [junit] 	at java.net.URLClassLoader.findClass(URLClassLoader.java:190)
    [junit] 	at java.lang.ClassLoader.loadClass(ClassLoader.java:307)
    [junit] 	at sun.misc.Launcher$AppClassLoader.loadClass(Launcher.java:301)
    [junit] 	at java.lang.ClassLoader.loadClass(ClassLoader.java:248)
    [junit] 	at java.lang.Class.forName0(Native Method)
    [junit] 	at java.lang.Class.forName(Class.java:247)
    [junit] 	at org.apache.click.util.ClickUtils.classForName(ClickUtils.java:540)
    [junit] 	at org.apache.click.service.XmlConfigService.loadMessagesMapService(XmlConfigService.java:1588)
    [junit] 	at org.apache.click.service.XmlConfigService.onInit(XmlConfigService.java:273)
    [junit] 	at org.apache.click.ClickServlet.initConfigService(ClickServlet.java:1982)
    [junit] 	... 20 more
    [junit] java.lang.RuntimeException: java.lang.ClassNotFoundException: org.apache.click.service.ConfigServiceTest$MyMessagesMapService
    [junit] 	at org.apache.click.ClickServlet.initConfigService(ClickServlet.java:1989)
    [junit] 	at org.apache.click.ClickServlet.init(ClickServlet.java:197)
    [junit] 	at javax.servlet.GenericServlet.init(GenericServlet.java:258)
    [junit] 	at org.apache.click.MockContainer.configure(MockContainer.java:686)
    [junit] 	at org.apache.click.MockContainer.start(MockContainer.java:308)
    [junit] 	at org.apache.click.service.XmlConfigServiceTest.testMessagesMapService(XmlConfigServiceTest.java:520)
    [junit] 	at sun.reflect.NativeMethodAccessorImpl.invoke0(Native Method)
    [junit] 	at sun.reflect.NativeMethodAccessorImpl.invoke(NativeMethodAccessorImpl.java:39)
    [junit] 	at sun.reflect.DelegatingMethodAccessorImpl.invoke(DelegatingMethodAccessorImpl.java:25)
    [junit] 	at java.lang.reflect.Method.invoke(Method.java:597)
    [junit] 	at junit.framework.TestCase.runTest(TestCase.java:154)
    [junit] 	at junit.framework.TestCase.runBare(TestCase.java:127)
    [junit] 	at junit.framework.TestResult$1.protect(TestResult.java:106)
    [junit] 	at junit.framework.TestResult.runProtected(TestResult.java:124)
    [junit] 	at junit.framework.TestResult.run(TestResult.java:109)
    [junit] 	at junit.framework.TestCase.run(TestCase.java:118)
    [junit] 	at junit.framework.TestSuite.runTest(TestSuite.java:208)
    [junit] 	at junit.framework.TestSuite.run(TestSuite.java:203)
    [junit] 	at org.apache.tools.ant.taskdefs.optional.junit.JUnitTestRunner.run(JUnitTestRunner.java:422)
    [junit] 	at org.apache.tools.ant.taskdefs.optional.junit.JUnitTestRunner.launch(JUnitTestRunner.java:931)
    [junit] 	at org.apache.tools.ant.taskdefs.optional.junit.JUnitTestRunner.main(JUnitTestRunner.java:785)
    [junit] Caused by: java.lang.ClassNotFoundException: org.apache.click.service.ConfigServiceTest$MyMessagesMapService
    [junit] 	at java.net.URLClassLoader$1.run(URLClassLoader.java:202)
    [junit] 	at java.security.AccessController.doPrivileged(Native Method)
    [junit] 	at java.net.URLClassLoader.findClass(URLClassLoader.java:190)
    [junit] 	at java.lang.ClassLoader.loadClass(ClassLoader.java:307)
    [junit] 	at sun.misc.Launcher$AppClassLoader.loadClass(Launcher.java:301)
    [junit] 	at java.lang.ClassLoader.loadClass(ClassLoader.java:248)
    [junit] 	at java.lang.Class.forName0(Native Method)
    [junit] 	at java.lang.Class.forName(Class.java:247)
    [junit] 	at org.apache.click.util.ClickUtils.classForName(ClickUtils.java:540)
    [junit] 	at org.apache.click.service.XmlConfigService.loadMessagesMapService(XmlConfigService.java:1588)
    [junit] 	at org.apache.click.service.XmlConfigService.onInit(XmlConfigService.java:273)
    [junit] 	at org.apache.click.ClickServlet.initConfigService(ClickServlet.java:1982)
    [junit] 	... 20 more
    [junit] java.lang.RuntimeException: java.lang.ClassNotFoundException: org.apache.click.ConfigServiceTest$MyControl
    [junit] 	at org.apache.click.ClickServlet.initConfigService(ClickServlet.java:1989)
    [junit] 	at org.apache.click.ClickServlet.init(ClickServlet.java:197)
    [junit] 	at javax.servlet.GenericServlet.init(GenericServlet.java:258)
    [junit] 	at org.apache.click.MockContainer.configure(MockContainer.java:686)
    [junit] 	at org.apache.click.MockContainer.start(MockContainer.java:308)
    [junit] 	at org.apache.click.service.XmlConfigServiceTest.testControls(XmlConfigServiceTest.java:558)
    [junit] 	at sun.reflect.NativeMethodAccessorImpl.invoke0(Native Method)
    [junit] 	at sun.reflect.NativeMethodAccessorImpl.invoke(NativeMethodAccessorImpl.java:39)
    [junit] 	at sun.reflect.DelegatingMethodAccessorImpl.invoke(DelegatingMethodAccessorImpl.java:25)
    [junit] 	at java.lang.reflect.Method.invoke(Method.java:597)
    [junit] 	at junit.framework.TestCase.runTest(TestCase.java:154)
    [junit] 	at junit.framework.TestCase.runBare(TestCase.java:127)
    [junit] 	at junit.framework.TestResult$1.protect(TestResult.java:106)
    [junit] 	at junit.framework.TestResult.runProtected(TestResult.java:124)
    [junit] 	at junit.framework.TestResult.run(TestResult.java:109)
    [junit] 	at junit.framework.TestCase.run(TestCase.java:118)
    [junit] 	at junit.framework.TestSuite.runTest(TestSuite.java:208)
    [junit] 	at junit.framework.TestSuite.run(TestSuite.java:203)
    [junit] 	at org.apache.tools.ant.taskdefs.optional.junit.JUnitTestRunner.run(JUnitTestRunner.java:422)
    [junit] 	at org.apache.tools.ant.taskdefs.optional.junit.JUnitTestRunner.launch(JUnitTestRunner.java:931)
    [junit] 	at org.apache.tools.ant.taskdefs.optional.junit.JUnitTestRunner.main(JUnitTestRunner.java:785)
    [junit] Caused by: java.lang.ClassNotFoundException: org.apache.click.ConfigServiceTest$MyControl
    [junit] 	at java.net.URLClassLoader$1.run(URLClassLoader.java:202)
    [junit] 	at java.security.AccessController.doPrivileged(Native Method)
    [junit] 	at java.net.URLClassLoader.findClass(URLClassLoader.java:190)
    [junit] 	at java.lang.ClassLoader.loadClass(ClassLoader.java:307)
    [junit] 	at sun.misc.Launcher$AppClassLoader.loadClass(Launcher.java:301)
    [junit] 	at java.lang.ClassLoader.loadClass(ClassLoader.java:248)
    [junit] 	at java.lang.Class.forName0(Native Method)
    [junit] 	at java.lang.Class.forName(Class.java:247)
    [junit] 	at org.apache.click.util.ClickUtils.classForName(ClickUtils.java:540)
    [junit] 	at org.apache.click.service.XmlConfigService.deployControls(XmlConfigService.java:1270)
    [junit] 	at org.apache.click.service.XmlConfigService.deployFiles(XmlConfigService.java:1322)
    [junit] 	at org.apache.click.service.XmlConfigService.onInit(XmlConfigService.java:243)
    [junit] 	at org.apache.click.ClickServlet.initConfigService(ClickServlet.java:1982)
    [junit] 	... 20 more
    [junit] java.lang.RuntimeException: java.lang.ClassNotFoundException: org.apache.click.ConfigServiceTest$MyControl
    [junit] 	at org.apache.click.ClickServlet.initConfigService(ClickServlet.java:1989)
    [junit] 	at org.apache.click.ClickServlet.init(ClickServlet.java:197)
    [junit] 	at javax.servlet.GenericServlet.init(GenericServlet.java:258)
    [junit] 	at org.apache.click.MockContainer.configure(MockContainer.java:686)
    [junit] 	at org.apache.click.MockContainer.start(MockContainer.java:308)
    [junit] 	at org.apache.click.service.XmlConfigServiceTest.testControls(XmlConfigServiceTest.java:558)
    [junit] 	at sun.reflect.NativeMethodAccessorImpl.invoke0(Native Method)
    [junit] 	at sun.reflect.NativeMethodAccessorImpl.invoke(NativeMethodAccessorImpl.java:39)
    [junit] 	at sun.reflect.DelegatingMethodAccessorImpl.invoke(DelegatingMethodAccessorImpl.java:25)
    [junit] 	at java.lang.reflect.Method.invoke(Method.java:597)
    [junit] 	at junit.framework.TestCase.runTest(TestCase.java:154)
    [junit] 	at junit.framework.TestCase.runBare(TestCase.java:127)
    [junit] 	at junit.framework.TestResult$1.protect(TestResult.java:106)
    [junit] 	at junit.framework.TestResult.runProtected(TestResult.java:124)
    [junit] 	at junit.framework.TestResult.run(TestResult.java:109)
    [junit] 	at junit.framework.TestCase.run(TestCase.java:118)
    [junit] 	at junit.framework.TestSuite.runTest(TestSuite.java:208)
    [junit] 	at junit.framework.TestSuite.run(TestSuite.java:203)
    [junit] 	at org.apache.tools.ant.taskdefs.optional.junit.JUnitTestRunner.run(JUnitTestRunner.java:422)
    [junit] 	at org.apache.tools.ant.taskdefs.optional.junit.JUnitTestRunner.launch(JUnitTestRunner.java:931)
    [junit] 	at org.apache.tools.ant.taskdefs.optional.junit.JUnitTestRunner.main(JUnitTestRunner.java:785)
    [junit] Caused by: java.lang.ClassNotFoundException: org.apache.click.ConfigServiceTest$MyControl
    [junit] 	at java.net.URLClassLoader$1.run(URLClassLoader.java:202)
    [junit] 	at java.security.AccessController.doPrivileged(Native Method)
    [junit] 	at java.net.URLClassLoader.findClass(URLClassLoader.java:190)
    [junit] 	at java.lang.ClassLoader.loadClass(ClassLoader.java:307)
    [junit] 	at sun.misc.Launcher$AppClassLoader.loadClass(Launcher.java:301)
    [junit] 	at java.lang.ClassLoader.loadClass(ClassLoader.java:248)
    [junit] 	at java.lang.Class.forName0(Native Method)
    [junit] 	at java.lang.Class.forName(Class.java:247)
    [junit] 	at org.apache.click.util.ClickUtils.classForName(ClickUtils.java:540)
    [junit] 	at org.apache.click.service.XmlConfigService.deployControls(XmlConfigService.java:1270)
    [junit] 	at org.apache.click.service.XmlConfigService.deployFiles(XmlConfigService.java:1322)
    [junit] 	at org.apache.click.service.XmlConfigService.onInit(XmlConfigService.java:243)
    [junit] 	at org.apache.click.ClickServlet.initConfigService(ClickServlet.java:1982)
    [junit] 	... 20 more
    [junit] java.lang.RuntimeException: java.lang.ClassNotFoundException: org.apache.click.ConfigServiceTest$MyPageInterceptor
    [junit] 	at org.apache.click.ClickServlet.initConfigService(ClickServlet.java:1989)
    [junit] 	at org.apache.click.ClickServlet.init(ClickServlet.java:197)
    [junit] 	at javax.servlet.GenericServlet.init(GenericServlet.java:258)
    [junit] 	at org.apache.click.MockContainer.configure(MockContainer.java:686)
    [junit] 	at org.apache.click.MockContainer.start(MockContainer.java:308)
    [junit] 	at org.apache.click.service.XmlConfigServiceTest.testPageInterceptors(XmlConfigServiceTest.java:592)
    [junit] 	at sun.reflect.NativeMethodAccessorImpl.invoke0(Native Method)
    [junit] 	at sun.reflect.NativeMethodAccessorImpl.invoke(NativeMethodAccessorImpl.java:39)
    [junit] 	at sun.reflect.DelegatingMethodAccessorImpl.invoke(DelegatingMethodAccessorImpl.java:25)
    [junit] 	at java.lang.reflect.Method.invoke(Method.java:597)
    [junit] 	at junit.framework.TestCase.runTest(TestCase.java:154)
    [junit] 	at junit.framework.TestCase.runBare(TestCase.java:127)
    [junit] 	at junit.framework.TestResult$1.protect(TestResult.java:106)
    [junit] 	at junit.framework.TestResult.runProtected(TestResult.java:124)
    [junit] 	at junit.framework.TestResult.run(TestResult.java:109)
    [junit] 	at junit.framework.TestCase.run(TestCase.java:118)
    [junit] 	at junit.framework.TestSuite.runTest(TestSuite.java:208)
    [junit] 	at junit.framework.TestSuite.run(TestSuite.java:203)
    [junit] 	at org.apache.tools.ant.taskdefs.optional.junit.JUnitTestRunner.run(JUnitTestRunner.java:422)
    [junit] 	at org.apache.tools.ant.taskdefs.optional.junit.JUnitTestRunner.launch(JUnitTestRunner.java:931)
    [junit] 	at org.apache.tools.ant.taskdefs.optional.junit.JUnitTestRunner.main(JUnitTestRunner.java:785)
    [junit] Caused by: java.lang.ClassNotFoundException: org.apache.click.ConfigServiceTest$MyPageInterceptor
    [junit] 	at java.net.URLClassLoader$1.run(URLClassLoader.java:202)
    [junit] 	at java.security.AccessController.doPrivileged(Native Method)
    [junit] 	at java.net.URLClassLoader.findClass(URLClassLoader.java:190)
    [junit] 	at java.lang.ClassLoader.loadClass(ClassLoader.java:307)
    [junit] 	at sun.misc.Launcher$AppClassLoader.loadClass(Launcher.java:301)
    [junit] 	at java.lang.ClassLoader.loadClass(ClassLoader.java:248)
    [junit] 	at java.lang.Class.forName0(Native Method)
    [junit] 	at java.lang.Class.forName(Class.java:247)
    [junit] 	at org.apache.click.util.ClickUtils.classForName(ClickUtils.java:540)
    [junit] 	at org.apache.click.service.XmlConfigService.loadPageInterceptors(XmlConfigService.java:1622)
    [junit] 	at org.apache.click.service.XmlConfigService.onInit(XmlConfigService.java:276)
    [junit] 	at org.apache.click.ClickServlet.initConfigService(ClickServlet.java:1982)
    [junit] 	... 20 more
    [junit] java.lang.RuntimeException: java.lang.ClassNotFoundException: org.apache.click.ConfigServiceTest$MyPageInterceptor
    [junit] 	at org.apache.click.ClickServlet.initConfigService(ClickServlet.java:1989)
    [junit] 	at org.apache.click.ClickServlet.init(ClickServlet.java:197)
    [junit] 	at javax.servlet.GenericServlet.init(GenericServlet.java:258)
    [junit] 	at org.apache.click.MockContainer.configure(MockContainer.java:686)
    [junit] 	at org.apache.click.MockContainer.start(MockContainer.java:308)
    [junit] 	at org.apache.click.service.XmlConfigServiceTest.testPageInterceptors(XmlConfigServiceTest.java:592)
    [junit] 	at sun.reflect.NativeMethodAccessorImpl.invoke0(Native Method)
    [junit] 	at sun.reflect.NativeMethodAccessorImpl.invoke(NativeMethodAccessorImpl.java:39)
    [junit] 	at sun.reflect.DelegatingMethodAccessorImpl.invoke(DelegatingMethodAccessorImpl.java:25)
    [junit] 	at java.lang.reflect.Method.invoke(Method.java:597)
    [junit] 	at junit.framework.TestCase.runTest(TestCase.java:154)
    [junit] 	at junit.framework.TestCase.runBare(TestCase.java:127)
    [junit] 	at junit.framework.TestResult$1.protect(TestResult.java:106)
    [junit] 	at junit.framework.TestResult.runProtected(TestResult.java:124)
    [junit] 	at junit.framework.TestResult.run(TestResult.java:109)
    [junit] 	at junit.framework.TestCase.run(TestCase.java:118)
    [junit] 	at junit.framework.TestSuite.runTest(TestSuite.java:208)
    [junit] 	at junit.framework.TestSuite.run(TestSuite.java:203)
    [junit] 	at org.apache.tools.ant.taskdefs.optional.junit.JUnitTestRunner.run(JUnitTestRunner.java:422)
    [junit] 	at org.apache.tools.ant.taskdefs.optional.junit.JUnitTestRunner.launch(JUnitTestRunner.java:931)
    [junit] 	at org.apache.tools.ant.taskdefs.optional.junit.JUnitTestRunner.main(JUnitTestRunner.java:785)
    [junit] Caused by: java.lang.ClassNotFoundException: org.apache.click.ConfigServiceTest$MyPageInterceptor
    [junit] 	at java.net.URLClassLoader$1.run(URLClassLoader.java:202)
    [junit] 	at java.security.AccessController.doPrivileged(Native Method)
    [junit] 	at java.net.URLClassLoader.findClass(URLClassLoader.java:190)
    [junit] 	at java.lang.ClassLoader.loadClass(ClassLoader.java:307)
    [junit] 	at sun.misc.Launcher$AppClassLoader.loadClass(Launcher.java:301)
    [junit] 	at java.lang.ClassLoader.loadClass(ClassLoader.java:248)
    [junit] 	at java.lang.Class.forName0(Native Method)
    [junit] 	at java.lang.Class.forName(Class.java:247)
    [junit] 	at org.apache.click.util.ClickUtils.classForName(ClickUtils.java:540)
    [junit] 	at org.apache.click.service.XmlConfigService.loadPageInterceptors(XmlConfigService.java:1622)
    [junit] 	at org.apache.click.service.XmlConfigService.onInit(XmlConfigService.java:276)
    [junit] 	at org.apache.click.ClickServlet.initConfigService(ClickServlet.java:1982)
    [junit] 	... 20 more
    [junit] click-servlet: error while initializing Click servlet; throwing javax.servlet.UnavailableException
    [junit]     WEB root directory defined at -> /tmp/click1204168952339562499
    [junit]     WEB temp directory defined at -> /tmp/click-temp
    [junit] click-servlet: init
    [junit] [Click] [info ] ***  Initializing Click 2.3.0-M1 in development mode  ***
    [junit] [Click] [info ] initialized LogService: org.apache.click.service.ConsoleLogService
    [junit] click-servlet: error while initializing Click servlet; throwing javax.servlet.UnavailableException
    [junit]     WEB root directory defined at -> /tmp/click4143162806653413714
    [junit]     WEB temp directory defined at -> /tmp/click-temp
    [junit] click-servlet: init
    [junit] [Click] [info ] ***  Initializing Click 2.3.0-M1 in development mode  ***
    [junit] [Click] [info ] initialized LogService: org.apache.click.service.ConsoleLogService
    [junit] click-servlet: error while initializing Click servlet; throwing javax.servlet.UnavailableException
    [junit] Deleting temporary directory '/tmp/click-temp'

BUILD FAILED
<http://hudson.zones.apache.org/hudson/job/Click/ws/click/build/build.xml>:734: Test
org.apache.click.service.XmlConfigServiceTest failed

Total time: 53 seconds
Publishing Javadoc


Mime
View raw message