clerezza-commits mailing list archives

Site index · List index
Message view « Date » · « Thread »
Top « Date » · « Thread »
From Apache Jenkins Server <jenk...@builds.apache.org>
Subject Build failed in Jenkins: clerezza-site #597
Date Wed, 18 May 2016 07:09:38 GMT
See <https://builds.apache.org/job/clerezza-site/597/changes>

Changes:

[hasan] CLEREZZA-1007: Updated download page

------------------------------------------
[...truncated 43 lines...]
[INFO]                                                                         
[INFO] ------------------------------------------------------------------------
[INFO] Building Clerezza - Parent for all 8-SNAPSHOT
[INFO] ------------------------------------------------------------------------
Downloading: http://repo.maven.apache.org/maven2/org/apache/clerezza/maven-pladoc-plugin.core/maven-metadata.xml
Downloaded: http://repo.maven.apache.org/maven2/org/apache/clerezza/maven-pladoc-plugin.core/maven-metadata.xml
(377 B at 16.0 KB/sec)
Downloading: http://repo.maven.apache.org/maven2/org/apache/clerezza/maven-pladoc-plugin.core/0.3-incubating/maven-pladoc-plugin.core-0.3-incubating.pom
Downloaded: http://repo.maven.apache.org/maven2/org/apache/clerezza/maven-pladoc-plugin.core/0.3-incubating/maven-pladoc-plugin.core-0.3-incubating.pom
(5 KB at 17.8 KB/sec)
Downloading: http://repo.maven.apache.org/maven2/org/apache/clerezza/maven-pladoc-plugin/0.3-incubating/maven-pladoc-plugin-0.3-incubating.pom
Downloaded: http://repo.maven.apache.org/maven2/org/apache/clerezza/maven-pladoc-plugin/0.3-incubating/maven-pladoc-plugin-0.3-incubating.pom
(2 KB at 11.9 KB/sec)
Downloading: http://repo.maven.apache.org/maven2/org/apache/clerezza/clerezza/0.2-incubating/clerezza-0.2-incubating.pom
Downloaded: http://repo.maven.apache.org/maven2/org/apache/clerezza/clerezza/0.2-incubating/clerezza-0.2-incubating.pom
(48 KB at 1838.2 KB/sec)
Downloading: http://repo.maven.apache.org/maven2/org/apache/clerezza/maven-pladoc-plugin.core/0.3-incubating/maven-pladoc-plugin.core-0.3-incubating.jar
Downloaded: http://repo.maven.apache.org/maven2/org/apache/clerezza/maven-pladoc-plugin.core/0.3-incubating/maven-pladoc-plugin.core-0.3-incubating.jar
(19 KB at 86.1 KB/sec)
Downloading: http://repo.maven.apache.org/maven2/org/apache/maven/plugins/maven-site-plugin/2.2/maven-site-plugin-2.2.pom
Downloaded: http://repo.maven.apache.org/maven2/org/apache/maven/plugins/maven-site-plugin/2.2/maven-site-plugin-2.2.pom
(15 KB at 627.5 KB/sec)
Downloading: http://repo.maven.apache.org/maven2/org/apache/maven/plugins/maven-plugins/18/maven-plugins-18.pom
Downloaded: http://repo.maven.apache.org/maven2/org/apache/maven/plugins/maven-plugins/18/maven-plugins-18.pom
(13 KB at 325.5 KB/sec)
Downloading: http://repo.maven.apache.org/maven2/org/apache/maven/plugins/maven-site-plugin/2.2/maven-site-plugin-2.2.jar
Downloaded: http://repo.maven.apache.org/maven2/org/apache/maven/plugins/maven-site-plugin/2.2/maven-site-plugin-2.2.jar
(96 KB at 2817.3 KB/sec)
Downloading: http://repo.maven.apache.org/maven2/org/apache/maven/plugins/maven-source-plugin/2.1.1/maven-source-plugin-2.1.1.pom
Downloaded: http://repo.maven.apache.org/maven2/org/apache/maven/plugins/maven-source-plugin/2.1.1/maven-source-plugin-2.1.1.pom
(5 KB at 222.9 KB/sec)
Downloading: http://repo.maven.apache.org/maven2/org/apache/maven/plugins/maven-plugins/14/maven-plugins-14.pom
Downloaded: http://repo.maven.apache.org/maven2/org/apache/maven/plugins/maven-plugins/14/maven-plugins-14.pom
(13 KB at 583.0 KB/sec)
Downloading: http://repo.maven.apache.org/maven2/org/apache/maven/plugins/maven-source-plugin/2.1.1/maven-source-plugin-2.1.1.jar
Downloaded: http://repo.maven.apache.org/maven2/org/apache/maven/plugins/maven-source-plugin/2.1.1/maven-source-plugin-2.1.1.jar
(24 KB at 754.6 KB/sec)
Downloading: http://repo.maven.apache.org/maven2/org/apache/maven/plugins/maven-install-plugin/2.3/maven-install-plugin-2.3.pom
Downloaded: http://repo.maven.apache.org/maven2/org/apache/maven/plugins/maven-install-plugin/2.3/maven-install-plugin-2.3.pom
(5 KB at 233.3 KB/sec)
Downloading: http://repo.maven.apache.org/maven2/org/apache/maven/plugins/maven-plugins/13/maven-plugins-13.pom
Downloaded: http://repo.maven.apache.org/maven2/org/apache/maven/plugins/maven-plugins/13/maven-plugins-13.pom
(12 KB at 523.1 KB/sec)
Downloading: http://repo.maven.apache.org/maven2/org/apache/maven/plugins/maven-install-plugin/2.3/maven-install-plugin-2.3.jar
Downloaded: http://repo.maven.apache.org/maven2/org/apache/maven/plugins/maven-install-plugin/2.3/maven-install-plugin-2.3.jar
(23 KB at 965.2 KB/sec)
[INFO] 
[INFO] --- maven-remote-resources-plugin:1.5:process (default) @ clerezza ---
[WARNING] Failed to getClass for org.apache.maven.plugin.source.SourceJarMojo
[INFO] 
[INFO] --- maven-source-plugin:2.1.1:jar (default) @ clerezza ---
Downloading: http://repo.maven.apache.org/maven2/org/apache/maven/maven-archiver/2.4/maven-archiver-2.4.pom
Downloaded: http://repo.maven.apache.org/maven2/org/apache/maven/maven-archiver/2.4/maven-archiver-2.4.pom
(4 KB at 159.6 KB/sec)
Downloading: http://repo.maven.apache.org/maven2/org/codehaus/plexus/plexus-archiver/1.0-alpha-11/plexus-archiver-1.0-alpha-11.pom
Downloaded: http://repo.maven.apache.org/maven2/org/codehaus/plexus/plexus-archiver/1.0-alpha-11/plexus-archiver-1.0-alpha-11.pom
(2 KB at 83.8 KB/sec)
Downloading: http://repo.maven.apache.org/maven2/org/codehaus/plexus/plexus-container-default/1.0-alpha-15/plexus-container-default-1.0-alpha-15.pom
Downloaded: http://repo.maven.apache.org/maven2/org/codehaus/plexus/plexus-container-default/1.0-alpha-15/plexus-container-default-1.0-alpha-15.pom
(2 KB at 59.6 KB/sec)
Downloading: http://repo.maven.apache.org/maven2/org/codehaus/plexus/plexus-containers/1.0-alpha-15/plexus-containers-1.0-alpha-15.pom
Downloaded: http://repo.maven.apache.org/maven2/org/codehaus/plexus/plexus-containers/1.0-alpha-15/plexus-containers-1.0-alpha-15.pom
(2 KB at 87.9 KB/sec)
Downloading: http://repo.maven.apache.org/maven2/org/codehaus/plexus/plexus-component-api/1.0-alpha-15/plexus-component-api-1.0-alpha-15.pom
Downloaded: http://repo.maven.apache.org/maven2/org/codehaus/plexus/plexus-component-api/1.0-alpha-15/plexus-component-api-1.0-alpha-15.pom
(948 B at 46.3 KB/sec)
Downloading: http://repo.maven.apache.org/maven2/org/codehaus/plexus/plexus-classworlds/1.2-alpha-6/plexus-classworlds-1.2-alpha-6.pom
Downloaded: http://repo.maven.apache.org/maven2/org/codehaus/plexus/plexus-classworlds/1.2-alpha-6/plexus-classworlds-1.2-alpha-6.pom
(3 KB at 115.8 KB/sec)
Downloading: http://repo.maven.apache.org/maven2/org/codehaus/plexus/plexus-io/1.0-alpha-3/plexus-io-1.0-alpha-3.pom
Downloaded: http://repo.maven.apache.org/maven2/org/codehaus/plexus/plexus-io/1.0-alpha-3/plexus-io-1.0-alpha-3.pom
(2 KB at 65.5 KB/sec)
Downloading: http://repo.maven.apache.org/maven2/org/codehaus/plexus/plexus-component-api/1.0-alpha-16/plexus-component-api-1.0-alpha-16.pom
Downloaded: http://repo.maven.apache.org/maven2/org/codehaus/plexus/plexus-component-api/1.0-alpha-16/plexus-component-api-1.0-alpha-16.pom
(3 KB at 98.3 KB/sec)
Downloading: http://repo.maven.apache.org/maven2/org/codehaus/plexus/plexus-containers/1.0-alpha-16/plexus-containers-1.0-alpha-16.pom
Downloaded: http://repo.maven.apache.org/maven2/org/codehaus/plexus/plexus-containers/1.0-alpha-16/plexus-containers-1.0-alpha-16.pom
(2 KB at 87.7 KB/sec)
Downloading: http://repo.maven.apache.org/maven2/org/codehaus/plexus/plexus-interpolation/1.6/plexus-interpolation-1.6.pom
Downloaded: http://repo.maven.apache.org/maven2/org/codehaus/plexus/plexus-interpolation/1.6/plexus-interpolation-1.6.pom
(3 KB at 135.2 KB/sec)
Downloading: http://repo.maven.apache.org/maven2/org/codehaus/plexus/plexus-archiver/1.0-alpha-9/plexus-archiver-1.0-alpha-9.pom
Downloaded: http://repo.maven.apache.org/maven2/org/codehaus/plexus/plexus-archiver/1.0-alpha-9/plexus-archiver-1.0-alpha-9.pom
(2 KB at 87.8 KB/sec)
Downloading: http://repo.maven.apache.org/maven2/org/codehaus/plexus/plexus-io/1.0-alpha-1/plexus-io-1.0-alpha-1.pom
Downloaded: http://repo.maven.apache.org/maven2/org/codehaus/plexus/plexus-io/1.0-alpha-1/plexus-io-1.0-alpha-1.pom
(2 KB at 66.1 KB/sec)
Downloading: http://repo.maven.apache.org/maven2/org/apache/maven/maven-archiver/2.4/maven-archiver-2.4.jar
Downloading: http://repo.maven.apache.org/maven2/org/codehaus/plexus/plexus-interpolation/1.6/plexus-interpolation-1.6.jar
Downloading: http://repo.maven.apache.org/maven2/org/codehaus/plexus/plexus-archiver/1.0-alpha-9/plexus-archiver-1.0-alpha-9.jar
Downloading: http://repo.maven.apache.org/maven2/org/codehaus/plexus/plexus-io/1.0-alpha-1/plexus-io-1.0-alpha-1.jar
Downloaded: http://repo.maven.apache.org/maven2/org/codehaus/plexus/plexus-interpolation/1.6/plexus-interpolation-1.6.jar
(50 KB at 1423.2 KB/sec)
Downloaded: http://repo.maven.apache.org/maven2/org/codehaus/plexus/plexus-io/1.0-alpha-1/plexus-io-1.0-alpha-1.jar
(12 KB at 411.8 KB/sec)
Downloaded: http://repo.maven.apache.org/maven2/org/apache/maven/maven-archiver/2.4/maven-archiver-2.4.jar
(20 KB at 491.3 KB/sec)
Downloaded: http://repo.maven.apache.org/maven2/org/codehaus/plexus/plexus-archiver/1.0-alpha-9/plexus-archiver-1.0-alpha-9.jar
(154 KB at 2949.8 KB/sec)
[INFO] 
[INFO] --- maven-site-plugin:2.2:attach-descriptor (attach-descriptor) @ clerezza ---
Downloading: http://repo.maven.apache.org/maven2/org/apache/maven/doxia/doxia-module-apt/1.1.4/doxia-module-apt-1.1.4.pom
Downloaded: http://repo.maven.apache.org/maven2/org/apache/maven/doxia/doxia-module-apt/1.1.4/doxia-module-apt-1.1.4.pom
(3 KB at 109.1 KB/sec)
Downloading: http://repo.maven.apache.org/maven2/org/apache/maven/doxia/doxia-module-xdoc/1.1.4/doxia-module-xdoc-1.1.4.pom
Downloaded: http://repo.maven.apache.org/maven2/org/apache/maven/doxia/doxia-module-xdoc/1.1.4/doxia-module-xdoc-1.1.4.pom
(6 KB at 197.9 KB/sec)
Downloading: http://repo.maven.apache.org/maven2/org/apache/maven/shared/maven-doxia-tools/1.3/maven-doxia-tools-1.3.pom
Downloaded: http://repo.maven.apache.org/maven2/org/apache/maven/shared/maven-doxia-tools/1.3/maven-doxia-tools-1.3.pom
(7 KB at 216.2 KB/sec)
Downloading: http://repo.maven.apache.org/maven2/org/apache/maven/wagon/wagon-provider-api/1.0-beta-4/wagon-provider-api-1.0-beta-4.pom
Downloaded: http://repo.maven.apache.org/maven2/org/apache/maven/wagon/wagon-provider-api/1.0-beta-4/wagon-provider-api-1.0-beta-4.pom
(906 B at 42.1 KB/sec)
Downloading: http://repo.maven.apache.org/maven2/org/apache/maven/wagon/wagon/1.0-beta-4/wagon-1.0-beta-4.pom
Downloaded: http://repo.maven.apache.org/maven2/org/apache/maven/wagon/wagon/1.0-beta-4/wagon-1.0-beta-4.pom
(11 KB at 487.5 KB/sec)
Downloading: http://repo.maven.apache.org/maven2/org/mortbay/jetty/jetty/6.1.5/jetty-6.1.5.pom
Downloaded: http://repo.maven.apache.org/maven2/org/mortbay/jetty/jetty/6.1.5/jetty-6.1.5.pom
(5 KB at 201.6 KB/sec)
Downloading: http://repo.maven.apache.org/maven2/org/mortbay/jetty/project/6.1.5/project-6.1.5.pom
Downloaded: http://repo.maven.apache.org/maven2/org/mortbay/jetty/project/6.1.5/project-6.1.5.pom
(13 KB at 637.9 KB/sec)
Downloading: http://repo.maven.apache.org/maven2/org/mortbay/jetty/jetty-util/6.1.5/jetty-util-6.1.5.pom
Downloaded: http://repo.maven.apache.org/maven2/org/mortbay/jetty/jetty-util/6.1.5/jetty-util-6.1.5.pom
(4 KB at 139.5 KB/sec)
Downloading: http://repo.maven.apache.org/maven2/org/mortbay/jetty/servlet-api-2.5/6.1.5/servlet-api-2.5-6.1.5.pom
Downloaded: http://repo.maven.apache.org/maven2/org/mortbay/jetty/servlet-api-2.5/6.1.5/servlet-api-2.5-6.1.5.pom
(4 KB at 196.6 KB/sec)
Downloading: http://repo.maven.apache.org/maven2/org/apache/maven/doxia/doxia-sink-api/1.1.4/doxia-sink-api-1.1.4.jar
Downloading: http://repo.maven.apache.org/maven2/org/apache/maven/doxia/doxia-logging-api/1.1.4/doxia-logging-api-1.1.4.jar
Downloading: http://repo.maven.apache.org/maven2/org/apache/maven/doxia/doxia-module-apt/1.1.4/doxia-module-apt-1.1.4.jar
Downloading: http://repo.maven.apache.org/maven2/org/apache/maven/shared/maven-doxia-tools/1.3/maven-doxia-tools-1.3.jar
Downloading: http://repo.maven.apache.org/maven2/org/apache/maven/doxia/doxia-module-xdoc/1.1.4/doxia-module-xdoc-1.1.4.jar
Downloaded: http://repo.maven.apache.org/maven2/org/apache/maven/doxia/doxia-logging-api/1.1.4/doxia-logging-api-1.1.4.jar
(12 KB at 481.3 KB/sec)
Downloading: http://repo.maven.apache.org/maven2/org/mortbay/jetty/jetty/6.1.5/jetty-6.1.5.jar
Downloaded: http://repo.maven.apache.org/maven2/org/apache/maven/doxia/doxia-sink-api/1.1.4/doxia-sink-api-1.1.4.jar
(13 KB at 495.5 KB/sec)
Downloading: http://repo.maven.apache.org/maven2/org/mortbay/jetty/jetty-util/6.1.5/jetty-util-6.1.5.jar
Downloaded: http://repo.maven.apache.org/maven2/org/apache/maven/doxia/doxia-module-apt/1.1.4/doxia-module-apt-1.1.4.jar
(51 KB at 1407.3 KB/sec)
Downloaded: http://repo.maven.apache.org/maven2/org/apache/maven/doxia/doxia-module-xdoc/1.1.4/doxia-module-xdoc-1.1.4.jar
(36 KB at 984.7 KB/sec)
Downloaded: http://repo.maven.apache.org/maven2/org/apache/maven/shared/maven-doxia-tools/1.3/maven-doxia-tools-1.3.jar
(44 KB at 1236.3 KB/sec)
Downloading: http://repo.maven.apache.org/maven2/org/mortbay/jetty/servlet-api-2.5/6.1.5/servlet-api-2.5-6.1.5.jar
Downloaded: http://repo.maven.apache.org/maven2/org/mortbay/jetty/jetty-util/6.1.5/jetty-util-6.1.5.jar
(135 KB at 5173.9 KB/sec)
Downloaded: http://repo.maven.apache.org/maven2/org/mortbay/jetty/jetty/6.1.5/jetty-6.1.5.jar
(475 KB at 13180.6 KB/sec)
Downloaded: http://repo.maven.apache.org/maven2/org/mortbay/jetty/servlet-api-2.5/6.1.5/servlet-api-2.5-6.1.5.jar
(130 KB at 4622.2 KB/sec)
[INFO] 
[INFO] --- maven-install-plugin:2.3:install (default-install) @ clerezza ---
[INFO] Installing <https://builds.apache.org/job/clerezza-site/ws/parent/pom.xml> to
/home/jenkins/jenkins-slave/maven-repositories/0/org/apache/clerezza/clerezza/8-SNAPSHOT/clerezza-8-SNAPSHOT.pom
[INFO] 
[INFO] --- maven-site-plugin:2.2:site (default-site) @ clerezza ---
[WARNING] Error injecting: org.apache.maven.plugins.site.SiteMojo
java.lang.NoClassDefFoundError: org/apache/maven/doxia/sink/render/RenderingContext
	at java.lang.Class.getDeclaredConstructors0(Native Method)
	at java.lang.Class.privateGetDeclaredConstructors(Class.java:2595)
	at java.lang.Class.getDeclaredConstructors(Class.java:1914)
	at com.google.inject.spi.InjectionPoint.forConstructorOf(InjectionPoint.java:245)
	at com.google.inject.internal.ConstructorBindingImpl.create(ConstructorBindingImpl.java:98)
	at com.google.inject.internal.InjectorImpl.createUninitializedBinding(InjectorImpl.java:629)
	at com.google.inject.internal.InjectorImpl.createJustInTimeBinding(InjectorImpl.java:831)
	at com.google.inject.internal.InjectorImpl.createJustInTimeBindingRecursive(InjectorImpl.java:758)
	at com.google.inject.internal.InjectorImpl.getJustInTimeBinding(InjectorImpl.java:255)
	at com.google.inject.internal.InjectorImpl.getBindingOrThrow(InjectorImpl.java:204)
	at com.google.inject.internal.InjectorImpl.getProviderOrThrow(InjectorImpl.java:954)
	at com.google.inject.internal.InjectorImpl.getProvider(InjectorImpl.java:987)
	at com.google.inject.internal.InjectorImpl.getProvider(InjectorImpl.java:950)
	at com.google.inject.internal.InjectorImpl.getInstance(InjectorImpl.java:1000)
	at org.sonatype.guice.bean.reflect.AbstractDeferredClass.get(AbstractDeferredClass.java:45)
	at com.google.inject.internal.ProviderInternalFactory.provision(ProviderInternalFactory.java:84)
	at com.google.inject.internal.InternalFactoryToInitializableAdapter.provision(InternalFactoryToInitializableAdapter.java:52)
	at com.google.inject.internal.ProviderInternalFactory$1.call(ProviderInternalFactory.java:70)
	at com.google.inject.internal.ProvisionListenerStackCallback$Provision.provision(ProvisionListenerStackCallback.java:100)
	at org.sonatype.guice.plexus.lifecycles.PlexusLifecycleManager.onProvision(PlexusLifecycleManager.java:138)
	at com.google.inject.internal.ProvisionListenerStackCallback$Provision.provision(ProvisionListenerStackCallback.java:108)
	at com.google.inject.internal.ProvisionListenerStackCallback.provision(ProvisionListenerStackCallback.java:55)
	at com.google.inject.internal.ProviderInternalFactory.circularGet(ProviderInternalFactory.java:68)
	at com.google.inject.internal.InternalFactoryToInitializableAdapter.get(InternalFactoryToInitializableAdapter.java:45)
	at com.google.inject.internal.InjectorImpl$3$1.call(InjectorImpl.java:965)
	at com.google.inject.internal.InjectorImpl.callInContext(InjectorImpl.java:1011)
	at com.google.inject.internal.InjectorImpl$3.get(InjectorImpl.java:961)
	at com.google.inject.Scopes$1$1.get(Scopes.java:59)
	at org.sonatype.guice.bean.locators.LazyBeanEntry.getValue(LazyBeanEntry.java:83)
	at org.sonatype.guice.plexus.locators.LazyPlexusBean.getValue(LazyPlexusBean.java:49)
	at org.codehaus.plexus.DefaultPlexusContainer.lookup(DefaultPlexusContainer.java:253)
	at org.codehaus.plexus.DefaultPlexusContainer.lookup(DefaultPlexusContainer.java:245)
	at org.apache.maven.plugin.internal.DefaultMavenPluginManager.getConfiguredMojo(DefaultMavenPluginManager.java:455)
	at org.apache.maven.plugin.DefaultBuildPluginManager.executeMojo(DefaultBuildPluginManager.java:92)
	at org.apache.maven.lifecycle.internal.MojoExecutor.execute(MojoExecutor.java:209)
	at org.apache.maven.lifecycle.internal.MojoExecutor.execute(MojoExecutor.java:153)
	at org.apache.maven.lifecycle.internal.MojoExecutor.execute(MojoExecutor.java:145)
	at org.apache.maven.lifecycle.internal.LifecycleModuleBuilder.buildProject(LifecycleModuleBuilder.java:84)
	at org.apache.maven.lifecycle.internal.LifecycleModuleBuilder.buildProject(LifecycleModuleBuilder.java:59)
	at org.apache.maven.lifecycle.internal.LifecycleStarter.singleThreadedBuild(LifecycleStarter.java:183)
	at org.apache.maven.lifecycle.internal.LifecycleStarter.execute(LifecycleStarter.java:161)
	at org.apache.maven.DefaultMaven.doExecute(DefaultMaven.java:320)
	at org.apache.maven.DefaultMaven.execute(DefaultMaven.java:156)
	at org.jvnet.hudson.maven3.launcher.Maven3Launcher.main(Maven3Launcher.java:117)
	at sun.reflect.NativeMethodAccessorImpl.invoke0(Native Method)
	at sun.reflect.NativeMethodAccessorImpl.invoke(NativeMethodAccessorImpl.java:57)
	at sun.reflect.DelegatingMethodAccessorImpl.invoke(DelegatingMethodAccessorImpl.java:43)
	at java.lang.reflect.Method.invoke(Method.java:606)
	at org.codehaus.plexus.classworlds.launcher.Launcher.launchStandard(Launcher.java:329)
	at org.codehaus.plexus.classworlds.launcher.Launcher.launch(Launcher.java:239)
	at org.jvnet.hudson.maven3.agent.Maven3Main.launch(Maven3Main.java:181)
	at sun.reflect.NativeMethodAccessorImpl.invoke0(Native Method)
	at sun.reflect.NativeMethodAccessorImpl.invoke(NativeMethodAccessorImpl.java:57)
	at sun.reflect.DelegatingMethodAccessorImpl.invoke(DelegatingMethodAccessorImpl.java:43)
	at java.lang.reflect.Method.invoke(Method.java:606)
	at hudson.maven.Maven3Builder.call(Maven3Builder.java:136)
	at hudson.maven.Maven3Builder.call(Maven3Builder.java:71)
	at hudson.remoting.UserRequest.perform(UserRequest.java:120)
	at hudson.remoting.UserRequest.perform(UserRequest.java:48)
	at hudson.remoting.Request$2.run(Request.java:326)
	at hudson.remoting.InterceptingExecutorService$1.call(InterceptingExecutorService.java:68)
	at java.util.concurrent.FutureTask.run(FutureTask.java:262)
	at java.util.concurrent.ThreadPoolExecutor.runWorker(ThreadPoolExecutor.java:1145)
	at java.util.concurrent.ThreadPoolExecutor$Worker.run(ThreadPoolExecutor.java:615)
	at java.lang.Thread.run(Thread.java:745)
Caused by: java.lang.ClassNotFoundException: org.apache.maven.doxia.sink.render.RenderingContext
	at org.codehaus.plexus.classworlds.strategy.SelfFirstStrategy.loadClass(SelfFirstStrategy.java:50)
	at org.codehaus.plexus.classworlds.realm.ClassRealm.loadClass(ClassRealm.java:244)
	at org.codehaus.plexus.classworlds.realm.ClassRealm.loadClass(ClassRealm.java:230)
	... 65 more
[INFO] ------------------------------------------------------------------------
[INFO] BUILD FAILURE
[INFO] ------------------------------------------------------------------------
[INFO] Total time: 17.139s
[INFO] Finished at: Wed May 18 07:09:20 UTC 2016
[INFO] Final Memory: 17M/92M
[INFO] ------------------------------------------------------------------------
[WARNING] The requested profile "site-build" could not be activated because it does not exist.
Waiting for Jenkins to finish collecting data
[ERROR] Failed to execute goal org.apache.maven.plugins:maven-site-plugin:2.2:site (default-site)
on project clerezza: Execution default-site of goal org.apache.maven.plugins:maven-site-plugin:2.2:site
failed: A required class was missing while executing org.apache.maven.plugins:maven-site-plugin:2.2:site:
org/apache/maven/doxia/sink/render/RenderingContext
[ERROR] -----------------------------------------------------
[ERROR] realm =    plugin>org.apache.maven.plugins:maven-site-plugin:2.2
[ERROR] strategy = org.codehaus.plexus.classworlds.strategy.SelfFirstStrategy
[ERROR] urls[0] = file:/home/jenkins/jenkins-slave/maven-repositories/0/org/apache/maven/plugins/maven-site-plugin/2.2/maven-site-plugin-2.2.jar
[ERROR] urls[1] = file:/home/jenkins/jenkins-slave/maven-repositories/0/org/apache/maven/maven-archiver/2.5/maven-archiver-2.5.jar
[ERROR] urls[2] = file:/home/jenkins/jenkins-slave/maven-repositories/0/commons-cli/commons-cli/1.0/commons-cli-1.0.jar
[ERROR] urls[3] = file:/home/jenkins/jenkins-slave/maven-repositories/0/org/codehaus/plexus/plexus-interactivity-api/1.0-alpha-4/plexus-interactivity-api-1.0-alpha-4.jar
[ERROR] urls[4] = file:/home/jenkins/jenkins-slave/maven-repositories/0/org/codehaus/plexus/plexus-interpolation/1.15/plexus-interpolation-1.15.jar
[ERROR] urls[5] = file:/home/jenkins/jenkins-slave/maven-repositories/0/org/codehaus/plexus/plexus-archiver/2.4.4/plexus-archiver-2.4.4.jar
[ERROR] urls[6] = file:/home/jenkins/jenkins-slave/maven-repositories/0/org/codehaus/plexus/plexus-io/2.0.10/plexus-io-2.0.10.jar
[ERROR] urls[7] = file:/home/jenkins/jenkins-slave/maven-repositories/0/org/apache/commons/commons-compress/1.5/commons-compress-1.5.jar
[ERROR] urls[8] = file:/home/jenkins/jenkins-slave/maven-repositories/0/org/tukaani/xz/1.2/xz-1.2.jar
[ERROR] urls[9] = file:/home/jenkins/jenkins-slave/maven-repositories/0/org/apache/maven/doxia/doxia-core/1.6/doxia-core-1.6.jar
[ERROR] urls[10] = file:/home/jenkins/jenkins-slave/maven-repositories/0/org/codehaus/plexus/plexus-component-annotations/1.5.5/plexus-component-annotations-1.5.5.jar
[ERROR] urls[11] = file:/home/jenkins/jenkins-slave/maven-repositories/0/commons-lang/commons-lang/2.4/commons-lang-2.4.jar
[ERROR] urls[12] = file:/home/jenkins/jenkins-slave/maven-repositories/0/org/apache/httpcomponents/httpclient/4.0.2/httpclient-4.0.2.jar
[ERROR] urls[13] = file:/home/jenkins/jenkins-slave/maven-repositories/0/commons-logging/commons-logging/1.1.1/commons-logging-1.1.1.jar
[ERROR] urls[14] = file:/home/jenkins/jenkins-slave/maven-repositories/0/commons-codec/commons-codec/1.3/commons-codec-1.3.jar
[ERROR] urls[15] = file:/home/jenkins/jenkins-slave/maven-repositories/0/org/apache/httpcomponents/httpcore/4.0.1/httpcore-4.0.1.jar
[ERROR] urls[16] = file:/home/jenkins/jenkins-slave/maven-repositories/0/xmlunit/xmlunit/1.5/xmlunit-1.5.jar
[ERROR] urls[17] = file:/home/jenkins/jenkins-slave/maven-repositories/0/org/apache/maven/reporting/maven-reporting-api/3.0/maven-reporting-api-3.0.jar
[ERROR] urls[18] = file:/home/jenkins/jenkins-slave/maven-repositories/0/org/apache/maven/doxia/doxia-module-xhtml/1.1.4/doxia-module-xhtml-1.1.4.jar
[ERROR] urls[19] = file:/home/jenkins/jenkins-slave/maven-repositories/0/org/apache/maven/doxia/doxia-sink-api/1.1.4/doxia-sink-api-1.1.4.jar
[ERROR] urls[20] = file:/home/jenkins/jenkins-slave/maven-repositories/0/org/apache/maven/doxia/doxia-logging-api/1.1.4/doxia-logging-api-1.1.4.jar
[ERROR] urls[21] = file:/home/jenkins/jenkins-slave/maven-repositories/0/org/apache/maven/doxia/doxia-module-apt/1.1.4/doxia-module-apt-1.1.4.jar
[ERROR] urls[22] = file:/home/jenkins/jenkins-slave/maven-repositories/0/org/apache/maven/doxia/doxia-module-xdoc/1.1.4/doxia-module-xdoc-1.1.4.jar
[ERROR] urls[23] = file:/home/jenkins/jenkins-slave/maven-repositories/0/org/apache/maven/doxia/doxia-module-fml/1.1.4/doxia-module-fml-1.1.4.jar
[ERROR] urls[24] = file:/home/jenkins/jenkins-slave/maven-repositories/0/org/apache/maven/doxia/doxia-decoration-model/1.1.4/doxia-decoration-model-1.1.4.jar
[ERROR] urls[25] = file:/home/jenkins/jenkins-slave/maven-repositories/0/org/apache/maven/doxia/doxia-site-renderer/1.1.4/doxia-site-renderer-1.1.4.jar
[ERROR] urls[26] = file:/home/jenkins/jenkins-slave/maven-repositories/0/commons-collections/commons-collections/3.2/commons-collections-3.2.jar
[ERROR] urls[27] = file:/home/jenkins/jenkins-slave/maven-repositories/0/org/apache/maven/shared/maven-doxia-tools/1.3/maven-doxia-tools-1.3.jar
[ERROR] urls[28] = file:/home/jenkins/jenkins-slave/maven-repositories/0/commons-io/commons-io/1.4/commons-io-1.4.jar
[ERROR] urls[29] = file:/home/jenkins/jenkins-slave/maven-repositories/0/junit/junit/3.8.1/junit-3.8.1.jar
[ERROR] urls[30] = file:/home/jenkins/jenkins-slave/maven-repositories/0/org/codehaus/plexus/plexus-i18n/1.0-beta-7/plexus-i18n-1.0-beta-7.jar
[ERROR] urls[31] = file:/home/jenkins/jenkins-slave/maven-repositories/0/org/codehaus/plexus/plexus-velocity/1.1.8/plexus-velocity-1.1.8.jar
[ERROR] urls[32] = file:/home/jenkins/jenkins-slave/maven-repositories/0/org/codehaus/plexus/plexus-utils/1.5.10/plexus-utils-1.5.10.jar
[ERROR] urls[33] = file:/home/jenkins/jenkins-slave/maven-repositories/0/org/apache/velocity/velocity/1.5/velocity-1.5.jar
[ERROR] urls[34] = file:/home/jenkins/jenkins-slave/maven-repositories/0/oro/oro/2.0.8/oro-2.0.8.jar
[ERROR] urls[35] = file:/home/jenkins/jenkins-slave/maven-repositories/0/org/mortbay/jetty/jetty/6.1.5/jetty-6.1.5.jar
[ERROR] urls[36] = file:/home/jenkins/jenkins-slave/maven-repositories/0/org/mortbay/jetty/jetty-util/6.1.5/jetty-util-6.1.5.jar
[ERROR] urls[37] = file:/home/jenkins/jenkins-slave/maven-repositories/0/org/mortbay/jetty/servlet-api-2.5/6.1.5/servlet-api-2.5-6.1.5.jar
[ERROR] Number of foreign imports: 1
[ERROR] import: Entry[import  from realm ClassRealm[project>org.apache.clerezza:clerezza:8-SNAPSHOT,
parent: ClassRealm[maven.api, parent: null]]]
[ERROR] 
[ERROR] -----------------------------------------------------: org.apache.maven.doxia.sink.render.RenderingContext
[ERROR] -> [Help 1]
[ERROR] 
[ERROR] To see the full stack trace of the errors, re-run Maven with the -e switch.
[ERROR] Re-run Maven using the -X switch to enable full debug logging.
[ERROR] 
[ERROR] For more information about the errors and possible solutions, please read the following
articles:
[ERROR] [Help 1] http://cwiki.apache.org/confluence/display/MAVEN/PluginContainerException
[JENKINS] Archiving <https://builds.apache.org/job/clerezza-site/ws/parent/pom.xml>
to org.apache.clerezza/clerezza/8-SNAPSHOT/clerezza-8-SNAPSHOT.pom
Sending e-mails to: commits@clerezza.apache.org
[locks-and-latches] Releasing all the locks
[locks-and-latches] All the locks released
channel stopped

Mime
View raw message