clerezza-commits mailing list archives

Site index · List index
Message view « Date » · « Thread »
Top « Date » · « Thread »
From Apache Jenkins Server <jenk...@builds.apache.org>
Subject Build failed in Jenkins: clerezza #1087
Date Mon, 16 Nov 2015 18:31:51 GMT
See <https://builds.apache.org/job/clerezza/1087/changes>

Changes:

[reto] CLEREZZA-1002: removed sl4j-scala-api

------------------------------------------
Started by an SCM change
[EnvInject] - Loading node environment variables.
Building remotely on H10 (Ubuntu ubuntu) in workspace <https://builds.apache.org/job/clerezza/ws/>
Cloning the remote Git repository
Cloning repository https://git-wip-us.apache.org/repos/asf/clerezza.git
 > git init <https://builds.apache.org/job/clerezza/ws/> # timeout=10
Fetching upstream changes from https://git-wip-us.apache.org/repos/asf/clerezza.git
 > git --version # timeout=10
 > git -c core.askpass=true fetch --tags --progress https://git-wip-us.apache.org/repos/asf/clerezza.git
+refs/heads/*:refs/remotes/origin/*
 > git config remote.origin.url https://git-wip-us.apache.org/repos/asf/clerezza.git #
timeout=10
 > git config --add remote.origin.fetch +refs/heads/*:refs/remotes/origin/* # timeout=10
 > git config remote.origin.url https://git-wip-us.apache.org/repos/asf/clerezza.git #
timeout=10
Fetching upstream changes from https://git-wip-us.apache.org/repos/asf/clerezza.git
 > git -c core.askpass=true fetch --tags --progress https://git-wip-us.apache.org/repos/asf/clerezza.git
+refs/heads/*:refs/remotes/origin/*
 > git rev-parse refs/remotes/origin/master^{commit} # timeout=10
 > git rev-parse refs/remotes/origin/origin/master^{commit} # timeout=10
Checking out Revision b3ded2dfc4e8438904f9d2386c74f070bebbadcf (refs/remotes/origin/master)
 > git config core.sparsecheckout # timeout=10
 > git checkout -f b3ded2dfc4e8438904f9d2386c74f070bebbadcf
 > git rev-list 08010df969a586dc485b1f9ce443f19e5d90b390 # timeout=10
[locks-and-latches] Checking to see if we really have the locks
[locks-and-latches] Have all the locks, build can start
Parsing POMs
Downloaded artifact http://repo.maven.apache.org/maven2/org/apache/clerezza/clerezza/7/clerezza-7.pom
Downloaded artifact http://repo.maven.apache.org/maven2/org/apache/clerezza/ssl.keygen/0.6/ssl.keygen-0.6.pom
Downloaded artifact http://repo.maven.apache.org/maven2/org/apache/clerezza/platform.accountcontrolpanel/0.10/platform.accountcontrolpanel-0.10.pom
Downloaded artifact http://repo.maven.apache.org/maven2/org/apache/clerezza/platform.concepts/0.2/platform.concepts-0.2.pom
Downloaded artifact http://repo.maven.apache.org/maven2/org/apache/clerezza/platform.content.representations/0.2/platform.content.representations-0.2.pom
Downloaded artifact http://repo.maven.apache.org/maven2/org/apache/clerezza/platform.curieprefixmanager/0.2/platform.curieprefixmanager-0.2.pom
Downloaded artifact http://repo.maven.apache.org/maven2/org/apache/clerezza/platform.dashboard/0.5/platform.dashboard-0.5.pom
Downloaded artifact http://repo.maven.apache.org/maven2/org/apache/clerezza/platform.language/0.3/platform.language-0.3.pom
Downloaded artifact http://repo.maven.apache.org/maven2/org/apache/clerezza/rdf.cris/0.3/rdf.cris-0.3.pom
Downloaded artifact http://repo.maven.apache.org/maven2/org/apache/clerezza/uima/0.2/uima-0.2.pom
[locks-and-latches] Releasing all the locks
[locks-and-latches] All the locks released
ERROR: Failed to parse POMs
java.io.IOException: remote file operation failed: <https://builds.apache.org/job/clerezza/ws/>
at hudson.remoting.Channel@58dcbc5a:H10: hudson.remoting.ProxyException: hudson.maven.MavenModuleSetBuild$MavenExecutionException:
org.apache.maven.project.ProjectBuildingException: Some problems were encountered while processing
the POMs:
[FATAL] Non-resolvable parent POM: Could not find artifact org.apache.clerezza.ext:bundles-pom:pom:1.0.0-SNAPSHOT
and 'parent.relativePath' points at wrong local POM @ line 24, column 13
[FATAL] Non-resolvable parent POM: Could not find artifact org.apache.clerezza.ext:bundles-pom:pom:1.0.0-SNAPSHOT
and 'parent.relativePath' points at wrong local POM @ line 24, column 13
[FATAL] Non-resolvable parent POM: Could not find artifact org.apache.clerezza.ext:bundles-pom:pom:1.0.0-SNAPSHOT
and 'parent.relativePath' points at wrong local POM @ line 24, column 13
[FATAL] Non-resolvable parent POM: Could not find artifact org.apache.clerezza.ext:bundles-pom:pom:1.0.0-SNAPSHOT
and 'parent.relativePath' points at wrong local POM @ line 24, column 13
[ERROR] Child module <https://builds.apache.org/job/clerezza/ws/slf4j-scala-api> of
<https://builds.apache.org/job/clerezza/ws/pom.xml> does not exist @ 

	at hudson.FilePath.act(FilePath.java:985)
	at hudson.FilePath.act(FilePath.java:967)
	at hudson.maven.MavenModuleSetBuild$MavenModuleSetBuildExecution.parsePoms(MavenModuleSetBuild.java:960)
	at hudson.maven.MavenModuleSetBuild$MavenModuleSetBuildExecution.doRun(MavenModuleSetBuild.java:679)
	at hudson.model.AbstractBuild$AbstractBuildExecution.run(AbstractBuild.java:536)
	at hudson.model.Run.execute(Run.java:1738)
	at hudson.maven.MavenModuleSetBuild.run(MavenModuleSetBuild.java:531)
	at hudson.model.ResourceController.execute(ResourceController.java:98)
	at hudson.model.Executor.run(Executor.java:381)
Caused by: hudson.remoting.ProxyException: hudson.maven.MavenModuleSetBuild$MavenExecutionException:
org.apache.maven.project.ProjectBuildingException: Some problems were encountered while processing
the POMs:
[FATAL] Non-resolvable parent POM: Could not find artifact org.apache.clerezza.ext:bundles-pom:pom:1.0.0-SNAPSHOT
and 'parent.relativePath' points at wrong local POM @ line 24, column 13
[FATAL] Non-resolvable parent POM: Could not find artifact org.apache.clerezza.ext:bundles-pom:pom:1.0.0-SNAPSHOT
and 'parent.relativePath' points at wrong local POM @ line 24, column 13
[FATAL] Non-resolvable parent POM: Could not find artifact org.apache.clerezza.ext:bundles-pom:pom:1.0.0-SNAPSHOT
and 'parent.relativePath' points at wrong local POM @ line 24, column 13
[FATAL] Non-resolvable parent POM: Could not find artifact org.apache.clerezza.ext:bundles-pom:pom:1.0.0-SNAPSHOT
and 'parent.relativePath' points at wrong local POM @ line 24, column 13
[ERROR] Child module <https://builds.apache.org/job/clerezza/ws/slf4j-scala-api> of
<https://builds.apache.org/job/clerezza/ws/pom.xml> does not exist @ 

	at hudson.maven.MavenModuleSetBuild$PomParser.invoke(MavenModuleSetBuild.java:1364)
	at hudson.maven.MavenModuleSetBuild$PomParser.invoke(MavenModuleSetBuild.java:1098)
	at hudson.FilePath$FileCallableWrapper.call(FilePath.java:2688)
	at hudson.remoting.UserRequest.perform(UserRequest.java:121)
	at hudson.remoting.UserRequest.perform(UserRequest.java:49)
	at hudson.remoting.Request$2.run(Request.java:326)
	at hudson.remoting.InterceptingExecutorService$1.call(InterceptingExecutorService.java:68)
	at java.util.concurrent.FutureTask.run(FutureTask.java:262)
	at java.util.concurrent.ThreadPoolExecutor.runWorker(ThreadPoolExecutor.java:1145)
	at java.util.concurrent.ThreadPoolExecutor$Worker.run(ThreadPoolExecutor.java:615)
	at java.lang.Thread.run(Thread.java:745)
	at ......remote call to H10(Native Method)
	at hudson.remoting.Channel.attachCallSiteStackTrace(Channel.java:1413)
	at hudson.remoting.UserResponse.retrieve(UserRequest.java:221)
	at hudson.remoting.Channel.call(Channel.java:778)
	at hudson.FilePath.act(FilePath.java:978)
	... 8 more
Caused by: hudson.remoting.ProxyException: org.apache.maven.project.ProjectBuildingException:
Some problems were encountered while processing the POMs:
[FATAL] Non-resolvable parent POM: Could not find artifact org.apache.clerezza.ext:bundles-pom:pom:1.0.0-SNAPSHOT
and 'parent.relativePath' points at wrong local POM @ line 24, column 13
[FATAL] Non-resolvable parent POM: Could not find artifact org.apache.clerezza.ext:bundles-pom:pom:1.0.0-SNAPSHOT
and 'parent.relativePath' points at wrong local POM @ line 24, column 13
[FATAL] Non-resolvable parent POM: Could not find artifact org.apache.clerezza.ext:bundles-pom:pom:1.0.0-SNAPSHOT
and 'parent.relativePath' points at wrong local POM @ line 24, column 13
[FATAL] Non-resolvable parent POM: Could not find artifact org.apache.clerezza.ext:bundles-pom:pom:1.0.0-SNAPSHOT
and 'parent.relativePath' points at wrong local POM @ line 24, column 13
[ERROR] Child module <https://builds.apache.org/job/clerezza/ws/slf4j-scala-api> of
<https://builds.apache.org/job/clerezza/ws/pom.xml> does not exist @ 

	at org.apache.maven.project.DefaultProjectBuilder.build(DefaultProjectBuilder.java:364)
	at hudson.maven.MavenEmbedder.buildProjects(MavenEmbedder.java:361)
	at hudson.maven.MavenEmbedder.readProjects(MavenEmbedder.java:331)
	at hudson.maven.MavenModuleSetBuild$PomParser.invoke(MavenModuleSetBuild.java:1301)
	at hudson.maven.MavenModuleSetBuild$PomParser.invoke(MavenModuleSetBuild.java:1098)
	at hudson.FilePath$FileCallableWrapper.call(FilePath.java:2688)
	at hudson.remoting.UserRequest.perform(UserRequest.java:121)
	at hudson.remoting.UserRequest.perform(UserRequest.java:49)
	at hudson.remoting.Request$2.run(Request.java:326)
	at hudson.remoting.InterceptingExecutorService$1.call(InterceptingExecutorService.java:68)
	at java.util.concurrent.FutureTask.run(FutureTask.java:262)
	at java.util.concurrent.ThreadPoolExecutor.runWorker(ThreadPoolExecutor.java:1145)
	at java.util.concurrent.ThreadPoolExecutor$Worker.run(ThreadPoolExecutor.java:615)
	at java.lang.Thread.run(Thread.java:745)

Mime
View raw message