clerezza-commits mailing list archives

Site index · List index
Message view « Date » · « Thread »
Top « Date » · « Thread »
From Apache Jenkins Server <jenk...@builds.apache.org>
Subject Build failed in Jenkins: clerezza #1082
Date Sat, 05 Sep 2015 14:28:18 GMT
See <https://builds.apache.org/job/clerezza/1082/changes>

Changes:

[reto] [maven-release-plugin] prepare release 201508-1

[reto] [maven-release-plugin] prepare for next development iteration

------------------------------------------
Started by an SCM change
[EnvInject] - Loading node environment variables.
Building remotely on H11 (Ubuntu ubuntu) in workspace <https://builds.apache.org/job/clerezza/ws/>
 > git rev-parse --is-inside-work-tree # timeout=10
Fetching changes from the remote Git repository
 > git config remote.origin.url https://git-wip-us.apache.org/repos/asf/clerezza.git #
timeout=10
Fetching upstream changes from https://git-wip-us.apache.org/repos/asf/clerezza.git
 > git --version # timeout=10
 > git fetch --tags --progress https://git-wip-us.apache.org/repos/asf/clerezza.git +refs/heads/*:refs/remotes/origin/*
 > git rev-parse refs/remotes/origin/master^{commit} # timeout=10
 > git rev-parse refs/remotes/origin/origin/master^{commit} # timeout=10
Checking out Revision 287849c9db9f63d0617c58f3bd058824586378dd (refs/remotes/origin/master)
 > git config core.sparsecheckout # timeout=10
 > git checkout -f 287849c9db9f63d0617c58f3bd058824586378dd
 > git rev-list 6a6c5f83c0916b6c1f4c2f61e9a6c6458ceb84d6 # timeout=10
[locks-and-latches] Checking to see if we really have the locks
[locks-and-latches] Have all the locks, build can start
Parsing POMs
Downloaded artifact http://repo.maven.apache.org/maven2/org/apache/clerezza/clerezza/7/clerezza-7.pom
Failed to transfer Could not find artifact org.apache.clerezza:rdf.jena.dependencymanagement:pom:1.1.0
in central (http://repo.maven.apache.org/maven2)
[locks-and-latches] Releasing all the locks
[locks-and-latches] All the locks released
ERROR: Failed to parse POMs
java.io.IOException: remote file operation failed: <https://builds.apache.org/job/clerezza/ws/>
at hudson.remoting.Channel@2bb93b41:H11
	at hudson.FilePath.act(FilePath.java:916)
	at hudson.FilePath.act(FilePath.java:893)
	at hudson.maven.MavenModuleSetBuild$MavenModuleSetBuildExecution.parsePoms(MavenModuleSetBuild.java:950)
	at hudson.maven.MavenModuleSetBuild$MavenModuleSetBuildExecution.doRun(MavenModuleSetBuild.java:677)
	at hudson.model.AbstractBuild$AbstractBuildExecution.run(AbstractBuild.java:529)
	at hudson.model.Run.execute(Run.java:1706)
	at hudson.maven.MavenModuleSetBuild.run(MavenModuleSetBuild.java:529)
	at hudson.model.ResourceController.execute(ResourceController.java:88)
	at hudson.model.Executor.run(Executor.java:232)
Caused by: hudson.remoting.ProxyException: hudson.maven.MavenModuleSetBuild$MavenExecutionException:
org.apache.maven.project.ProjectBuildingException: Some problems were encountered while processing
the POMs:
[FATAL] Non-resolvable parent POM: Could not find artifact org.apache.clerezza.ext:bundles-pom:pom:3-SNAPSHOT
and 'parent.relativePath' points at wrong local POM @ line 24, column 13
[FATAL] Non-resolvable parent POM: Could not find artifact org.apache.clerezza.ext:bundles-pom:pom:3-SNAPSHOT
and 'parent.relativePath' points at wrong local POM @ line 24, column 13
[FATAL] Non-resolvable parent POM: Could not find artifact org.apache.clerezza.ext:bundles-pom:pom:3-SNAPSHOT
and 'parent.relativePath' points at wrong local POM @ line 24, column 13
[FATAL] Non-resolvable parent POM: Could not find artifact org.apache.clerezza.ext:bundles-pom:pom:3-SNAPSHOT
and 'parent.relativePath' points at wrong local POM @ line 24, column 13
[WARNING] 'parent.relativePath' of POM org.apache.clerezza.scala:scala:1.0.1-SNAPSHOT (<https://builds.apache.org/job/clerezza/ws/scala-scripting/pom.xml)>
points at org.apache.clerezza:clerezza instead of org.apache:apache, please verify your project
structure @ org.apache.clerezza.scala:scala:1.0.1-SNAPSHOT, <https://builds.apache.org/job/clerezza/ws/scala-scripting/pom.xml,>
line 22, column 13
[WARNING] 'parent.relativePath' of POM org.apache.clerezza.scala:scala:1.0.1-SNAPSHOT (<https://builds.apache.org/job/clerezza/ws/scala-scripting/pom.xml)>
points at org.apache.clerezza:clerezza instead of org.apache:apache, please verify your project
structure @ org.apache.clerezza.scala:scala:1.0.1-SNAPSHOT, <https://builds.apache.org/job/clerezza/ws/scala-scripting/pom.xml,>
line 22, column 13
[WARNING] 'parent.relativePath' points at org.apache.clerezza:clerezza instead of org.apache:apache,
please verify your project structure @ line 22, column 13
[ERROR] Non-resolvable import POM: Could not find artifact org.apache.clerezza:rdf.jena.dependencymanagement:pom:1.1.0
in central (http://repo.maven.apache.org/maven2) @ line 38, column 25
[ERROR] 'dependencies.dependency.version' for org.apache.jena:jena-core:jar is missing. @
line 58, column 21
[ERROR] Non-resolvable import POM: Failure to find org.apache.clerezza:rdf.jena.dependencymanagement:pom:1.1.0
in http://repo.maven.apache.org/maven2 was cached in the local repository, resolution will
not be reattempted until the update interval of central has elapsed or updates are forced
@ line 39, column 25
[ERROR] 'dependencies.dependency.version' for org.apache.jena:jena-core:jar is missing. @
line 68, column 21
[ERROR] Non-resolvable import POM: Failure to find org.apache.clerezza:rdf.jena.dependencymanagement:pom:1.1.0
in http://repo.maven.apache.org/maven2 was cached in the local repository, resolution will
not be reattempted until the update interval of central has elapsed or updates are forced
@ line 38, column 25
[ERROR] 'dependencies.dependency.version' for org.apache.jena:jena-core:jar is missing. @
line 62, column 21
[ERROR] Non-resolvable import POM: Failure to find org.apache.clerezza:rdf.jena.dependencymanagement:pom:1.1.0
in http://repo.maven.apache.org/maven2 was cached in the local repository, resolution will
not be reattempted until the update interval of central has elapsed or updates are forced
@ line 46, column 25
[ERROR] Non-resolvable import POM: Failure to find org.apache.clerezza:rdf.jena.dependencymanagement:pom:1.1.0
in http://repo.maven.apache.org/maven2 was cached in the local repository, resolution will
not be reattempted until the update interval of central has elapsed or updates are forced
@ line 38, column 25
[ERROR] 'dependencies.dependency.version' for org.apache.jena:jena-arq:jar is missing. @ line
71, column 21
[ERROR] Non-resolvable import POM: Failure to find org.apache.clerezza:rdf.jena.dependencymanagement:pom:1.1.0
in http://repo.maven.apache.org/maven2 was cached in the local repository, resolution will
not be reattempted until the update interval of central has elapsed or updates are forced
@ line 38, column 25
[ERROR] Non-resolvable import POM: Failure to find org.apache.clerezza:rdf.jena.dependencymanagement:pom:1.1.0
in http://repo.maven.apache.org/maven2 was cached in the local repository, resolution will
not be reattempted until the update interval of central has elapsed or updates are forced
@ line 44, column 25
[ERROR] 'dependencies.dependency.version' for org.apache.jena:jena-tdb:jar is missing. @ line
92, column 21

	at hudson.maven.MavenModuleSetBuild$PomParser.invoke(MavenModuleSetBuild.java:1354)
	at hudson.maven.MavenModuleSetBuild$PomParser.invoke(MavenModuleSetBuild.java:1088)
	at hudson.FilePath$FileCallableWrapper.call(FilePath.java:2474)
	at hudson.remoting.UserRequest.perform(UserRequest.java:118)
	at hudson.remoting.UserRequest.perform(UserRequest.java:48)
	at hudson.remoting.Request$2.run(Request.java:328)
	at hudson.remoting.InterceptingExecutorService$1.call(InterceptingExecutorService.java:72)
	at java.util.concurrent.FutureTask.run(FutureTask.java:262)
	at java.util.concurrent.ThreadPoolExecutor.runWorker(ThreadPoolExecutor.java:1145)
	at java.util.concurrent.ThreadPoolExecutor$Worker.run(ThreadPoolExecutor.java:615)
	at java.lang.Thread.run(Thread.java:745)
Caused by: hudson.remoting.ProxyException: org.apache.maven.project.ProjectBuildingException:
Some problems were encountered while processing the POMs:
[FATAL] Non-resolvable parent POM: Could not find artifact org.apache.clerezza.ext:bundles-pom:pom:3-SNAPSHOT
and 'parent.relativePath' points at wrong local POM @ line 24, column 13
[FATAL] Non-resolvable parent POM: Could not find artifact org.apache.clerezza.ext:bundles-pom:pom:3-SNAPSHOT
and 'parent.relativePath' points at wrong local POM @ line 24, column 13
[FATAL] Non-resolvable parent POM: Could not find artifact org.apache.clerezza.ext:bundles-pom:pom:3-SNAPSHOT
and 'parent.relativePath' points at wrong local POM @ line 24, column 13
[FATAL] Non-resolvable parent POM: Could not find artifact org.apache.clerezza.ext:bundles-pom:pom:3-SNAPSHOT
and 'parent.relativePath' points at wrong local POM @ line 24, column 13
[WARNING] 'parent.relativePath' of POM org.apache.clerezza.scala:scala:1.0.1-SNAPSHOT (<https://builds.apache.org/job/clerezza/ws/scala-scripting/pom.xml)>
points at org.apache.clerezza:clerezza instead of org.apache:apache, please verify your project
structure @ org.apache.clerezza.scala:scala:1.0.1-SNAPSHOT, <https://builds.apache.org/job/clerezza/ws/scala-scripting/pom.xml,>
line 22, column 13
[WARNING] 'parent.relativePath' of POM org.apache.clerezza.scala:scala:1.0.1-SNAPSHOT (<https://builds.apache.org/job/clerezza/ws/scala-scripting/pom.xml)>
points at org.apache.clerezza:clerezza instead of org.apache:apache, please verify your project
structure @ org.apache.clerezza.scala:scala:1.0.1-SNAPSHOT, <https://builds.apache.org/job/clerezza/ws/scala-scripting/pom.xml,>
line 22, column 13
[WARNING] 'parent.relativePath' points at org.apache.clerezza:clerezza instead of org.apache:apache,
please verify your project structure @ line 22, column 13
[ERROR] Non-resolvable import POM: Could not find artifact org.apache.clerezza:rdf.jena.dependencymanagement:pom:1.1.0
in central (http://repo.maven.apache.org/maven2) @ line 38, column 25
[ERROR] 'dependencies.dependency.version' for org.apache.jena:jena-core:jar is missing. @
line 58, column 21
[ERROR] Non-resolvable import POM: Failure to find org.apache.clerezza:rdf.jena.dependencymanagement:pom:1.1.0
in http://repo.maven.apache.org/maven2 was cached in the local repository, resolution will
not be reattempted until the update interval of central has elapsed or updates are forced
@ line 39, column 25
[ERROR] 'dependencies.dependency.version' for org.apache.jena:jena-core:jar is missing. @
line 68, column 21
[ERROR] Non-resolvable import POM: Failure to find org.apache.clerezza:rdf.jena.dependencymanagement:pom:1.1.0
in http://repo.maven.apache.org/maven2 was cached in the local repository, resolution will
not be reattempted until the update interval of central has elapsed or updates are forced
@ line 38, column 25
[ERROR] 'dependencies.dependency.version' for org.apache.jena:jena-core:jar is missing. @
line 62, column 21
[ERROR] Non-resolvable import POM: Failure to find org.apache.clerezza:rdf.jena.dependencymanagement:pom:1.1.0
in http://repo.maven.apache.org/maven2 was cached in the local repository, resolution will
not be reattempted until the update interval of central has elapsed or updates are forced
@ line 46, column 25
[ERROR] Non-resolvable import POM: Failure to find org.apache.clerezza:rdf.jena.dependencymanagement:pom:1.1.0
in http://repo.maven.apache.org/maven2 was cached in the local repository, resolution will
not be reattempted until the update interval of central has elapsed or updates are forced
@ line 38, column 25
[ERROR] 'dependencies.dependency.version' for org.apache.jena:jena-arq:jar is missing. @ line
71, column 21
[ERROR] Non-resolvable import POM: Failure to find org.apache.clerezza:rdf.jena.dependencymanagement:pom:1.1.0
in http://repo.maven.apache.org/maven2 was cached in the local repository, resolution will
not be reattempted until the update interval of central has elapsed or updates are forced
@ line 38, column 25
[ERROR] Non-resolvable import POM: Failure to find org.apache.clerezza:rdf.jena.dependencymanagement:pom:1.1.0
in http://repo.maven.apache.org/maven2 was cached in the local repository, resolution will
not be reattempted until the update interval of central has elapsed or updates are forced
@ line 44, column 25
[ERROR] 'dependencies.dependency.version' for org.apache.jena:jena-tdb:jar is missing. @ line
92, column 21

	at org.apache.maven.project.DefaultProjectBuilder.build(DefaultProjectBuilder.java:364)
	at hudson.maven.MavenEmbedder.buildProjects(MavenEmbedder.java:361)
	at hudson.maven.MavenEmbedder.readProjects(MavenEmbedder.java:331)
	at hudson.maven.MavenModuleSetBuild$PomParser.invoke(MavenModuleSetBuild.java:1291)
	... 10 more

Mime
View raw message