clerezza-commits mailing list archives

Site index · List index
Message view « Date » · « Thread »
Top « Date » · « Thread »
From Apache Jenkins Server <jenk...@builds.apache.org>
Subject Build failed in Jenkins: clerezza #1081
Date Sat, 05 Sep 2015 13:28:28 GMT
See <https://builds.apache.org/job/clerezza/1081/changes>

Changes:

[reto] CLEREZZA-1000: updated assembly descriptor

[reto] CLEREZZA-1000: fixed parent versions

[reto] CLEREZZA-1000: removed tests from release pom

------------------------------------------
Started by an SCM change
[EnvInject] - Loading node environment variables.
Building remotely on ubuntu-6 (docker Ubuntu ubuntu) in workspace <https://builds.apache.org/job/clerezza/ws/>
Cloning the remote Git repository
Cloning repository https://git-wip-us.apache.org/repos/asf/clerezza.git
 > git init <https://builds.apache.org/job/clerezza/ws/> # timeout=10
Fetching upstream changes from https://git-wip-us.apache.org/repos/asf/clerezza.git
 > git --version # timeout=10
 > git fetch --tags --progress https://git-wip-us.apache.org/repos/asf/clerezza.git +refs/heads/*:refs/remotes/origin/*
 > git config remote.origin.url https://git-wip-us.apache.org/repos/asf/clerezza.git #
timeout=10
 > git config remote.origin.fetch +refs/heads/*:refs/remotes/origin/* # timeout=10
 > git config remote.origin.url https://git-wip-us.apache.org/repos/asf/clerezza.git #
timeout=10
Fetching upstream changes from https://git-wip-us.apache.org/repos/asf/clerezza.git
 > git fetch --tags --progress https://git-wip-us.apache.org/repos/asf/clerezza.git +refs/heads/*:refs/remotes/origin/*
 > git rev-parse refs/remotes/origin/master^{commit} # timeout=10
 > git rev-parse refs/remotes/origin/origin/master^{commit} # timeout=10
Checking out Revision 6a6c5f83c0916b6c1f4c2f61e9a6c6458ceb84d6 (refs/remotes/origin/master)
 > git config core.sparsecheckout # timeout=10
 > git checkout -f 6a6c5f83c0916b6c1f4c2f61e9a6c6458ceb84d6
 > git rev-list c256030e85f8305a2321e58b4ee1906339fe7ff6 # timeout=10
[locks-and-latches] Checking to see if we really have the locks
[locks-and-latches] Have all the locks, build can start
Parsing POMs
Downloaded artifact http://repo.maven.apache.org/maven2/org/apache/clerezza/clerezza/0.5/clerezza-0.5.pom
Downloaded artifact http://repo.maven.apache.org/maven2/org/apache/clerezza/clerezza/7/clerezza-7.pom
Downloaded artifact http://repo.maven.apache.org/maven2/org/apache/clerezza/ssl.keygen/0.6/ssl.keygen-0.6.pom
Downloaded artifact http://repo.maven.apache.org/maven2/org/apache/clerezza/platform.accountcontrolpanel/0.10/platform.accountcontrolpanel-0.10.pom
Downloaded artifact http://repo.maven.apache.org/maven2/org/apache/clerezza/platform.concepts/0.2/platform.concepts-0.2.pom
Downloaded artifact http://repo.maven.apache.org/maven2/org/apache/clerezza/platform.content.representations/0.2/platform.content.representations-0.2.pom
Downloaded artifact http://repo.maven.apache.org/maven2/org/apache/clerezza/platform.curieprefixmanager/0.2/platform.curieprefixmanager-0.2.pom
Downloaded artifact http://repo.maven.apache.org/maven2/org/apache/clerezza/platform.dashboard/0.5/platform.dashboard-0.5.pom
Downloaded artifact http://repo.maven.apache.org/maven2/org/apache/clerezza/platform.language/0.3/platform.language-0.3.pom
Downloaded artifact http://repo.maven.apache.org/maven2/org/apache/clerezza/platform.security.foafssl/0.2/platform.security.foafssl-0.2.pom
Downloaded artifact http://repo.maven.apache.org/maven2/org/apache/clerezza/rdf.cris/0.3/rdf.cris-0.3.pom
Downloaded artifact http://repo.maven.apache.org/maven2/org/apache/clerezza/uima/0.2/uima-0.2.pom
[locks-and-latches] Releasing all the locks
[locks-and-latches] All the locks released
ERROR: Failed to parse POMs
java.io.IOException: remote file operation failed: <https://builds.apache.org/job/clerezza/ws/>
at hudson.remoting.Channel@17a9f03f:ubuntu-6
	at hudson.FilePath.act(FilePath.java:916)
	at hudson.FilePath.act(FilePath.java:893)
	at hudson.maven.MavenModuleSetBuild$MavenModuleSetBuildExecution.parsePoms(MavenModuleSetBuild.java:950)
	at hudson.maven.MavenModuleSetBuild$MavenModuleSetBuildExecution.doRun(MavenModuleSetBuild.java:677)
	at hudson.model.AbstractBuild$AbstractBuildExecution.run(AbstractBuild.java:529)
	at hudson.model.Run.execute(Run.java:1706)
	at hudson.maven.MavenModuleSetBuild.run(MavenModuleSetBuild.java:529)
	at hudson.model.ResourceController.execute(ResourceController.java:88)
	at hudson.model.Executor.run(Executor.java:232)
Caused by: hudson.remoting.ProxyException: hudson.maven.MavenModuleSetBuild$MavenExecutionException:
org.apache.maven.project.ProjectBuildingException: Some problems were encountered while processing
the POMs:
[FATAL] Non-resolvable parent POM: Could not find artifact org.apache.clerezza.ext:bundles-pom:pom:1.0.0-SNAPSHOT
and 'parent.relativePath' points at wrong local POM @ line 24, column 13
[FATAL] Non-resolvable parent POM: Could not find artifact org.apache.clerezza.ext:bundles-pom:pom:1.0.0-SNAPSHOT
and 'parent.relativePath' points at wrong local POM @ line 24, column 13
[FATAL] Non-resolvable parent POM: Could not find artifact org.apache.clerezza.ext:bundles-pom:pom:1.0.0-SNAPSHOT
and 'parent.relativePath' points at wrong local POM @ line 24, column 13
[FATAL] Non-resolvable parent POM: Could not find artifact org.apache.clerezza.ext:bundles-pom:pom:1.0.0-SNAPSHOT
and 'parent.relativePath' points at wrong local POM @ line 24, column 13
[WARNING] 'parent.relativePath' of POM org.apache.clerezza.scala:scala:1.0.1-SNAPSHOT (<https://builds.apache.org/job/clerezza/ws/scala-scripting/pom.xml)>
points at org.apache.clerezza:clerezza instead of org.apache:apache, please verify your project
structure @ org.apache.clerezza.scala:scala:1.0.1-SNAPSHOT, <https://builds.apache.org/job/clerezza/ws/scala-scripting/pom.xml,>
line 22, column 13
[WARNING] 'parent.relativePath' of POM org.apache.clerezza.scala:scala:1.0.1-SNAPSHOT (<https://builds.apache.org/job/clerezza/ws/scala-scripting/pom.xml)>
points at org.apache.clerezza:clerezza instead of org.apache:apache, please verify your project
structure @ org.apache.clerezza.scala:scala:1.0.1-SNAPSHOT, <https://builds.apache.org/job/clerezza/ws/scala-scripting/pom.xml,>
line 22, column 13
[WARNING] 'parent.relativePath' points at org.apache.clerezza:clerezza instead of org.apache:apache,
please verify your project structure @ line 22, column 13

	at hudson.maven.MavenModuleSetBuild$PomParser.invoke(MavenModuleSetBuild.java:1354)
	at hudson.maven.MavenModuleSetBuild$PomParser.invoke(MavenModuleSetBuild.java:1088)
	at hudson.FilePath$FileCallableWrapper.call(FilePath.java:2474)
	at hudson.remoting.UserRequest.perform(UserRequest.java:118)
	at hudson.remoting.UserRequest.perform(UserRequest.java:48)
	at hudson.remoting.Request$2.run(Request.java:328)
	at hudson.remoting.InterceptingExecutorService$1.call(InterceptingExecutorService.java:72)
	at java.util.concurrent.FutureTask.run(FutureTask.java:262)
	at java.util.concurrent.ThreadPoolExecutor.runWorker(ThreadPoolExecutor.java:1145)
	at java.util.concurrent.ThreadPoolExecutor$Worker.run(ThreadPoolExecutor.java:615)
	at java.lang.Thread.run(Thread.java:745)
Caused by: hudson.remoting.ProxyException: org.apache.maven.project.ProjectBuildingException:
Some problems were encountered while processing the POMs:
[FATAL] Non-resolvable parent POM: Could not find artifact org.apache.clerezza.ext:bundles-pom:pom:1.0.0-SNAPSHOT
and 'parent.relativePath' points at wrong local POM @ line 24, column 13
[FATAL] Non-resolvable parent POM: Could not find artifact org.apache.clerezza.ext:bundles-pom:pom:1.0.0-SNAPSHOT
and 'parent.relativePath' points at wrong local POM @ line 24, column 13
[FATAL] Non-resolvable parent POM: Could not find artifact org.apache.clerezza.ext:bundles-pom:pom:1.0.0-SNAPSHOT
and 'parent.relativePath' points at wrong local POM @ line 24, column 13
[FATAL] Non-resolvable parent POM: Could not find artifact org.apache.clerezza.ext:bundles-pom:pom:1.0.0-SNAPSHOT
and 'parent.relativePath' points at wrong local POM @ line 24, column 13
[WARNING] 'parent.relativePath' of POM org.apache.clerezza.scala:scala:1.0.1-SNAPSHOT (<https://builds.apache.org/job/clerezza/ws/scala-scripting/pom.xml)>
points at org.apache.clerezza:clerezza instead of org.apache:apache, please verify your project
structure @ org.apache.clerezza.scala:scala:1.0.1-SNAPSHOT, <https://builds.apache.org/job/clerezza/ws/scala-scripting/pom.xml,>
line 22, column 13
[WARNING] 'parent.relativePath' of POM org.apache.clerezza.scala:scala:1.0.1-SNAPSHOT (<https://builds.apache.org/job/clerezza/ws/scala-scripting/pom.xml)>
points at org.apache.clerezza:clerezza instead of org.apache:apache, please verify your project
structure @ org.apache.clerezza.scala:scala:1.0.1-SNAPSHOT, <https://builds.apache.org/job/clerezza/ws/scala-scripting/pom.xml,>
line 22, column 13
[WARNING] 'parent.relativePath' points at org.apache.clerezza:clerezza instead of org.apache:apache,
please verify your project structure @ line 22, column 13

	at org.apache.maven.project.DefaultProjectBuilder.build(DefaultProjectBuilder.java:364)
	at hudson.maven.MavenEmbedder.buildProjects(MavenEmbedder.java:361)
	at hudson.maven.MavenEmbedder.readProjects(MavenEmbedder.java:331)
	at hudson.maven.MavenModuleSetBuild$PomParser.invoke(MavenModuleSetBuild.java:1291)
	... 10 more

Mime
View raw message