clerezza-commits mailing list archives

Site index · List index
Message view « Date » · « Thread »
Top « Date » · « Thread »
From Apache Jenkins Server <jenk...@builds.apache.org>
Subject Build failed in Jenkins: clerezza-trunk-1.6 #1059
Date Wed, 22 Apr 2015 18:07:28 GMT
See <https://builds.apache.org/job/clerezza-trunk-1.6/1059/changes>

Changes:

[hasan] CLEREZZA-961: Used instance of TcManager instead of a subclass of it overriding listGraphs
in SparqlPreParserTest to not affect other tests

------------------------------------------
Started by an SCM change
Building remotely on H11 (Ubuntu ubuntu) in workspace <https://builds.apache.org/job/clerezza-trunk-1.6/ws/>
Cloning the remote Git repository
Cloning repository https://git-wip-us.apache.org/repos/asf/clerezza.git
 > git init <https://builds.apache.org/job/clerezza-trunk-1.6/ws/> # timeout=10
Fetching upstream changes from https://git-wip-us.apache.org/repos/asf/clerezza.git
 > git --version # timeout=10
 > git fetch --tags --progress https://git-wip-us.apache.org/repos/asf/clerezza.git +refs/heads/*:refs/remotes/origin/*
 > git config remote.origin.url https://git-wip-us.apache.org/repos/asf/clerezza.git #
timeout=10
 > git config remote.origin.fetch +refs/heads/*:refs/remotes/origin/* # timeout=10
 > git config remote.origin.url https://git-wip-us.apache.org/repos/asf/clerezza.git #
timeout=10
Fetching upstream changes from https://git-wip-us.apache.org/repos/asf/clerezza.git
 > git fetch --tags --progress https://git-wip-us.apache.org/repos/asf/clerezza.git +refs/heads/*:refs/remotes/origin/*
 > git rev-parse refs/remotes/origin/master^{commit} # timeout=10
 > git rev-parse refs/remotes/origin/origin/master^{commit} # timeout=10
Checking out Revision a841717edd9c6778e494496889f1f7a5daf88e6a (refs/remotes/origin/master)
 > git config core.sparsecheckout # timeout=10
 > git checkout -f a841717edd9c6778e494496889f1f7a5daf88e6a
 > git rev-list c70a78b3000848f34749495d9bfbc3bd6c9988bc # timeout=10
[locks-and-latches] Checking to see if we really have the locks
[locks-and-latches] Have all the locks, build can start
Parsing POMs
[locks-and-latches] Releasing all the locks
[locks-and-latches] All the locks released
ERROR: Failed to parse POMs
java.io.IOException: remote file operation failed: <https://builds.apache.org/job/clerezza-trunk-1.6/ws/>
at hudson.remoting.Channel@64304147:H11
	at hudson.FilePath.act(FilePath.java:916)
	at hudson.FilePath.act(FilePath.java:893)
	at hudson.maven.MavenModuleSetBuild$MavenModuleSetBuildExecution.parsePoms(MavenModuleSetBuild.java:950)
	at hudson.maven.MavenModuleSetBuild$MavenModuleSetBuildExecution.doRun(MavenModuleSetBuild.java:677)
	at hudson.model.AbstractBuild$AbstractBuildExecution.run(AbstractBuild.java:529)
	at hudson.model.Run.execute(Run.java:1706)
	at hudson.maven.MavenModuleSetBuild.run(MavenModuleSetBuild.java:529)
	at hudson.model.ResourceController.execute(ResourceController.java:88)
	at hudson.model.Executor.run(Executor.java:232)
Caused by: hudson.remoting.ProxyException: hudson.maven.MavenModuleSetBuild$MavenExecutionException:
org.apache.maven.project.ProjectBuildingException: Some problems were encountered while processing
the POMs:
[ERROR] 'dependencies.dependency.version' for org.scala-lang.modules:scala-xml_2.11:jar is
missing. @ line 67, column 21
[ERROR] 'dependencies.dependency.version' for org.scala-lang.modules:scala-xml_2.11:jar is
missing. @ line 82, column 21
[ERROR] 'dependencies.dependency.version' for org.scala-lang.modules:scala-xml_2.11:jar is
missing. @ line 56, column 21
[ERROR] 'dependencies.dependency.version' for org.scala-lang.modules:scala-xml_2.11:jar is
missing. @ line 77, column 21

	at hudson.maven.MavenModuleSetBuild$PomParser.invoke(MavenModuleSetBuild.java:1354)
	at hudson.maven.MavenModuleSetBuild$PomParser.invoke(MavenModuleSetBuild.java:1088)
	at hudson.FilePath$FileCallableWrapper.call(FilePath.java:2474)
	at hudson.remoting.UserRequest.perform(UserRequest.java:118)
	at hudson.remoting.UserRequest.perform(UserRequest.java:48)
	at hudson.remoting.Request$2.run(Request.java:328)
	at hudson.remoting.InterceptingExecutorService$1.call(InterceptingExecutorService.java:72)
	at java.util.concurrent.FutureTask.run(FutureTask.java:262)
	at java.util.concurrent.ThreadPoolExecutor.runWorker(ThreadPoolExecutor.java:1145)
	at java.util.concurrent.ThreadPoolExecutor$Worker.run(ThreadPoolExecutor.java:615)
	at java.lang.Thread.run(Thread.java:745)
Caused by: hudson.remoting.ProxyException: org.apache.maven.project.ProjectBuildingException:
Some problems were encountered while processing the POMs:
[ERROR] 'dependencies.dependency.version' for org.scala-lang.modules:scala-xml_2.11:jar is
missing. @ line 67, column 21
[ERROR] 'dependencies.dependency.version' for org.scala-lang.modules:scala-xml_2.11:jar is
missing. @ line 82, column 21
[ERROR] 'dependencies.dependency.version' for org.scala-lang.modules:scala-xml_2.11:jar is
missing. @ line 56, column 21
[ERROR] 'dependencies.dependency.version' for org.scala-lang.modules:scala-xml_2.11:jar is
missing. @ line 77, column 21

	at org.apache.maven.project.DefaultProjectBuilder.build(DefaultProjectBuilder.java:364)
	at hudson.maven.MavenEmbedder.buildProjects(MavenEmbedder.java:361)
	at hudson.maven.MavenEmbedder.readProjects(MavenEmbedder.java:331)
	at hudson.maven.MavenModuleSetBuild$PomParser.invoke(MavenModuleSetBuild.java:1291)
	... 10 more

Mime
View raw message