clerezza-commits mailing list archives

Site index · List index
Message view « Date » · « Thread »
Top « Date » · « Thread »
From Apache Jenkins Server <jenk...@builds.apache.org>
Subject Build failed in Jenkins: clerezza-trunk-1.6 #1025
Date Wed, 06 Aug 2014 22:29:58 GMT
See <https://builds.apache.org/job/clerezza-trunk-1.6/1025/changes>

Changes:

[reto] CLEREZZA-938: removed platform.testing project

[reto] CLEREZZA-937: removed olf ext.jena bundles

[reto] CLEREZZA-940: Commented out test that fails compiling

[misl] CLEREZZA-940: Uncommented and fixed failing test

[reto] CLEREZZA-941: using released version of felix.main and security

------------------------------------------
Started by user reto
Started by an SCM change
Started by an SCM change
Started by an SCM change
Building remotely on ubuntu-2 (Ubuntu ubuntu) in workspace <https://builds.apache.org/job/clerezza-trunk-1.6/ws/>
 > git rev-parse --is-inside-work-tree
Fetching changes from the remote Git repository
 > git config remote.origin.url https://git-wip-us.apache.org/repos/asf/clerezza.git
Fetching upstream changes from https://git-wip-us.apache.org/repos/asf/clerezza.git
 > git --version
 > git fetch --tags --progress https://git-wip-us.apache.org/repos/asf/clerezza.git +refs/heads/*:refs/remotes/origin/*
 > git rev-parse origin/master^{commit}
Checking out Revision a7b1018128ec63bd61c54a601d972a1c76937a68 (origin/master)
 > git config core.sparsecheckout
 > git checkout -f a7b1018128ec63bd61c54a601d972a1c76937a68
 > git rev-list 86885e8007e5fae0ce8cb1aea75e9df6f72c0c14
[locks-and-latches] Checking to see if we really have the locks
[locks-and-latches] Have all the locks, build can start
Parsing POMs
[locks-and-latches] Releasing all the locks
[locks-and-latches] All the locks released
ERROR: Failed to parse POMs
java.io.IOException: remote file operation failed: <https://builds.apache.org/job/clerezza-trunk-1.6/ws/>
at hudson.remoting.Channel@74143948:ubuntu-2
	at hudson.FilePath.act(FilePath.java:910)
	at hudson.FilePath.act(FilePath.java:887)
	at hudson.maven.MavenModuleSetBuild$MavenModuleSetBuildExecution.parsePoms(MavenModuleSetBuild.java:953)
	at hudson.maven.MavenModuleSetBuild$MavenModuleSetBuildExecution.doRun(MavenModuleSetBuild.java:681)
	at hudson.model.AbstractBuild$AbstractBuildExecution.run(AbstractBuild.java:585)
	at hudson.model.Run.execute(Run.java:1676)
	at hudson.maven.MavenModuleSetBuild.run(MavenModuleSetBuild.java:529)
	at hudson.model.ResourceController.execute(ResourceController.java:88)
	at hudson.model.Executor.run(Executor.java:231)
Caused by: hudson.remoting.ProxyException: hudson.maven.MavenModuleSetBuild$MavenExecutionException:
org.apache.maven.project.ProjectBuildingException: Some problems were encountered while processing
the POMs:
[ERROR] 'dependencies.dependency.version' for org.apache.stanbol:org.apache.stanbol.commons.security.usermanagement:jar
is missing. @ line 595, column 17

	at hudson.maven.MavenModuleSetBuild$PomParser.invoke(MavenModuleSetBuild.java:1357)
	at hudson.maven.MavenModuleSetBuild$PomParser.invoke(MavenModuleSetBuild.java:1091)
	at hudson.FilePath$FileCallableWrapper.call(FilePath.java:2462)
	at hudson.remoting.UserRequest.perform(UserRequest.java:118)
	at hudson.remoting.UserRequest.perform(UserRequest.java:48)
	at hudson.remoting.Request$2.run(Request.java:328)
	at hudson.remoting.InterceptingExecutorService$1.call(InterceptingExecutorService.java:72)
	at java.util.concurrent.FutureTask.run(FutureTask.java:262)
	at java.util.concurrent.ThreadPoolExecutor.runWorker(ThreadPoolExecutor.java:1145)
	at java.util.concurrent.ThreadPoolExecutor$Worker.run(ThreadPoolExecutor.java:615)
	at java.lang.Thread.run(Thread.java:745)
Caused by: hudson.remoting.ProxyException: org.apache.maven.project.ProjectBuildingException:
Some problems were encountered while processing the POMs:
[ERROR] 'dependencies.dependency.version' for org.apache.stanbol:org.apache.stanbol.commons.security.usermanagement:jar
is missing. @ line 595, column 17

	at org.apache.maven.project.DefaultProjectBuilder.build(DefaultProjectBuilder.java:364)
	at hudson.maven.MavenEmbedder.buildProjects(MavenEmbedder.java:361)
	at hudson.maven.MavenEmbedder.readProjects(MavenEmbedder.java:331)
	at hudson.maven.MavenModuleSetBuild$PomParser.invoke(MavenModuleSetBuild.java:1294)
	... 10 more

Mime
View raw message