clerezza-commits mailing list archives

Site index · List index
Message view « Date » · « Thread »
Top « Date » · « Thread »
From Apache Jenkins Server <jenk...@builds.apache.org>
Subject Build failed in Jenkins: clerezza-trunk-1.6 #763
Date Mon, 11 Jun 2012 22:48:27 GMT
See <https://builds.apache.org/job/clerezza-trunk-1.6/763/changes>

Changes:

[reto] CLEREZZA-705: always returning the same object for the virtual MGRaph (so it is cacheable
as required by TcManager)

------------------------------------------
[...truncated 13896 lines...]
[INFO] Copying 1 resource
[INFO] Copying 3 resources
[INFO] [compiler:compile {execution: default-compile}]
[INFO] Nothing to compile - all classes are up to date
[INFO] [scala:compile {execution: default}]
[ERROR] <https://builds.apache.org/job/clerezza-trunk-1.6/ws/trunk-1.6/shell/src/main/scala>
[INFO] Compiling 8 source files to <https://builds.apache.org/job/clerezza-trunk-1.6/ws/trunk-1.6/shell/target/classes>
[INFO] [scr:scr {execution: generate-scr-scrdescriptor}]
[INFO] [resources:testResources {execution: default-testResources}]
[INFO] Using 'utf-8' encoding to copy filtered resources.
[INFO] skip non existing resourceDirectory <https://builds.apache.org/job/clerezza-trunk-1.6/ws/trunk-1.6/shell/src/test/resources>
[INFO] Copying 3 resources
[INFO] [compiler:testCompile {execution: default-testCompile}]
[INFO] Nothing to compile - all classes are up to date
[INFO] [scala:testCompile {execution: default}]
[ERROR] <https://builds.apache.org/job/clerezza-trunk-1.6/ws/trunk-1.6/shell/src/test/scala>
[ERROR] <https://builds.apache.org/job/clerezza-trunk-1.6/ws/trunk-1.6/shell/src/test/scala/../scala>
[WARNING] No source files found.
[INFO] [surefire:test {execution: default-test}]
[INFO] Surefire report directory: <https://builds.apache.org/job/clerezza-trunk-1.6/ws/trunk-1.6/shell/target/surefire-reports>

-------------------------------------------------------
 T E S T S
-------------------------------------------------------
There are no tests to run.

Results :

Tests run: 0, Failures: 0, Errors: 0, Skipped: 0

[JENKINS] Recording test results[INFO] [bundle:bundle {execution: default-bundle}]

[INFO] Preparing source:jar
[WARNING] Removing: jar from forked lifecycle, to prevent recursive invocation.
[INFO] No goals needed for project - skipping
[INFO] [source:jar {execution: default}]
[INFO] Building jar: <https://builds.apache.org/job/clerezza-trunk-1.6/ws/trunk-1.6/shell/target/shell-0.2-incubating-SNAPSHOT-sources.jar>
[INFO] [install:install {execution: default-install}]
[INFO] Installing <https://builds.apache.org/job/clerezza-trunk-1.6/ws/trunk-1.6/shell/target/shell-0.2-incubating-SNAPSHOT.jar>
to /home/jenkins/jenkins-slave/maven-repositories/0/org/apache/clerezza/shell/0.2-incubating-SNAPSHOT/shell-0.2-incubating-SNAPSHOT.jar
[INFO] Installing <https://builds.apache.org/job/clerezza-trunk-1.6/ws/trunk-1.6/shell/target/shell-0.2-incubating-SNAPSHOT-sources.jar>
to /home/jenkins/jenkins-slave/maven-repositories/0/org/apache/clerezza/shell/0.2-incubating-SNAPSHOT/shell-0.2-incubating-SNAPSHOT-sources.jar
[INFO] [bundle:install {execution: default-install}]
[INFO] Installing org/apache/clerezza/shell/0.2-incubating-SNAPSHOT/shell-0.2-incubating-SNAPSHOT.jar
[INFO] Writing OBR metadata
[INFO] [deploy:deploy {execution: default-deploy}]
[INFO] Retrieving previous build number from apache.snapshots.https
[WARNING] *** CHECKSUM FAILED - Checksum failed on download: local = 'dff68d5da769ad70230ef499209e5b2d54cf5b7a';
remote = '102d373fe07ac1264e4b04c57c23d67c158fc73e' - RETRYING
[WARNING] *** CHECKSUM FAILED - Checksum failed on download: local = 'dff68d5da769ad70230ef499209e5b2d54cf5b7a';
remote = '102d373fe07ac1264e4b04c57c23d67c158fc73e' - IGNORING
Uploading: https://repository.apache.org/content/repositories/snapshots/org/apache/clerezza/shell/0.2-incubating-SNAPSHOT/shell-0.2-incubating-20120611.222542-7.jar
90K uploaded  (shell-0.2-incubating-20120611.222542-7.jar)
[INFO] Retrieving previous metadata from apache.snapshots.https
[INFO] Uploading repository metadata for: 'artifact org.apache.clerezza:shell'
[INFO] Retrieving previous metadata from apache.snapshots.https
[WARNING] *** CHECKSUM FAILED - Checksum failed on download: local = 'dff68d5da769ad70230ef499209e5b2d54cf5b7a';
remote = '102d373fe07ac1264e4b04c57c23d67c158fc73e' - RETRYING
[WARNING] *** CHECKSUM FAILED - Checksum failed on download: local = 'dff68d5da769ad70230ef499209e5b2d54cf5b7a';
remote = '102d373fe07ac1264e4b04c57c23d67c158fc73e' - IGNORING
[INFO] Uploading repository metadata for: 'snapshot org.apache.clerezza:shell:0.2-incubating-SNAPSHOT'
[INFO] Uploading project information for shell 0.2-incubating-20120611.222542-7
[INFO] Retrieving previous build number from apache.snapshots.https
Uploading: https://repository.apache.org/content/repositories/snapshots/org/apache/clerezza/shell/0.2-incubating-SNAPSHOT/shell-0.2-incubating-20120611.222542-7-sources.jar
17K uploaded  (shell-0.2-incubating-20120611.222542-7-sources.jar)
[INFO] [bundle:deploy {execution: default-deploy}]
[INFO] Remote OBR update disabled (enable with -DremoteOBR)
[JENKINS] Archiving <https://builds.apache.org/job/clerezza-trunk-1.6/ws/trunk-1.6/shell/pom.xml>
to /home/hudson/hudson/jobs/clerezza-trunk-1.6/modules/org.apache.clerezza$shell/builds/2012-06-11_22-25-00/archive/org.apache.clerezza/shell/0.2-incubating-SNAPSHOT/shell-0.2-incubating-SNAPSHOT.pom
[JENKINS] Archiving <https://builds.apache.org/job/clerezza-trunk-1.6/ws/trunk-1.6/shell/target/shell-0.2-incubating-SNAPSHOT.jar>
to /home/hudson/hudson/jobs/clerezza-trunk-1.6/modules/org.apache.clerezza$shell/builds/2012-06-11_22-25-00/archive/org.apache.clerezza/shell/0.2-incubating-20120611.222542-7/shell-0.2-incubating-20120611.222542-7.jar
[JENKINS] Archiving <https://builds.apache.org/job/clerezza-trunk-1.6/ws/trunk-1.6/shell/target/shell-0.2-incubating-SNAPSHOT-sources.jar>
to /home/hudson/hudson/jobs/clerezza-trunk-1.6/modules/org.apache.clerezza$shell/builds/2012-06-11_22-25-00/archive/org.apache.clerezza/shell/0.2-incubating-20120611.222542-7/shell-0.2-incubating-20120611.222542-7-sources.jar
[INFO] ------------------------------------------------------------------------
[INFO] Building Clerezza - Platform Shell customizer
[INFO]    task-segment: [clean, deploy]
[INFO] ------------------------------------------------------------------------
[INFO] [clean:clean {execution: default-clean}]
[INFO] Deleting file set: <https://builds.apache.org/job/clerezza-trunk-1.6/ws/trunk-1.6/platform.shellcustomizer/target>
(included: [**], excluded: [])
[INFO] [remote-resources:process {execution: default}]
[INFO] snapshot org.apache.clerezza:shell:0.2-incubating-SNAPSHOT: checking for updates from
apache.snapshots
[INFO] [resources:resources {execution: default-resources}]
[INFO] Using 'utf-8' encoding to copy filtered resources.
[INFO] Copying 0 resource to META-INF
[INFO] Copying 1 resource
[INFO] Copying 3 resources
[INFO] [compiler:compile {execution: default-compile}]
[INFO] Nothing to compile - all classes are up to date
[INFO] [scala:compile {execution: default}]
[ERROR] <https://builds.apache.org/job/clerezza-trunk-1.6/ws/trunk-1.6/platform.shellcustomizer/src/main/scala>
[INFO] Compiling 2 source files to <https://builds.apache.org/job/clerezza-trunk-1.6/ws/trunk-1.6/platform.shellcustomizer/target/classes>
[INFO] [scr:scr {execution: generate-scr-scrdescriptor}]
[INFO] [resources:testResources {execution: default-testResources}]
[INFO] Using 'utf-8' encoding to copy filtered resources.
[INFO] skip non existing resourceDirectory <https://builds.apache.org/job/clerezza-trunk-1.6/ws/trunk-1.6/platform.shellcustomizer/src/test/resources>
[INFO] Copying 3 resources
[INFO] [compiler:testCompile {execution: default-testCompile}]
[INFO] Nothing to compile - all classes are up to date
[INFO] [scala:testCompile {execution: default}]
[ERROR] <https://builds.apache.org/job/clerezza-trunk-1.6/ws/trunk-1.6/platform.shellcustomizer/src/test/scala>
[ERROR] <https://builds.apache.org/job/clerezza-trunk-1.6/ws/trunk-1.6/platform.shellcustomizer/src/test/scala/../scala>
[WARNING] No source files found.
[INFO] [surefire:test {execution: default-test}]
[INFO] Surefire report directory: <https://builds.apache.org/job/clerezza-trunk-1.6/ws/trunk-1.6/platform.shellcustomizer/target/surefire-reports>

-------------------------------------------------------
 T E S T S
-------------------------------------------------------
There are no tests to run.

Results :

Tests run: 0, Failures: 0, Errors: 0, Skipped: 0

[JENKINS] Recording test results
[INFO] [bundle:bundle {execution: default-bundle}]
[INFO] Preparing source:jar
[WARNING] Removing: jar from forked lifecycle, to prevent recursive invocation.
[INFO] No goals needed for project - skipping
[INFO] [source:jar {execution: default}]
[INFO] Building jar: <https://builds.apache.org/job/clerezza-trunk-1.6/ws/trunk-1.6/platform.shellcustomizer/target/platform.shellcustomizer-0.2-incubating-SNAPSHOT-sources.jar>
[INFO] [install:install {execution: default-install}]
[INFO] Installing <https://builds.apache.org/job/clerezza-trunk-1.6/ws/trunk-1.6/platform.shellcustomizer/target/platform.shellcustomizer-0.2-incubating-SNAPSHOT.jar>
to /home/jenkins/jenkins-slave/maven-repositories/0/org/apache/clerezza/platform.shellcustomizer/0.2-incubating-SNAPSHOT/platform.shellcustomizer-0.2-incubating-SNAPSHOT.jar
[INFO] Installing <https://builds.apache.org/job/clerezza-trunk-1.6/ws/trunk-1.6/platform.shellcustomizer/target/platform.shellcustomizer-0.2-incubating-SNAPSHOT-sources.jar>
to /home/jenkins/jenkins-slave/maven-repositories/0/org/apache/clerezza/platform.shellcustomizer/0.2-incubating-SNAPSHOT/platform.shellcustomizer-0.2-incubating-SNAPSHOT-sources.jar
[INFO] [bundle:install {execution: default-install}]
[INFO] Installing org/apache/clerezza/platform.shellcustomizer/0.2-incubating-SNAPSHOT/platform.shellcustomizer-0.2-incubating-SNAPSHOT.jar
[INFO] Writing OBR metadata
[INFO] [deploy:deploy {execution: default-deploy}]
[INFO] Retrieving previous build number from apache.snapshots.https
[WARNING] *** CHECKSUM FAILED - Checksum failed on download: local = '872ae08ff34811c090f0033f4929bcb4c887f3eb';
remote = '1ae623b37abeb6098e9e6fc17b8a99600edee609' - RETRYING
[WARNING] *** CHECKSUM FAILED - Checksum failed on download: local = '872ae08ff34811c090f0033f4929bcb4c887f3eb';
remote = '1ae623b37abeb6098e9e6fc17b8a99600edee609' - IGNORING
Uploading: https://repository.apache.org/content/repositories/snapshots/org/apache/clerezza/platform.shellcustomizer/0.2-incubating-SNAPSHOT/platform.shellcustomizer-0.2-incubating-20120611.222542-9.jar
15K uploaded  (platform.shellcustomizer-0.2-incubating-20120611.222542-9.jar)
[INFO] Retrieving previous metadata from apache.snapshots.https
[INFO] Uploading repository metadata for: 'artifact org.apache.clerezza:platform.shellcustomizer'
[INFO] Uploading project information for platform.shellcustomizer 0.2-incubating-20120611.222542-9
[INFO] Retrieving previous metadata from apache.snapshots.https
[WARNING] *** CHECKSUM FAILED - Checksum failed on download: local = '872ae08ff34811c090f0033f4929bcb4c887f3eb';
remote = '1ae623b37abeb6098e9e6fc17b8a99600edee609' - RETRYING
[WARNING] *** CHECKSUM FAILED - Checksum failed on download: local = '872ae08ff34811c090f0033f4929bcb4c887f3eb';
remote = '1ae623b37abeb6098e9e6fc17b8a99600edee609' - IGNORING
[INFO] Uploading repository metadata for: 'snapshot org.apache.clerezza:platform.shellcustomizer:0.2-incubating-SNAPSHOT'
[INFO] Retrieving previous build number from apache.snapshots.https
Uploading: https://repository.apache.org/content/repositories/snapshots/org/apache/clerezza/platform.shellcustomizer/0.2-incubating-SNAPSHOT/platform.shellcustomizer-0.2-incubating-20120611.222542-9-sources.jar
9K uploaded  (platform.shellcustomizer-0.2-incubating-20120611.222542-9-sources.jar)
[INFO] [bundle:deploy {execution: default-deploy}]
[INFO] Remote OBR update disabled (enable with -DremoteOBR)
[JENKINS] Archiving <https://builds.apache.org/job/clerezza-trunk-1.6/ws/trunk-1.6/platform.shellcustomizer/pom.xml>
to /home/hudson/hudson/jobs/clerezza-trunk-1.6/modules/org.apache.clerezza$platform.shellcustomizer/builds/2012-06-11_22-24-58/archive/org.apache.clerezza/platform.shellcustomizer/0.2-incubating-SNAPSHOT/platform.shellcustomizer-0.2-incubating-SNAPSHOT.pom
[JENKINS] Archiving <https://builds.apache.org/job/clerezza-trunk-1.6/ws/trunk-1.6/platform.shellcustomizer/target/platform.shellcustomizer-0.2-incubating-SNAPSHOT.jar>
to /home/hudson/hudson/jobs/clerezza-trunk-1.6/modules/org.apache.clerezza$platform.shellcustomizer/builds/2012-06-11_22-24-58/archive/org.apache.clerezza/platform.shellcustomizer/0.2-incubating-20120611.222542-9/platform.shellcustomizer-0.2-incubating-20120611.222542-9.jar
[JENKINS] Archiving <https://builds.apache.org/job/clerezza-trunk-1.6/ws/trunk-1.6/platform.shellcustomizer/target/platform.shellcustomizer-0.2-incubating-SNAPSHOT-sources.jar>
to /home/hudson/hudson/jobs/clerezza-trunk-1.6/modules/org.apache.clerezza$platform.shellcustomizer/builds/2012-06-11_22-24-58/archive/org.apache.clerezza/platform.shellcustomizer/0.2-incubating-20120611.222542-9/platform.shellcustomizer-0.2-incubating-20120611.222542-9-sources.jar
[INFO] ------------------------------------------------------------------------
[INFO] Building Clerezza - Integartion of felix shell commands into clerezza shell
[INFO]    task-segment: [clean, deploy]
[INFO] ------------------------------------------------------------------------
[INFO] [clean:clean {execution: default-clean}]
[INFO] Deleting file set: <https://builds.apache.org/job/clerezza-trunk-1.6/ws/trunk-1.6/shell.felixshellcommand/target>
(included: [**], excluded: [])
[INFO] [remote-resources:process {execution: default}]
[INFO] [resources:resources {execution: default-resources}]
[INFO] Using 'utf-8' encoding to copy filtered resources.
[INFO] Copying 0 resource to META-INF
[INFO] Copying 1 resource
[INFO] Copying 3 resources
[INFO] [compiler:compile {execution: default-compile}]
[INFO] Nothing to compile - all classes are up to date
[INFO] [scala:compile {execution: default}]
[ERROR] <https://builds.apache.org/job/clerezza-trunk-1.6/ws/trunk-1.6/shell.felixshellcommand/src/main/scala>
[INFO] Compiling 1 source files to <https://builds.apache.org/job/clerezza-trunk-1.6/ws/trunk-1.6/shell.felixshellcommand/target/classes>
[INFO] [scr:scr {execution: generate-scr-scrdescriptor}]
[INFO] [resources:testResources {execution: default-testResources}]
[INFO] Using 'utf-8' encoding to copy filtered resources.
[INFO] skip non existing resourceDirectory <https://builds.apache.org/job/clerezza-trunk-1.6/ws/trunk-1.6/shell.felixshellcommand/src/test/resources>
[INFO] Copying 3 resources
[INFO] [compiler:testCompile {execution: default-testCompile}]
[INFO] No sources to compile
[INFO] [scala:testCompile {execution: default}]
[ERROR] <https://builds.apache.org/job/clerezza-trunk-1.6/ws/trunk-1.6/shell.felixshellcommand/src/test/scala>
[ERROR] <https://builds.apache.org/job/clerezza-trunk-1.6/ws/trunk-1.6/shell.felixshellcommand/src/test/scala/../scala>
[WARNING] No source files found.
[INFO] [surefire:test {execution: default-test}]
[INFO] Surefire report directory: <https://builds.apache.org/job/clerezza-trunk-1.6/ws/trunk-1.6/shell.felixshellcommand/target/surefire-reports>

-------------------------------------------------------
 T E S T S
-------------------------------------------------------
There are no tests to run.

Results :

Tests run: 0, Failures: 0, Errors: 0, Skipped: 0

[JENKINS] Recording test results
[INFO] [bundle:bundle {execution: default-bundle}]
[INFO] Preparing source:jar
[WARNING] Removing: jar from forked lifecycle, to prevent recursive invocation.
[INFO] No goals needed for project - skipping
[INFO] [source:jar {execution: default}]
[INFO] Building jar: <https://builds.apache.org/job/clerezza-trunk-1.6/ws/trunk-1.6/shell.felixshellcommand/target/shell.felixshellcommand-0.2-incubating-SNAPSHOT-sources.jar>
[INFO] [install:install {execution: default-install}]
[INFO] Installing <https://builds.apache.org/job/clerezza-trunk-1.6/ws/trunk-1.6/shell.felixshellcommand/target/shell.felixshellcommand-0.2-incubating-SNAPSHOT.jar>
to /home/jenkins/jenkins-slave/maven-repositories/0/org/apache/clerezza/shell.felixshellcommand/0.2-incubating-SNAPSHOT/shell.felixshellcommand-0.2-incubating-SNAPSHOT.jar
[INFO] Installing <https://builds.apache.org/job/clerezza-trunk-1.6/ws/trunk-1.6/shell.felixshellcommand/target/shell.felixshellcommand-0.2-incubating-SNAPSHOT-sources.jar>
to /home/jenkins/jenkins-slave/maven-repositories/0/org/apache/clerezza/shell.felixshellcommand/0.2-incubating-SNAPSHOT/shell.felixshellcommand-0.2-incubating-SNAPSHOT-sources.jar
[INFO] [bundle:install {execution: default-install}]
[INFO] Installing org/apache/clerezza/shell.felixshellcommand/0.2-incubating-SNAPSHOT/shell.felixshellcommand-0.2-incubating-SNAPSHOT.jar
[INFO] Writing OBR metadata
[INFO] [deploy:deploy {execution: default-deploy}]
[INFO] Retrieving previous build number from apache.snapshots.https
[WARNING] *** CHECKSUM FAILED - Checksum failed on download: local = 'c4dc34a93d35e2cee3c505e3a5797e8195ccc2c9';
remote = '8b80c82b8e94c428fdfa59aec892fa650ad7a1fb' - RETRYING
[WARNING] *** CHECKSUM FAILED - Checksum failed on download: local = 'c4dc34a93d35e2cee3c505e3a5797e8195ccc2c9';
remote = '8b80c82b8e94c428fdfa59aec892fa650ad7a1fb' - IGNORING
Uploading: https://repository.apache.org/content/repositories/snapshots/org/apache/clerezza/shell.felixshellcommand/0.2-incubating-SNAPSHOT/shell.felixshellcommand-0.2-incubating-20120611.222542-7.jar
11K uploaded  (shell.felixshellcommand-0.2-incubating-20120611.222542-7.jar)
[INFO] Retrieving previous metadata from apache.snapshots.https
[INFO] Uploading repository metadata for: 'artifact org.apache.clerezza:shell.felixshellcommand'
[INFO] Uploading project information for shell.felixshellcommand 0.2-incubating-20120611.222542-7
[INFO] Retrieving previous metadata from apache.snapshots.https
[WARNING] *** CHECKSUM FAILED - Checksum failed on download: local = 'c4dc34a93d35e2cee3c505e3a5797e8195ccc2c9';
remote = '8b80c82b8e94c428fdfa59aec892fa650ad7a1fb' - RETRYING
[WARNING] *** CHECKSUM FAILED - Checksum failed on download: local = 'c4dc34a93d35e2cee3c505e3a5797e8195ccc2c9';
remote = '8b80c82b8e94c428fdfa59aec892fa650ad7a1fb' - IGNORING
[INFO] Uploading repository metadata for: 'snapshot org.apache.clerezza:shell.felixshellcommand:0.2-incubating-SNAPSHOT'
[INFO] Retrieving previous build number from apache.snapshots.https
Uploading: https://repository.apache.org/content/repositories/snapshots/org/apache/clerezza/shell.felixshellcommand/0.2-incubating-SNAPSHOT/shell.felixshellcommand-0.2-incubating-20120611.222542-7-sources.jar
8K uploaded  (shell.felixshellcommand-0.2-incubating-20120611.222542-7-sources.jar)
[INFO] [bundle:deploy {execution: default-deploy}]
[INFO] Remote OBR update disabled (enable with -DremoteOBR)
[JENKINS] Archiving <https://builds.apache.org/job/clerezza-trunk-1.6/ws/trunk-1.6/shell.felixshellcommand/pom.xml>
to /home/hudson/hudson/jobs/clerezza-trunk-1.6/modules/org.apache.clerezza$shell.felixshellcommand/builds/2012-06-11_22-25-00/archive/org.apache.clerezza/shell.felixshellcommand/0.2-incubating-SNAPSHOT/shell.felixshellcommand-0.2-incubating-SNAPSHOT.pom
[JENKINS] Archiving <https://builds.apache.org/job/clerezza-trunk-1.6/ws/trunk-1.6/shell.felixshellcommand/target/shell.felixshellcommand-0.2-incubating-SNAPSHOT.jar>
to /home/hudson/hudson/jobs/clerezza-trunk-1.6/modules/org.apache.clerezza$shell.felixshellcommand/builds/2012-06-11_22-25-00/archive/org.apache.clerezza/shell.felixshellcommand/0.2-incubating-20120611.222542-7/shell.felixshellcommand-0.2-incubating-20120611.222542-7.jar
[JENKINS] Archiving <https://builds.apache.org/job/clerezza-trunk-1.6/ws/trunk-1.6/shell.felixshellcommand/target/shell.felixshellcommand-0.2-incubating-SNAPSHOT-sources.jar>
to /home/hudson/hudson/jobs/clerezza-trunk-1.6/modules/org.apache.clerezza$shell.felixshellcommand/builds/2012-06-11_22-25-00/archive/org.apache.clerezza/shell.felixshellcommand/0.2-incubating-20120611.222542-7/shell.felixshellcommand-0.2-incubating-20120611.222542-7-sources.jar
[INFO] ------------------------------------------------------------------------
[INFO] Building Clerezza - Bundle Development Tools
[INFO]    task-segment: [clean, deploy]
[INFO] ------------------------------------------------------------------------
[INFO] [clean:clean {execution: default-clean}]
[INFO] Deleting file set: <https://builds.apache.org/job/clerezza-trunk-1.6/ws/trunk-1.6/bundledevtool/target>
(included: [**], excluded: [])
[INFO] [remote-resources:process {execution: default}]
[INFO] [resources:resources {execution: default-resources}]
[INFO] Using 'utf-8' encoding to copy filtered resources.
[INFO] Copying 0 resource to META-INF
[INFO] Copying 9 resources
[INFO] Copying 3 resources
[INFO] [compiler:compile {execution: default-compile}]
[INFO] Nothing to compile - all classes are up to date
[INFO] [scala:compile {execution: default}]
[ERROR] <https://builds.apache.org/job/clerezza-trunk-1.6/ws/trunk-1.6/bundledevtool/src/main/scala>
[INFO] Compiling 15 source files to <https://builds.apache.org/job/clerezza-trunk-1.6/ws/trunk-1.6/bundledevtool/target/classes>
[WARNING] <https://builds.apache.org/job/clerezza-trunk-1.6/ws/trunk-1.6/bundledevtool/src/main/scala/org/apache/clerezza/bundledevtool/BundleRoot.scala>:167:
error: not found: type PermissionGrantingPathNode
[WARNING] 		val pathNode = new PermissionGrantingPathNode(new FilePathNode(new File(dir,"src/main/resources/CLEREZZA-INF/web-resources/")))
[WARNING]                                    ^
[WARNING] one error found
[JENKINS] Archiving <https://builds.apache.org/job/clerezza-trunk-1.6/ws/trunk-1.6/bundledevtool/pom.xml>
to /home/hudson/hudson/jobs/clerezza-trunk-1.6/modules/org.apache.clerezza$bundledevtool/builds/2012-06-11_22-25-00/archive/org.apache.clerezza/bundledevtool/0.2-incubating-SNAPSHOT/bundledevtool-0.2-incubating-SNAPSHOT.pom
[INFO] ------------------------------------------------------------------------
[ERROR] BUILD FAILURE
[INFO] ------------------------------------------------------------------------
[INFO] command line returned non-zero value:1
[INFO] ------------------------------------------------------------------------
[INFO] For more information, run Maven with the -e switch
[INFO] ------------------------------------------------------------------------
[INFO] Total time: 22 minutes 58 seconds
[INFO] Finished at: Mon Jun 11 22:48:24 UTC 2012
[INFO] Final Memory: 394M/902M
[INFO] ------------------------------------------------------------------------
channel stopped
[locks-and-latches] Releasing all the locks
[locks-and-latches] All the locks released

Mime
View raw message