clerezza-commits mailing list archives

Site index · List index
Message view « Date » · « Thread »
Top « Date » · « Thread »
From Apache Jenkins Server <jenk...@builds.apache.org>
Subject Build failed in Jenkins: clerezza-site #436
Date Mon, 20 Feb 2012 20:00:38 GMT
See <https://builds.apache.org/job/clerezza-site/436/changes>

Changes:

[dspicar] CLEREZZA-688: removed unnecessary dependency management section.

------------------------------------------
[...truncated 13132 lines...]
	at sun.reflect.GeneratedMethodAccessor90.invoke(Unknown Source)
	at sun.reflect.DelegatingMethodAccessorImpl.invoke(DelegatingMethodAccessorImpl.java:25)
	at java.lang.reflect.Method.invoke(Method.java:597)
	at hudson.maven.agent.ComponentInterceptor.invoke(ComponentInterceptor.java:47)
	at hudson.maven.agent.PluginManagerInterceptor$3.invoke(PluginManagerInterceptor.java:229)
	at $Proxy3.generate(Unknown Source)
	at sun.reflect.GeneratedMethodAccessor89.invoke(Unknown Source)
	at sun.reflect.DelegatingMethodAccessorImpl.invoke(DelegatingMethodAccessorImpl.java:25)
	at java.lang.reflect.Method.invoke(Method.java:597)
	at org.apache.maven.plugins.site.ReportDocumentRenderer.generateMultiPage(ReportDocumentRenderer.java:226)
	at org.apache.maven.plugins.site.ReportDocumentRenderer.renderDocument(ReportDocumentRenderer.java:157)
	at org.apache.maven.doxia.siterenderer.DefaultSiteRenderer.renderModule(DefaultSiteRenderer.java:330)
	at org.apache.maven.doxia.siterenderer.DefaultSiteRenderer.render(DefaultSiteRenderer.java:134)
	at org.apache.maven.plugins.site.SiteMojo.renderLocale(SiteMojo.java:154)
	at org.apache.maven.plugins.site.SiteMojo.execute(SiteMojo.java:118)
	at org.apache.maven.plugin.DefaultPluginManager.executeMojo(DefaultPluginManager.java:490)
	at hudson.maven.agent.PluginManagerInterceptor.executeMojo(PluginManagerInterceptor.java:182)
	at org.apache.maven.lifecycle.DefaultLifecycleExecutor.executeGoals(DefaultLifecycleExecutor.java:694)
	at org.apache.maven.lifecycle.DefaultLifecycleExecutor.executeGoalWithLifecycle(DefaultLifecycleExecutor.java:556)
	at org.apache.maven.lifecycle.DefaultLifecycleExecutor.executeGoal(DefaultLifecycleExecutor.java:535)
	at org.apache.maven.lifecycle.DefaultLifecycleExecutor.executeGoalAndHandleFailures(DefaultLifecycleExecutor.java:387)
	at org.apache.maven.lifecycle.DefaultLifecycleExecutor.executeTaskSegments(DefaultLifecycleExecutor.java:348)
	at org.apache.maven.lifecycle.DefaultLifecycleExecutor.execute(DefaultLifecycleExecutor.java:180)
	at org.apache.maven.lifecycle.LifecycleExecutorInterceptor.execute(LifecycleExecutorInterceptor.java:65)
	at org.apache.maven.DefaultMaven.doExecute(DefaultMaven.java:328)
	at org.apache.maven.DefaultMaven.execute(DefaultMaven.java:138)
	at org.apache.maven.cli.MavenCli.main(MavenCli.java:362)
	at sun.reflect.NativeMethodAccessorImpl.invoke0(Native Method)
	at sun.reflect.NativeMethodAccessorImpl.invoke(NativeMethodAccessorImpl.java:39)
	at sun.reflect.DelegatingMethodAccessorImpl.invoke(DelegatingMethodAccessorImpl.java:25)
	at java.lang.reflect.Method.invoke(Method.java:597)
	at org.codehaus.classworlds.Launcher.launchEnhanced(Launcher.java:315)
	at org.codehaus.classworlds.Launcher.launch(Launcher.java:255)
	at hudson.maven.agent.Main.launch(Main.java:185)
	at hudson.maven.MavenBuilder.call(MavenBuilder.java:151)
	at hudson.maven.Maven2Builder.call(Maven2Builder.java:77)
	at hudson.maven.Maven2Builder.call(Maven2Builder.java:53)
	at hudson.remoting.UserRequest.perform(UserRequest.java:118)
	at hudson.remoting.UserRequest.perform(UserRequest.java:48)
	at hudson.remoting.Request$2.run(Request.java:287)
	at hudson.remoting.InterceptingExecutorService$1.call(InterceptingExecutorService.java:72)
	at java.util.concurrent.FutureTask$Sync.innerRun(FutureTask.java:303)
	at java.util.concurrent.FutureTask.run(FutureTask.java:138)
	at java.util.concurrent.ThreadPoolExecutor$Worker.runTask(ThreadPoolExecutor.java:886)
	at java.util.concurrent.ThreadPoolExecutor$Worker.run(ThreadPoolExecutor.java:908)
	at java.lang.Thread.run(Thread.java:662)
[INFO] Generating "Mailing Lists" report.
[INFO] Generating "Project Team" report.
[INFO] Generating "Dependency Convergence" report.
[INFO] Generating "Source Repository" report.
[INFO] Generating "Plugin Management" report.
[INFO] Generating "Project Summary" report.
[INFO] Generating "JavaDocs" report.
Loading source files for package org.apache.clerezza.rdf.jena.tdb.storage...
Constructing Javadoc information...
Standard Doclet version 1.6.0_27
Building tree for all the packages and classes...
Generating <https://builds.apache.org/job/clerezza-site/ws/trunk-1.6/rdf.jena.tdb.storage/target/site/apidocs/org/apache/clerezza/rdf/jena/tdb/storage//TdbTcProvider.html...>
Generating <https://builds.apache.org/job/clerezza-site/ws/trunk-1.6/rdf.jena.tdb.storage/target/site/apidocs/org/apache/clerezza/rdf/jena/tdb/storage//package-frame.html...>
Generating <https://builds.apache.org/job/clerezza-site/ws/trunk-1.6/rdf.jena.tdb.storage/target/site/apidocs/org/apache/clerezza/rdf/jena/tdb/storage//package-summary.html...>
Generating <https://builds.apache.org/job/clerezza-site/ws/trunk-1.6/rdf.jena.tdb.storage/target/site/apidocs/org/apache/clerezza/rdf/jena/tdb/storage//package-tree.html...>
Generating <https://builds.apache.org/job/clerezza-site/ws/trunk-1.6/rdf.jena.tdb.storage/target/site/apidocs/constant-values.html...>
Generating <https://builds.apache.org/job/clerezza-site/ws/trunk-1.6/rdf.jena.tdb.storage/target/site/apidocs/org/apache/clerezza/rdf/jena/tdb/storage//class-use/TdbTcProvider.html...>
Generating <https://builds.apache.org/job/clerezza-site/ws/trunk-1.6/rdf.jena.tdb.storage/target/site/apidocs/org/apache/clerezza/rdf/jena/tdb/storage//package-use.html...>
Building index for all the packages and classes...
Generating <https://builds.apache.org/job/clerezza-site/ws/trunk-1.6/rdf.jena.tdb.storage/target/site/apidocs/overview-tree.html...>
Generating <https://builds.apache.org/job/clerezza-site/ws/trunk-1.6/rdf.jena.tdb.storage/target/site/apidocs/index-all.html...>
Generating <https://builds.apache.org/job/clerezza-site/ws/trunk-1.6/rdf.jena.tdb.storage/target/site/apidocs/deprecated-list.html...>
Building index for all classes...
Generating <https://builds.apache.org/job/clerezza-site/ws/trunk-1.6/rdf.jena.tdb.storage/target/site/apidocs/allclasses-frame.html...>
[JENKINS] Archiving  javadocGenerating <https://builds.apache.org/job/clerezza-site/ws/trunk-1.6/rdf.jena.tdb.storage/target/site/apidocs/allclasses-noframe.html...>
Generating <https://builds.apache.org/job/clerezza-site/ws/trunk-1.6/rdf.jena.tdb.storage/target/site/apidocs/index.html...>
Generating <https://builds.apache.org/job/clerezza-site/ws/trunk-1.6/rdf.jena.tdb.storage/target/site/apidocs/help-doc.html...>
Generating <https://builds.apache.org/job/clerezza-site/ws/trunk-1.6/rdf.jena.tdb.storage/target/site/apidocs/stylesheet.css...>
3 warnings
[WARNING] Javadoc Warnings
[WARNING] <https://builds.apache.org/job/clerezza-site/ws/trunk-1.6/rdf.jena.tdb.storage/src/main/java/org/apache/clerezza/rdf/jena/tdb/storage/TdbTcProvider.java>:70:
warning - @scr.component is an unknown tag.
[WARNING] <https://builds.apache.org/job/clerezza-site/ws/trunk-1.6/rdf.jena.tdb.storage/src/main/java/org/apache/clerezza/rdf/jena/tdb/storage/TdbTcProvider.java>:70:
warning - @scr.service is an unknown tag.
[WARNING] <https://builds.apache.org/job/clerezza-site/ws/trunk-1.6/rdf.jena.tdb.storage/src/main/java/org/apache/clerezza/rdf/jena/tdb/storage/TdbTcProvider.java>:70:
warning - @scr.property is an unknown tag.

[INFO] Generating "Test JavaDocs" report.
Loading source files for package org.apache.clerezza.rdf.jena.tdb.storage...
Constructing Javadoc information...
Standard Doclet version 1.6.0_27
Building tree for all the packages and classes...
Generating <https://builds.apache.org/job/clerezza-site/ws/trunk-1.6/rdf.jena.tdb.storage/target/site/testapidocs/org/apache/clerezza/rdf/jena/tdb/storage//MultiThreadedTest.html...>
Generating <https://builds.apache.org/job/clerezza-site/ws/trunk-1.6/rdf.jena.tdb.storage/target/site/testapidocs/org/apache/clerezza/rdf/jena/tdb/storage//TdbMGraphTest.html...>
Generating <https://builds.apache.org/job/clerezza-site/ws/trunk-1.6/rdf.jena.tdb.storage/target/site/testapidocs/org/apache/clerezza/rdf/jena/tdb/storage//TdbTcProviderTest.html...>
Generating <https://builds.apache.org/job/clerezza-site/ws/trunk-1.6/rdf.jena.tdb.storage/target/site/testapidocs/org/apache/clerezza/rdf/jena/tdb/storage//package-frame.html...>
Generating <https://builds.apache.org/job/clerezza-site/ws/trunk-1.6/rdf.jena.tdb.storage/target/site/testapidocs/org/apache/clerezza/rdf/jena/tdb/storage//package-summary.html...>
Generating <https://builds.apache.org/job/clerezza-site/ws/trunk-1.6/rdf.jena.tdb.storage/target/site/testapidocs/org/apache/clerezza/rdf/jena/tdb/storage//package-tree.html...>
Generating <https://builds.apache.org/job/clerezza-site/ws/trunk-1.6/rdf.jena.tdb.storage/target/site/testapidocs/constant-values.html...>
Generating <https://builds.apache.org/job/clerezza-site/ws/trunk-1.6/rdf.jena.tdb.storage/target/site/testapidocs/org/apache/clerezza/rdf/jena/tdb/storage//class-use/TdbTcProviderTest.html...>
Generating <https://builds.apache.org/job/clerezza-site/ws/trunk-1.6/rdf.jena.tdb.storage/target/site/testapidocs/org/apache/clerezza/rdf/jena/tdb/storage//class-use/MultiThreadedTest.html...>
Generating <https://builds.apache.org/job/clerezza-site/ws/trunk-1.6/rdf.jena.tdb.storage/target/site/testapidocs/org/apache/clerezza/rdf/jena/tdb/storage//class-use/TdbMGraphTest.html...>
Generating <https://builds.apache.org/job/clerezza-site/ws/trunk-1.6/rdf.jena.tdb.storage/target/site/testapidocs/org/apache/clerezza/rdf/jena/tdb/storage//package-use.html...>
Building index for all the packages and classes...
Generating <https://builds.apache.org/job/clerezza-site/ws/trunk-1.6/rdf.jena.tdb.storage/target/site/testapidocs/overview-tree.html...>
Generating <https://builds.apache.org/job/clerezza-site/ws/trunk-1.6/rdf.jena.tdb.storage/target/site/testapidocs/index-all.html...>
Generating <https://builds.apache.org/job/clerezza-site/ws/trunk-1.6/rdf.jena.tdb.storage/target/site/testapidocs/deprecated-list.html...>
Building index for all classes...
Generating <https://builds.apache.org/job/clerezza-site/ws/trunk-1.6/rdf.jena.tdb.storage/target/site/testapidocs/allclasses-frame.html...>
Generating <https://builds.apache.org/job/clerezza-site/ws/trunk-1.6/rdf.jena.tdb.storage/target/site/testapidocs/allclasses-noframe.html...>
Generating <https://builds.apache.org/job/clerezza-site/ws/trunk-1.6/rdf.jena.tdb.storage/target/site/testapidocs/index.html...>
Generating <https://builds.apache.org/job/clerezza-site/ws/trunk-1.6/rdf.jena.tdb.storage/target/site/testapidocs/help-doc.html...>
Generating <https://builds.apache.org/job/clerezza-site/ws/trunk-1.6/rdf.jena.tdb.storage/target/site/testapidocs/stylesheet.css...>
[JENKINS] Archiving  javadoc
[INFO] Generating "Maven Surefire Report" report.
[WARNING] Unable to locate Test Source XRef to link to - DISABLED
[INFO] Generating "CPD Report" report.
[WARNING] Unable to locate Source XRef to link to - DISABLED
[INFO] Generating "PMD Report" report.
[WARNING] Unable to locate Source XRef to link to - DISABLED
[INFO] Generating "JaxRs Report" report.
[JENKINS] Archiving site from <https://builds.apache.org/job/clerezza-site/ws/trunk-1.6/rdf.jena.tdb.storage/target/site>
to /home/hudson/hudson/jobs/clerezza-site/site/rdf.jena.tdb.storage
[INFO] ------------------------------------------------------------------------
[INFO] Building Clerezza - Platform Launcher with Jena TDB
[INFO]    task-segment: [install, site]
[INFO] ------------------------------------------------------------------------
[INFO] [dependency:unpack-dependencies {execution: inline-jars}]
[INFO] Unpacking <https://builds.apache.org/job/clerezza-site/ws/trunk-1.6/platform.launcher.storageless.parent/platform.launcher.storageless/target/platform.launcher.storageless-0.9-incubating-SNAPSHOT.jar>
to
  <https://builds.apache.org/job/clerezza-site/ws/trunk-1.6/platform.launcher.tdb/target/extracted>
   with includes ** and excludes:META-INF/**,**/com.hp.hpl.jena*
[INFO] [dependency:copy-dependencies {execution: copy-platform-bundles}]
[INFO] Installing /home/jenkins/.m2/repository/org/apache/clerezza/rdf.jena.tdb.storage/0.6-incubating-SNAPSHOT/rdf.jena.tdb.storage-0.6-incubating-SNAPSHOT.jar
to <https://builds.apache.org/job/clerezza-site/ws/trunk-1.6/platform.launcher.tdb/target/bundles/startlevel-3/org/apache/clerezza/rdf.jena.tdb.storage/0.6-incubating-SNAPSHOT/rdf.jena.tdb.storage-0.6-incubating-SNAPSHOT.jar>
[INFO] Installing /home/jenkins/.m2/repository/org/apache/clerezza/ext/com.hp.hpl.jena.tdb/0.4-incubating-SNAPSHOT/com.hp.hpl.jena.tdb-0.4-incubating-SNAPSHOT.jar
to <https://builds.apache.org/job/clerezza-site/ws/trunk-1.6/platform.launcher.tdb/target/bundles/startlevel-3/org/apache/clerezza/ext/com.hp.hpl.jena.tdb/0.4-incubating-SNAPSHOT/com.hp.hpl.jena.tdb-0.4-incubating-SNAPSHOT.jar>
[INFO] [remote-resources:process {execution: default}]
[INFO] [resources:resources {execution: default-resources}]
[INFO] Using 'utf-8' encoding to copy filtered resources.
[INFO] Copying 651 resources
[INFO] Copying 0 resource to META-INF
[INFO] Copying 13 resources to bundles
[INFO] Copying 3 resources
[INFO] [compiler:compile {execution: default-compile}]
[INFO] No sources to compile
[INFO] [scr:scr {execution: generate-scr-scrdescriptor}]
[WARNING] Source tree does not exist. Ignoring <https://builds.apache.org/job/clerezza-site/ws/trunk-1.6/platform.launcher.tdb/src/main/java>
[INFO] [resources:testResources {execution: default-testResources}]
[INFO] Using 'utf-8' encoding to copy filtered resources.
[INFO] skip non existing resourceDirectory <https://builds.apache.org/job/clerezza-site/ws/trunk-1.6/platform.launcher.tdb/src/test/resources>
[INFO] Copying 3 resources
[INFO] [compiler:testCompile {execution: default-testCompile}]
[INFO] No sources to compile
[INFO] [surefire:test {execution: default-test}]
[INFO] Surefire report directory: <https://builds.apache.org/job/clerezza-site/ws/trunk-1.6/platform.launcher.tdb/target/surefire-reports>

-------------------------------------------------------
 T E S T S
-------------------------------------------------------
There are no tests to run.

Results :

Tests run: 0, Failures: 0, Errors: 0, Skipped: 0

[JENKINS] Recording test results
[INFO] [jar:jar {execution: default-jar}]
[INFO] Building jar: <https://builds.apache.org/job/clerezza-site/ws/trunk-1.6/platform.launcher.tdb/target/platform.launcher.tdb-0.6-incubating-SNAPSHOT.jar>
[INFO] Preparing source:jar
[WARNING] Removing: jar from forked lifecycle, to prevent recursive invocation.
[INFO] No goals needed for project - skipping
[INFO] [source:jar {execution: default}]
[INFO] Building jar: <https://builds.apache.org/job/clerezza-site/ws/trunk-1.6/platform.launcher.tdb/target/platform.launcher.tdb-0.6-incubating-SNAPSHOT-sources.jar>
[INFO] [assembly:single {execution: make-assembly}]
[INFO] Reading assembly descriptor: src/main/assembly/src.xml
[INFO] clerezza-tdb/LICENSE already added, skipping
[INFO] Building zip: <https://builds.apache.org/job/clerezza-site/ws/trunk-1.6/platform.launcher.tdb/target/clerezza-tdb-distribution.zip>
[INFO] clerezza-tdb/LICENSE already added, skipping
[INFO] [install:install {execution: default-install}]
[INFO] Installing <https://builds.apache.org/job/clerezza-site/ws/trunk-1.6/platform.launcher.tdb/target/platform.launcher.tdb-0.6-incubating-SNAPSHOT.jar>
to /home/jenkins/.m2/repository/org/apache/clerezza/platform.launcher.tdb/0.6-incubating-SNAPSHOT/platform.launcher.tdb-0.6-incubating-SNAPSHOT.jar
[INFO] Installing <https://builds.apache.org/job/clerezza-site/ws/trunk-1.6/platform.launcher.tdb/target/platform.launcher.tdb-0.6-incubating-SNAPSHOT-sources.jar>
to /home/jenkins/.m2/repository/org/apache/clerezza/platform.launcher.tdb/0.6-incubating-SNAPSHOT/platform.launcher.tdb-0.6-incubating-SNAPSHOT-sources.jar
[INFO] Installing <https://builds.apache.org/job/clerezza-site/ws/trunk-1.6/platform.launcher.tdb/target/clerezza-tdb-distribution.zip>
to /home/jenkins/.m2/repository/org/apache/clerezza/platform.launcher.tdb/0.6-incubating-SNAPSHOT/platform.launcher.tdb-0.6-incubating-SNAPSHOT-distribution.zip
[INFO] [xsite:run {execution: default}]
Skinning information.xhtml (Clerezza platform launcher with Jena TDB storage)
[INFO] Preparing surefire-report:report
[JENKINS] Archiving <https://builds.apache.org/job/clerezza-site/ws/trunk-1.6/platform.launcher.tdb/pom.xml>
to /home/hudson/hudson/jobs/clerezza-site/modules/org.apache.clerezza$platform.launcher.tdb/builds/2012-02-20_17-27-57/archive/org.apache.clerezza/platform.launcher.tdb/0.6-incubating-SNAPSHOT/platform.launcher.tdb-0.6-incubating-SNAPSHOT.pom
[JENKINS] Archiving <https://builds.apache.org/job/clerezza-site/ws/trunk-1.6/platform.launcher.tdb/target/platform.launcher.tdb-0.6-incubating-SNAPSHOT.jar>
to /home/hudson/hudson/jobs/clerezza-site/modules/org.apache.clerezza$platform.launcher.tdb/builds/2012-02-20_17-27-57/archive/org.apache.clerezza/platform.launcher.tdb/0.6-incubating-SNAPSHOT/platform.launcher.tdb-0.6-incubating-SNAPSHOT.jar
[JENKINS] Archiving <https://builds.apache.org/job/clerezza-site/ws/trunk-1.6/platform.launcher.tdb/target/platform.launcher.tdb-0.6-incubating-SNAPSHOT-sources.jar>
to /home/hudson/hudson/jobs/clerezza-site/modules/org.apache.clerezza$platform.launcher.tdb/builds/2012-02-20_17-27-57/archive/org.apache.clerezza/platform.launcher.tdb/0.6-incubating-SNAPSHOT/platform.launcher.tdb-0.6-incubating-SNAPSHOT-sources.jar
[JENKINS] Archiving <https://builds.apache.org/job/clerezza-site/ws/trunk-1.6/platform.launcher.tdb/target/clerezza-tdb-distribution.zip>
to /home/hudson/hudson/jobs/clerezza-site/modules/org.apache.clerezza$platform.launcher.tdb/builds/2012-02-20_17-27-57/archive/org.apache.clerezza/platform.launcher.tdb/0.6-incubating-SNAPSHOT/platform.launcher.tdb-0.6-incubating-SNAPSHOT-distribution.zip
Build timed out (after 152 minutes). Marking the build as failed.
[INFO] ------------------------------------------------------------------------
[ERROR] FATAL ERROR
[INFO] ------------------------------------------------------------------------
channel stopped
[INFO] hudson.remoting.RequestAbortedException: hudson.remoting.Channel$OrderlyShutdown
[INFO] ------------------------------------------------------------------------
[INFO] Trace
hudson.remoting.RequestAbortedException: hudson.remoting.RequestAbortedException: hudson.remoting.Channel$OrderlyShutdown
	at hudson.remoting.Request.call(Request.java:149)
	at hudson.remoting.Channel.call(Channel.java:681)
	at hudson.remoting.RemoteInvocationHandler.invoke(RemoteInvocationHandler.java:158)
	at $Proxy2.isArchivingDisabled(Unknown Source)
	at hudson.maven.MavenBuildProxy$Filter.isArchivingDisabled(MavenBuildProxy.java:227)
	at hudson.maven.reporters.MavenArtifact.archive(MavenArtifact.java:216)
	at hudson.maven.reporters.MavenArtifactArchiver.postBuild(MavenArtifactArchiver.java:106)
	at hudson.maven.Maven2Builder.postModule(Maven2Builder.java:127)
	at hudson.maven.MavenBuilder$Adapter.fireLeaveModule(MavenBuilder.java:327)
	at hudson.maven.MavenBuilder$Adapter.postBuild(MavenBuilder.java:285)
	at org.apache.maven.lifecycle.LifecycleExecutorInterceptor.execute(LifecycleExecutorInterceptor.java:68)
	at org.apache.maven.DefaultMaven.doExecute(DefaultMaven.java:328)
	at org.apache.maven.DefaultMaven.execute(DefaultMaven.java:138)
	at org.apache.maven.cli.MavenCli.main(MavenCli.java:362)
	at sun.reflect.NativeMethodAccessorImpl.invoke0(Native Method)
	at sun.reflect.NativeMethodAccessorImpl.invoke(NativeMethodAccessorImpl.java:39)
	at sun.reflect.DelegatingMethodAccessorImpl.invoke(DelegatingMethodAccessorImpl.java:25)
	at java.lang.reflect.Method.invoke(Method.java:597)
	at org.codehaus.classworlds.Launcher.launchEnhanced(Launcher.java:315)
	at org.codehaus.classworlds.Launcher.launch(Launcher.java:255)
	at hudson.maven.agent.Main.launch(Main.java:185)
	at hudson.maven.MavenBuilder.call(MavenBuilder.java:151)
	at hudson.maven.Maven2Builder.call(Maven2Builder.java:77)
	at hudson.maven.Maven2Builder.call(Maven2Builder.java:53)
	at hudson.remoting.UserRequest.perform(UserRequest.java:118)
	at hudson.remoting.UserRequest.perform(UserRequest.java:48)
	at hudson.remoting.Request$2.run(Request.java:287)
	at hudson.remoting.InterceptingExecutorService$1.call(InterceptingExecutorService.java:72)
	at java.util.concurrent.FutureTask$Sync.innerRun(FutureTask.java:303)
	at java.util.concurrent.FutureTask.run(FutureTask.java:138)
	at java.util.concurrent.ThreadPoolExecutor$Worker.runTask(ThreadPoolExecutor.java:886)
	at java.util.concurrent.ThreadPoolExecutor$Worker.run(ThreadPoolExecutor.java:908)
	at java.lang.Thread.run(Thread.java:662)
Caused by: hudson.remoting.RequestAbortedException: hudson.remoting.Channel$OrderlyShutdown
	at hudson.remoting.Request.abort(Request.java:273)
	at hudson.remoting.Channel.terminate(Channel.java:732)
	at hudson.remoting.Channel$CloseCommand.execute(Channel.java:848)
	at hudson.remoting.Channel$ReaderThread.run(Channel.java:1146)
Caused by: hudson.remoting.Channel$OrderlyShutdown
	... 2 more
Caused by: Command close created at
	at hudson.remoting.Command.<init>(Command.java:51)
	at hudson.remoting.Channel$CloseCommand.<init>(Channel.java:842)
	at hudson.remoting.Channel$CloseCommand.<init>(Channel.java:840)
	at hudson.remoting.Channel.close(Channel.java:907)
	at hudson.remoting.Channel.close(Channel.java:890)
	at hudson.slaves.Channels$1.close(Channels.java:91)
	at hudson.maven.ProcessCache$MavenProcess.discard(ProcessCache.java:145)
	at hudson.maven.MavenModuleSetBuild$RunnerImpl.doRun(MavenModuleSetBuild.java:800)
	at hudson.model.AbstractBuild$AbstractRunner.run(AbstractBuild.java:470)
	at hudson.model.Run.run(Run.java:1409)
	at hudson.maven.MavenModuleSetBuild.run(MavenModuleSetBuild.java:481)
	at hudson.model.ResourceController.execute(ResourceController.java:88)
	at hudson.model.Executor.run(Executor.java:238)
[INFO] ------------------------------------------------------------------------
[INFO] Total time: 150 minutes 39 seconds
[INFO] Finished at: Mon Feb 20 19:59:55 UTC 2012
[INFO] Final Memory: 461M/960M
[INFO] ------------------------------------------------------------------------
[locks-and-latches] Releasing all the locks
[locks-and-latches] All the locks released


Mime
View raw message