clerezza-commits mailing list archives

Site index · List index
Message view « Date » · « Thread »
Top « Date » · « Thread »
From Apache Jenkins Server <jenk...@builds.apache.org>
Subject Build failed in Jenkins: clerezza-site #425
Date Sat, 28 Jan 2012 14:15:55 GMT
See <https://builds.apache.org/job/clerezza-site/425/changes>

Changes:

[reto] CLEREZZA-679: removed empty NOTICE files

[reto] CLEREZZA-679: cleaned NOTICE files

[reto] CLEREZZA-679: removed empty notice files

[reto] CLEREZZA-679: reverted too aggressive cleaning

------------------------------------------
[...truncated 33417 lines...]
[INFO] [remote-resources:process {execution: default}]
[INFO] [scr:scr {execution: generate-scr-scrdescriptor}]
[WARNING] Source tree does not exist. Ignoring <https://builds.apache.org/job/clerezza-site/ws/trunk-1.6/platform.language/src/main/java>
[INFO] Preparing surefire-report:report-only
[INFO] No goals needed for project - skipping
[INFO] Preparing plugin:report
[INFO] [remote-resources:process {execution: default}]
[INFO] [site:site {execution: default-site}]
[INFO] Parent project loaded from repository: org.apache:apache:pom:10
[INFO] Skipped "Maven Surefire Report" report, file "surefire-report.html" already exists
for the English version.
[INFO] Generating "Distribution Management" report.
[INFO] Generating "About" report.
[INFO] Generating "Dependencies" report.
[INFO] Generating "Issue Tracking" report.
[INFO] Generating "Project Plugins" report.
[INFO] Generating "Continuous Integration" report.
[INFO] Generating "Project License" report.
[INFO] Generating "Dependency Management" report.
[WARNING] Unable to create Maven project for org.osgi:org.osgi.core:pom:4.3.0 from repository.
org.apache.maven.project.InvalidProjectModelException: Not a v4.0.0 POM. for project org.osgi:org.osgi.core
at /home/jenkins/.m2/repository/org/osgi/org.osgi.core/4.3.0/org.osgi.core-4.3.0.pom
	at org.apache.maven.project.DefaultMavenProjectBuilder.readModel(DefaultMavenProjectBuilder.java:1599)
	at org.apache.maven.project.DefaultMavenProjectBuilder.readModel(DefaultMavenProjectBuilder.java:1571)
	at org.apache.maven.project.DefaultMavenProjectBuilder.findModelFromRepository(DefaultMavenProjectBuilder.java:562)
	at org.apache.maven.project.DefaultMavenProjectBuilder.buildFromRepository(DefaultMavenProjectBuilder.java:251)
	at org.apache.maven.report.projectinfo.dependencies.RepositoryUtils.getMavenProjectFromRepository(RepositoryUtils.java:298)
	at org.apache.maven.report.projectinfo.dependencies.renderer.DependencyManagementRenderer.getDependencyRow(DependencyManagementRenderer.java:237)
	at org.apache.maven.report.projectinfo.dependencies.renderer.DependencyManagementRenderer.renderDependenciesForScope(DependencyManagementRenderer.java:204)
	at org.apache.maven.report.projectinfo.dependencies.renderer.DependencyManagementRenderer.renderDependenciesForAllScopes(DependencyManagementRenderer.java:153)
	at org.apache.maven.report.projectinfo.dependencies.renderer.DependencyManagementRenderer.renderSectionProjectDependencies(DependencyManagementRenderer.java:146)
	at org.apache.maven.report.projectinfo.dependencies.renderer.DependencyManagementRenderer.renderBody(DependencyManagementRenderer.java:132)
	at org.apache.maven.reporting.AbstractMavenReportRenderer.render(AbstractMavenReportRenderer.java:79)
	at org.apache.maven.report.projectinfo.DependencyManagementReport.executeReport(DependencyManagementReport.java:116)
	at org.apache.maven.reporting.AbstractMavenReport.generate(AbstractMavenReport.java:190)
	at sun.reflect.GeneratedMethodAccessor98.invoke(Unknown Source)
	at sun.reflect.DelegatingMethodAccessorImpl.invoke(DelegatingMethodAccessorImpl.java:25)
	at java.lang.reflect.Method.invoke(Method.java:597)
	at hudson.maven.agent.ComponentInterceptor.invoke(ComponentInterceptor.java:47)
	at hudson.maven.agent.PluginManagerInterceptor$3.invoke(PluginManagerInterceptor.java:229)
	at $Proxy3.generate(Unknown Source)
	at sun.reflect.GeneratedMethodAccessor468.invoke(Unknown Source)
	at sun.reflect.DelegatingMethodAccessorImpl.invoke(DelegatingMethodAccessorImpl.java:25)
	at java.lang.reflect.Method.invoke(Method.java:597)
	at org.apache.maven.plugins.site.ReportDocumentRenderer.generateMultiPage(ReportDocumentRenderer.java:226)
	at org.apache.maven.plugins.site.ReportDocumentRenderer.renderDocument(ReportDocumentRenderer.java:157)
	at org.apache.maven.doxia.siterenderer.DefaultSiteRenderer.renderModule(DefaultSiteRenderer.java:330)
	at org.apache.maven.doxia.siterenderer.DefaultSiteRenderer.render(DefaultSiteRenderer.java:134)
	at org.apache.maven.plugins.site.SiteMojo.renderLocale(SiteMojo.java:154)
	at org.apache.maven.plugins.site.SiteMojo.execute(SiteMojo.java:118)
	at org.apache.maven.plugin.DefaultPluginManager.executeMojo(DefaultPluginManager.java:490)
	at hudson.maven.agent.PluginManagerInterceptor.executeMojo(PluginManagerInterceptor.java:182)
	at org.apache.maven.lifecycle.DefaultLifecycleExecutor.executeGoals(DefaultLifecycleExecutor.java:694)
	at org.apache.maven.lifecycle.DefaultLifecycleExecutor.executeGoalWithLifecycle(DefaultLifecycleExecutor.java:556)
	at org.apache.maven.lifecycle.DefaultLifecycleExecutor.executeGoal(DefaultLifecycleExecutor.java:535)
	at org.apache.maven.lifecycle.DefaultLifecycleExecutor.executeGoalAndHandleFailures(DefaultLifecycleExecutor.java:387)
	at org.apache.maven.lifecycle.DefaultLifecycleExecutor.executeTaskSegments(DefaultLifecycleExecutor.java:348)
	at org.apache.maven.lifecycle.DefaultLifecycleExecutor.execute(DefaultLifecycleExecutor.java:180)
	at org.apache.maven.lifecycle.LifecycleExecutorInterceptor.execute(LifecycleExecutorInterceptor.java:65)
	at org.apache.maven.DefaultMaven.doExecute(DefaultMaven.java:328)
	at org.apache.maven.DefaultMaven.execute(DefaultMaven.java:138)
	at org.apache.maven.cli.MavenCli.main(MavenCli.java:362)
	at sun.reflect.NativeMethodAccessorImpl.invoke0(Native Method)
	at sun.reflect.NativeMethodAccessorImpl.invoke(NativeMethodAccessorImpl.java:39)
	at sun.reflect.DelegatingMethodAccessorImpl.invoke(DelegatingMethodAccessorImpl.java:25)
	at java.lang.reflect.Method.invoke(Method.java:597)
	at org.codehaus.classworlds.Launcher.launchEnhanced(Launcher.java:315)
	at org.codehaus.classworlds.Launcher.launch(Launcher.java:255)
	at hudson.maven.agent.Main.launch(Main.java:185)
	at hudson.maven.MavenBuilder.call(MavenBuilder.java:151)
	at hudson.maven.Maven2Builder.call(Maven2Builder.java:77)
	at hudson.maven.Maven2Builder.call(Maven2Builder.java:53)
	at hudson.remoting.UserRequest.perform(UserRequest.java:118)
	at hudson.remoting.UserRequest.perform(UserRequest.java:48)
	at hudson.remoting.Request$2.run(Request.java:287)
	at java.util.concurrent.Executors$RunnableAdapter.call(Executors.java:441)
	at java.util.concurrent.FutureTask$Sync.innerRun(FutureTask.java:303)
	at java.util.concurrent.FutureTask.run(FutureTask.java:138)
	at java.util.concurrent.ThreadPoolExecutor$Worker.runTask(ThreadPoolExecutor.java:886)
	at java.util.concurrent.ThreadPoolExecutor$Worker.run(ThreadPoolExecutor.java:908)
	at java.lang.Thread.run(Thread.java:662)
[INFO] Generating "Mailing Lists" report.
[INFO] Generating "Project Team" report.
[INFO] Generating "Dependency Convergence" report.
[INFO] Generating "Source Repository" report.
[INFO] Generating "Plugin Management" report.
[INFO] Generating "Project Modules" report.
[INFO] Generating "Project Summary" report.
[INFO] Generating "Maven Surefire Report" report.
[WARNING] Unable to locate Test Source XRef to link to - DISABLED
[INFO] Generating "CPD Report" report.
[WARNING] Unable to locate Source XRef to link to - DISABLED
[INFO] Generating "PMD Report" report.
[WARNING] Unable to locate Source XRef to link to - DISABLED
[INFO] Generating "JaxRs Report" report.
[JENKINS] Archiving site from <https://builds.apache.org/job/clerezza-site/ws/trunk-1.6/platform.language/target/site>
to /home/hudson/hudson/jobs/clerezza-site/site/platform.language
[INFO] ------------------------------------------------------------------------
[INFO] Building Clerezza - Platform Language Ontologies
[INFO]    task-segment: [install, site]
[INFO] ------------------------------------------------------------------------
[INFO] [ontologies:generate {execution: default}]
[INFO] Source directory: <https://builds.apache.org/job/clerezza-site/ws/trunk-1.6/platform.language/platform.language.ontologies/target/generated-sources/main/java>
added.
[INFO] [remote-resources:process {execution: default}]
[INFO] [resources:resources {execution: default-resources}]
[INFO] Using 'utf-8' encoding to copy filtered resources.
[INFO] Copying 0 resource to META-INF
[INFO] Copying 1 resource
[INFO] Copying 3 resources
[INFO] [compiler:compile {execution: default-compile}]
[INFO] Compiling 1 source file to <https://builds.apache.org/job/clerezza-site/ws/trunk-1.6/platform.language/platform.language.ontologies/target/classes>
[INFO] [scr:scr {execution: generate-scr-scrdescriptor}]
[WARNING] Source tree does not exist. Ignoring <https://builds.apache.org/job/clerezza-site/ws/trunk-1.6/platform.language/platform.language.ontologies/src/main/java>
[INFO] [resources:testResources {execution: default-testResources}]
[INFO] Using 'utf-8' encoding to copy filtered resources.
[INFO] skip non existing resourceDirectory <https://builds.apache.org/job/clerezza-site/ws/trunk-1.6/platform.language/platform.language.ontologies/src/test/resources>
[INFO] Copying 3 resources
[INFO] [compiler:testCompile {execution: default-testCompile}]
[INFO] No sources to compile
[INFO] [surefire:test {execution: default-test}]
[INFO] Surefire report directory: <https://builds.apache.org/job/clerezza-site/ws/trunk-1.6/platform.language/platform.language.ontologies/target/surefire-reports>

-------------------------------------------------------
 T E S T S
-------------------------------------------------------
There are no tests to run.

Results :

Tests run: 0, Failures: 0, Errors: 0, Skipped: 0

[INFO] [bundle:bundle {execution: default-bundle}]
[INFO] Preparing source:jar
[WARNING] Removing: jar from forked lifecycle, to prevent recursive invocation.
[JENKINS] Recording test results
[JENKINS] Archiving <https://builds.apache.org/job/clerezza-site/ws/trunk-1.6/platform.language/platform.language.ontologies/pom.xml>
to /home/hudson/hudson/jobs/clerezza-site/modules/org.apache.clerezza$platform.language.ontologies/builds/2012-01-28_12-00-34/archive/org.apache.clerezza/platform.language.ontologies/0.2-incubating-SNAPSHOT/platform.language.ontologies-0.2-incubating-SNAPSHOT.pom
[JENKINS] Archiving <https://builds.apache.org/job/clerezza-site/ws/trunk-1.6/platform.language/platform.language.ontologies/target/platform.language.ontologies-0.2-incubating-SNAPSHOT.jar>
to /home/hudson/hudson/jobs/clerezza-site/modules/org.apache.clerezza$platform.language.ontologies/builds/2012-01-28_12-00-34/archive/org.apache.clerezza/platform.language.ontologies/0.2-incubating-SNAPSHOT/platform.language.ontologies-0.2-incubating-SNAPSHOT.jar
[INFO] [ontologies:generate {execution: default}]
[INFO] Source directory: <https://builds.apache.org/job/clerezza-site/ws/trunk-1.6/platform.language/platform.language.ontologies/target/generated-sources/main/java>
added.
[INFO] [source:jar {execution: default}]
[INFO] Building jar: <https://builds.apache.org/job/clerezza-site/ws/trunk-1.6/platform.language/platform.language.ontologies/target/platform.language.ontologies-0.2-incubating-SNAPSHOT-sources.jar>
[INFO] [install:install {execution: default-install}]
[INFO] Installing <https://builds.apache.org/job/clerezza-site/ws/trunk-1.6/platform.language/platform.language.ontologies/target/platform.language.ontologies-0.2-incubating-SNAPSHOT.jar>
to /home/jenkins/.m2/repository/org/apache/clerezza/platform.language.ontologies/0.2-incubating-SNAPSHOT/platform.language.ontologies-0.2-incubating-SNAPSHOT.jar
[INFO] Installing <https://builds.apache.org/job/clerezza-site/ws/trunk-1.6/platform.language/platform.language.ontologies/target/platform.language.ontologies-0.2-incubating-SNAPSHOT-sources.jar>
to /home/jenkins/.m2/repository/org/apache/clerezza/platform.language.ontologies/0.2-incubating-SNAPSHOT/platform.language.ontologies-0.2-incubating-SNAPSHOT-sources.jar
[INFO] [bundle:install {execution: default-install}]
[INFO] Installing org/apache/clerezza/platform.language.ontologies/0.2-incubating-SNAPSHOT/platform.language.ontologies-0.2-incubating-SNAPSHOT.jar
[INFO] Writing OBR metadata
[INFO] Preparing surefire-report:report
[JENKINS] Archiving <https://builds.apache.org/job/clerezza-site/ws/trunk-1.6/platform.language/platform.language.ontologies/target/platform.language.ontologies-0.2-incubating-SNAPSHOT-sources.jar>
to /home/hudson/hudson/jobs/clerezza-site/modules/org.apache.clerezza$platform.language.ontologies/builds/2012-01-28_12-00-34/archive/org.apache.clerezza/platform.language.ontologies/0.2-incubating-SNAPSHOT/platform.language.ontologies-0.2-incubating-SNAPSHOT-sources.jar
[INFO] [ontologies:generate {execution: default}]
[INFO] Source directory: <https://builds.apache.org/job/clerezza-site/ws/trunk-1.6/platform.language/platform.language.ontologies/target/generated-sources/main/java>
added.
[INFO] [remote-resources:process {execution: default}]
[INFO] [resources:resources {execution: default-resources}]
[INFO] Using 'utf-8' encoding to copy filtered resources.
[INFO] Copying 0 resource to META-INF
[INFO] Copying 1 resource
[INFO] Copying 3 resources
[INFO] Copying 3 resources
[INFO] [compiler:compile {execution: default-compile}]
[INFO] Compiling 1 source file to <https://builds.apache.org/job/clerezza-site/ws/trunk-1.6/platform.language/platform.language.ontologies/target/classes>
[INFO] [scr:scr {execution: generate-scr-scrdescriptor}]
[WARNING] Source tree does not exist. Ignoring <https://builds.apache.org/job/clerezza-site/ws/trunk-1.6/platform.language/platform.language.ontologies/src/main/java>
[INFO] [resources:testResources {execution: default-testResources}]
[INFO] Using 'utf-8' encoding to copy filtered resources.
[INFO] skip non existing resourceDirectory <https://builds.apache.org/job/clerezza-site/ws/trunk-1.6/platform.language/platform.language.ontologies/src/test/resources>
[INFO] Copying 3 resources
[INFO] Copying 3 resources
[INFO] [compiler:testCompile {execution: default-testCompile}]
[INFO] No sources to compile
[INFO] [surefire:test {execution: default-test}]
[INFO] Surefire report directory: <https://builds.apache.org/job/clerezza-site/ws/trunk-1.6/platform.language/platform.language.ontologies/target/surefire-reports>

-------------------------------------------------------
 T E S T S
-------------------------------------------------------
There are no tests to run.

Results :

Tests run: 0, Failures: 0, Errors: 0, Skipped: 0

[INFO] Preparing surefire-report:report-only
[JENKINS] Recording test results[INFO] No goals needed for project - skipping
[INFO] Preparing plugin:report
[INFO] [ontologies:generate {execution: default}]
[INFO] Source directory: <https://builds.apache.org/job/clerezza-site/ws/trunk-1.6/platform.language/platform.language.ontologies/target/generated-sources/main/java>
added.
[INFO] [remote-resources:process {execution: default}]
[INFO] [resources:resources {execution: default-resources}]
[INFO] Using 'utf-8' encoding to copy filtered resources.
[INFO] Copying 0 resource to META-INF
[INFO] Copying 1 resource
[INFO] Copying 3 resources
[INFO] Copying 3 resources
[INFO] Copying 3 resources
[INFO] [compiler:compile {execution: default-compile}]
[INFO] Compiling 1 source file to <https://builds.apache.org/job/clerezza-site/ws/trunk-1.6/platform.language/platform.language.ontologies/target/classes>

[INFO] ------------------------------------------------------------------------
[ERROR] BUILD FAILURE
[INFO] ------------------------------------------------------------------------
[INFO] Compilation failure
Failure executing javac, but could not parse the error:


The system is out of resources.
Consult the following stack trace for details.
java.lang.OutOfMemoryError: PermGen space
	at java.lang.ClassLoader.defineClass1(Native Method)
	at java.lang.ClassLoader.defineClassCond(ClassLoader.java:631)
	at java.lang.ClassLoader.defineClass(ClassLoader.java:615)
	at java.security.SecureClassLoader.defineClass(SecureClassLoader.java:141)
	at java.net.URLClassLoader.defineClass(URLClassLoader.java:283)
	at java.net.URLClassLoader.access$000(URLClassLoader.java:58)
	at java.net.URLClassLoader$1.run(URLClassLoader.java:197)
	at java.security.AccessController.doPrivileged(Native Method)
	at java.net.URLClassLoader.findClass(URLClassLoader.java:190)
	at org.codehaus.plexus.compiler.javac.IsolatedClassLoader.loadClass(IsolatedClassLoader.java:56)
	at com.sun.tools.javac.jvm.ClassReader.<init>(ClassReader.java:215)
	at com.sun.tools.javac.jvm.ClassReader.instance(ClassReader.java:168)
	at com.sun.tools.javac.main.JavaCompiler.<init>(JavaCompiler.java:293)
	at com.sun.tools.javac.main.JavaCompiler.instance(JavaCompiler.java:72)
	at com.sun.tools.javac.main.Main.compile(Main.java:340)
	at com.sun.tools.javac.main.Main.compile(Main.java:279)
	at com.sun.tools.javac.main.Main.compile(Main.java:270)
	at com.sun.tools.javac.Main.compile(Main.java:87)
	at sun.reflect.NativeMethodAccessorImpl.invoke0(Native Method)
	at sun.reflect.NativeMethodAccessorImpl.invoke(NativeMethodAccessorImpl.java:39)
	at sun.reflect.DelegatingMethodAccessorImpl.invoke(DelegatingMethodAccessorImpl.java:25)
	at java.lang.reflect.Method.invoke(Method.java:597)
	at org.codehaus.plexus.compiler.javac.JavacCompiler.compileInProcess(JavacCompiler.java:420)
	at org.codehaus.plexus.compiler.javac.JavacCompiler.compile(JavacCompiler.java:141)
	at org.apache.maven.plugin.AbstractCompilerMojo.execute(AbstractCompilerMojo.java:493)
	at org.apache.maven.plugin.CompilerMojo.execute(CompilerMojo.java:114)
	at org.apache.maven.plugin.DefaultPluginManager.executeMojo(DefaultPluginManager.java:490)
	at hudson.maven.agent.PluginManagerInterceptor.executeMojo(PluginManagerInterceptor.java:182)
	at org.apache.maven.lifecycle.DefaultLifecycleExecutor.executeGoals(DefaultLifecycleExecutor.java:694)
	at org.apache.maven.lifecycle.DefaultLifecycleExecutor.executeGoalWithLifecycle(DefaultLifecycleExecutor.java:556)
	at org.apache.maven.lifecycle.DefaultLifecycleExecutor.forkProjectLifecycle(DefaultLifecycleExecutor.java:1205)
	at org.apache.maven.lifecycle.DefaultLifecycleExecutor.forkLifecycle(DefaultLifecycleExecutor.java:1038)


[INFO] ------------------------------------------------------------------------
[INFO] For more information, run Maven with the -e switch
[INFO] ------------------------------------------------------------------------
[INFO] Total time: 133 minutes 32 seconds
[INFO] Finished at: Sat Jan 28 14:15:46 UTC 2012
[INFO] Final Memory: 809M/914M
[INFO] ------------------------------------------------------------------------
Maven failed with error.
channel stopped
[locks-and-latches] Releasing all the locks
[locks-and-latches] All the locks released


Mime
View raw message