clerezza-commits mailing list archives

Site index · List index
Message view « Date » · « Thread »
Top « Date » · « Thread »
From Apache Jenkins Server <jenk...@builds.apache.org>
Subject Build failed in Jenkins: clerezza-site #399
Date Thu, 05 Jan 2012 11:36:17 GMT
See <https://builds.apache.org/job/clerezza-site/399/changes>

Changes:

[ito] CLEREZZA-664: using xml style license header for the seedsnipe template

[ito] CLEREZZA-652: removed xml header for seedsnipe templates

------------------------------------------
[...truncated 222 lines...]
Tests run: 2, Failures: 0, Errors: 0, Skipped: 0, Time elapsed: 1.223 sec
Running org.apache.clerezza.rdf.core.sparql.QuerySerializerTest
Tests run: 9, Failures: 0, Errors: 0, Skipped: 0, Time elapsed: 0.012 sec
Running org.apache.clerezza.rdf.core.LiteralFactoryTest
Tests run: 6, Failures: 0, Errors: 0, Skipped: 0, Time elapsed: 0.007 sec
Running org.apache.clerezza.rdf.core.impl.TripleImplTest
Tests run: 1, Failures: 0, Errors: 0, Skipped: 0, Time elapsed: 0.002 sec
Running org.apache.clerezza.rdf.core.UriRefTest
Tests run: 2, Failures: 0, Errors: 0, Skipped: 0, Time elapsed: 0.003 sec
Running org.apache.clerezza.rdf.core.LanguageTest
Tests run: 2, Failures: 0, Errors: 0, Skipped: 0, Time elapsed: 0.003 sec
Running org.apache.clerezza.rdf.core.impl.TypedLiteralImplTest
Tests run: 2, Failures: 0, Errors: 0, Skipped: 0, Time elapsed: 0.003 sec

Results :

Tests run: 85, Failures: 0, Errors: 0, Skipped: 0

[JENKINS] Recording test results
[INFO] [bundle:bundle {execution: default-bundle}]
[INFO] Preparing source:jar
[WARNING] Removing: jar from forked lifecycle, to prevent recursive invocation.
[JENKINS] Archiving <https://builds.apache.org/job/clerezza-site/ws/trunk-1.6/rdf.core/pom.xml>
to /home/hudson/hudson/jobs/clerezza-site/modules/org.apache.clerezza$rdf.core/builds/2012-01-05_11-34-43/archive/org.apache.clerezza/rdf.core/0.12-incubating-SNAPSHOT/rdf.core-0.12-incubating-SNAPSHOT.pom
[JENKINS] Archiving <https://builds.apache.org/job/clerezza-site/ws/trunk-1.6/rdf.core/target/rdf.core-0.12-incubating-SNAPSHOT.jar>
to /home/hudson/hudson/jobs/clerezza-site/modules/org.apache.clerezza$rdf.core/builds/2012-01-05_11-34-43/archive/org.apache.clerezza/rdf.core/0.12-incubating-SNAPSHOT/rdf.core-0.12-incubating-SNAPSHOT.jar
[INFO] [javacc:javacc {execution: javacc}]
[INFO] Skipping - all parsers are up to date
[INFO] [source:jar {execution: default}]
[INFO] Building jar: <https://builds.apache.org/job/clerezza-site/ws/trunk-1.6/rdf.core/target/rdf.core-0.12-incubating-SNAPSHOT-sources.jar>
[INFO] [install:install {execution: default-install}]
[INFO] Installing <https://builds.apache.org/job/clerezza-site/ws/trunk-1.6/rdf.core/target/rdf.core-0.12-incubating-SNAPSHOT.jar>
to /home/jenkins/.m2/repository/org/apache/clerezza/rdf.core/0.12-incubating-SNAPSHOT/rdf.core-0.12-incubating-SNAPSHOT.jar
[INFO] Installing <https://builds.apache.org/job/clerezza-site/ws/trunk-1.6/rdf.core/target/rdf.core-0.12-incubating-SNAPSHOT-sources.jar>
to /home/jenkins/.m2/repository/org/apache/clerezza/rdf.core/0.12-incubating-SNAPSHOT/rdf.core-0.12-incubating-SNAPSHOT-sources.jar
[INFO] [bundle:install {execution: default-install}]
[INFO] Installing org/apache/clerezza/rdf.core/0.12-incubating-SNAPSHOT/rdf.core-0.12-incubating-SNAPSHOT.jar
[INFO] Writing OBR metadata
[INFO] snapshot org.apache.clerezza:maven-jaxrs-report-plugin:0.1-incubating-SNAPSHOT: checking
for updates from apache-plugin-snapshot
[INFO] Setting property: classpath.resource.loader.class => 'org.codehaus.plexus.velocity.ContextClassLoaderResourceLoader'.
[INFO] Setting property: velocimacro.messages.on => 'false'.
[INFO] Setting property: resource.loader => 'classpath'.
[INFO] Setting property: resource.manager.logwhenfound => 'false'.
[INFO] ************************************************************** 
[INFO] Starting Jakarta Velocity v1.4
[INFO] RuntimeInstance initializing.
[INFO] Default Properties File: org/apache/velocity/runtime/defaults/velocity.properties
[INFO] Default ResourceManager initializing. (class org.apache.velocity.runtime.resource.ResourceManagerImpl)
[INFO] Resource Loader Instantiated: org.codehaus.plexus.velocity.ContextClassLoaderResourceLoader
[INFO] ClasspathResourceLoader : initialization starting.
[INFO] ClasspathResourceLoader : initialization complete.
[INFO] ResourceCache : initialized. (class org.apache.velocity.runtime.resource.ResourceCacheImpl)
[INFO] Default ResourceManager initialization complete.
[INFO] Loaded System Directive: org.apache.velocity.runtime.directive.Literal
[INFO] Loaded System Directive: org.apache.velocity.runtime.directive.Macro
[INFO] Loaded System Directive: org.apache.velocity.runtime.directive.Parse
[INFO] Loaded System Directive: org.apache.velocity.runtime.directive.Include
[INFO] Loaded System Directive: org.apache.velocity.runtime.directive.Foreach
[INFO] Created: 20 parsers.
[INFO] Velocimacro : initialization starting.
[INFO] Velocimacro : adding VMs from VM library template : VM_global_library.vm
[ERROR] ResourceManager : unable to find resource 'VM_global_library.vm' in any resource loader.
[INFO] Velocimacro : error using  VM library template VM_global_library.vm : org.apache.velocity.exception.ResourceNotFoundException:
Unable to find resource 'VM_global_library.vm'
[INFO] Velocimacro :  VM library template macro registration complete.
[INFO] Velocimacro : allowInline = true : VMs can be defined inline in templates
[INFO] Velocimacro : allowInlineToOverride = false : VMs defined inline may NOT replace previous
VM definitions
[INFO] Velocimacro : allowInlineLocal = false : VMs defined inline will be  global in scope
if allowed.
[INFO] Velocimacro : initialization complete.
[INFO] Velocity successfully started.
[INFO] Preparing surefire-report:report
[JENKINS] Archiving <https://builds.apache.org/job/clerezza-site/ws/trunk-1.6/rdf.core/target/rdf.core-0.12-incubating-SNAPSHOT-sources.jar>
to /home/hudson/hudson/jobs/clerezza-site/modules/org.apache.clerezza$rdf.core/builds/2012-01-05_11-34-43/archive/org.apache.clerezza/rdf.core/0.12-incubating-SNAPSHOT/rdf.core-0.12-incubating-SNAPSHOT-sources.jar
[INFO] [javacc:javacc {execution: javacc}]
[INFO] Skipping - all parsers are up to date
[INFO] [remote-resources:process {execution: default}]
[INFO] [resources:resources {execution: default-resources}]
[INFO] Using 'utf-8' encoding to copy filtered resources.
[INFO] Copying 1 resource to META-INF
[INFO] Copying 1 resource
[INFO] Copying 3 resources
[INFO] Copying 3 resources
[INFO] Copying 3 resources
[INFO] [compiler:compile {execution: default-compile}]
[INFO] Nothing to compile - all classes are up to date
[INFO] [scr:scr {execution: generate-scr-scrdescriptor}]
[WARNING] Class org.apache.clerezza.rdf.core.serializedform.Parser is using deprecated javadoc
tags  at <https://builds.apache.org/job/clerezza-site/ws/trunk-1.6/rdf.core/src/main/java/org/apache/clerezza/rdf/core/serializedform/Parser.java>:51
[WARNING] Class org.apache.clerezza.rdf.core.serializedform.Serializer is using deprecated
javadoc tags  at <https://builds.apache.org/job/clerezza-site/ws/trunk-1.6/rdf.core/src/main/java/org/apache/clerezza/rdf/core/serializedform/Serializer.java>:47
[WARNING] It is highly recommended to fix these problems, as future versions might not support
these features anymore.
[WARNING] @scr.reference: Method bindParsingProvider should be declared protected at <https://builds.apache.org/job/clerezza-site/ws/trunk-1.6/rdf.core/src/main/java/org/apache/clerezza/rdf/core/serializedform/Parser.java>:53
[WARNING] @scr.reference: Method unbindParsingProvider should be declared protected at <https://builds.apache.org/job/clerezza-site/ws/trunk-1.6/rdf.core/src/main/java/org/apache/clerezza/rdf/core/serializedform/Parser.java>:53
[WARNING] @scr.reference: Method bindSerializingProvider should be declared protected at <https://builds.apache.org/job/clerezza-site/ws/trunk-1.6/rdf.core/src/main/java/org/apache/clerezza/rdf/core/serializedform/Serializer.java>:49
[WARNING] @scr.reference: Method unbindSerializingProvider should be declared protected at
<https://builds.apache.org/job/clerezza-site/ws/trunk-1.6/rdf.core/src/main/java/org/apache/clerezza/rdf/core/serializedform/Serializer.java>:49
[INFO] Generating 4 MetaType Descriptors to <https://builds.apache.org/job/clerezza-site/ws/trunk-1.6/rdf.core/target/scr-plugin-generated/OSGI-INF/metatype/metatype.xml>
[INFO] Writing abstract service descriptor <https://builds.apache.org/job/clerezza-site/ws/trunk-1.6/rdf.core/target/scr-plugin-generated/OSGI-INF/scr-plugin/scrinfo.xml>
with 4 entries.
[INFO] Generating 4 Service Component Descriptors to <https://builds.apache.org/job/clerezza-site/ws/trunk-1.6/rdf.core/target/scr-plugin-generated/OSGI-INF/serviceComponents.xml>
[INFO] [resources:testResources {execution: default-testResources}]
[INFO] Using 'utf-8' encoding to copy filtered resources.
[INFO] Copying 2 resources
[INFO] Copying 3 resources
[INFO] Copying 3 resources
[INFO] [compiler:testCompile {execution: default-testCompile}]
[INFO] Nothing to compile - all classes are up to date
[INFO] [surefire:test {execution: default-test}]
[INFO] Surefire report directory: <https://builds.apache.org/job/clerezza-site/ws/trunk-1.6/rdf.core/target/surefire-reports>

-------------------------------------------------------
 T E S T S
-------------------------------------------------------
Running org.apache.clerezza.rdf.core.sparql.QueryParserTest
Tests run: 11, Failures: 0, Errors: 0, Skipped: 0, Time elapsed: 0.055 sec
Running org.apache.clerezza.rdf.core.impl.util.W3CDateFormatTest
Tests run: 4, Failures: 0, Errors: 0, Skipped: 0, Time elapsed: 0.018 sec
Running org.apache.clerezza.rdf.core.impl.PlainLiteralImplTest
Tests run: 3, Failures: 0, Errors: 0, Skipped: 0, Time elapsed: 0.007 sec
Running org.apache.clerezza.rdf.core.impl.graphmatching.HashMatchingTest
Tests run: 1, Failures: 0, Errors: 0, Skipped: 0, Time elapsed: 0.026 sec
Running org.apache.clerezza.rdf.core.impl.SimpleLiteralFactoryTest
Tests run: 2, Failures: 0, Errors: 0, Skipped: 0, Time elapsed: 0.01 sec
Running org.apache.clerezza.rdf.core.serializedform.SerializerTest
Tests run: 2, Failures: 0, Errors: 0, Skipped: 0, Time elapsed: 0.007 sec
Running org.apache.clerezza.rdf.core.impl.graphmatching.PermutationIteratorTest
Tests run: 4, Failures: 0, Errors: 0, Skipped: 0, Time elapsed: 0.006 sec
Running org.apache.clerezza.rdf.core.serializedform.ParserTest
Tests run: 2, Failures: 0, Errors: 0, Skipped: 0, Time elapsed: 0.006 sec
Running org.apache.clerezza.rdf.core.impl.SimpleTripleCollectionTest
Tests run: 4, Failures: 0, Errors: 0, Skipped: 0, Time elapsed: 0.005 sec
Running org.apache.clerezza.rdf.core.access.TcManagerTest
looking for QE
Tests run: 4, Failures: 0, Errors: 0, Skipped: 0, Time elapsed: 0.015 sec
Running org.apache.clerezza.rdf.core.impl.graphmatching.GraphMatcherTest
Tests run: 13, Failures: 0, Errors: 0, Skipped: 0, Time elapsed: 0.024 sec
Running org.apache.clerezza.rdf.core.serializedform.TestServiceManagedProvider
Tests run: 1, Failures: 0, Errors: 0, Skipped: 0, Time elapsed: 0.003 sec
Running org.apache.clerezza.rdf.core.access.SecurityTest
org.apache.clerezza.rdf.core.access.LockableMGraphWrapper@1f64158org.apache.clerezza.rdf.core.access.LockableMGraphWrapper@1f64158org.apache.clerezza.rdf.core.access.LockableMGraphWrapper@1f64158@SLTests
run: 10, Failures: 0, Errors: 0, Skipped: 0, Time elapsed: 0.044 sec
Running org.apache.clerezza.rdf.core.events.NotificationTest
Tests run: 2, Failures: 0, Errors: 0, Skipped: 0, Time elapsed: 1.218 sec
Running org.apache.clerezza.rdf.core.sparql.QuerySerializerTest
Tests run: 9, Failures: 0, Errors: 0, Skipped: 0, Time elapsed: 0.012 sec
Running org.apache.clerezza.rdf.core.LiteralFactoryTest
Tests run: 6, Failures: 0, Errors: 0, Skipped: 0, Time elapsed: 0.007 sec
Running org.apache.clerezza.rdf.core.impl.TripleImplTest
Tests run: 1, Failures: 0, Errors: 0, Skipped: 0, Time elapsed: 0.002 sec
Running org.apache.clerezza.rdf.core.UriRefTest
Tests run: 2, Failures: 0, Errors: 0, Skipped: 0, Time elapsed: 0.004 sec
Running org.apache.clerezza.rdf.core.LanguageTest
Tests run: 2, Failures: 0, Errors: 0, Skipped: 0, Time elapsed: 0.002 sec
Running org.apache.clerezza.rdf.core.impl.TypedLiteralImplTest
Tests run: 2, Failures: 0, Errors: 0, Skipped: 0, Time elapsed: 0.002 sec

Results :

Tests run: 85, Failures: 0, Errors: 0, Skipped: 0

[INFO] Preparing surefire-report:report-only
[JENKINS] Recording test results[INFO] No goals needed for project - skipping
[INFO] Preparing plugin:report
[INFO] [javacc:javacc {execution: javacc}]
[INFO] Skipping - all parsers are up to date
[INFO] [remote-resources:process {execution: default}]
[INFO] [resources:resources {execution: default-resources}]
[INFO] Using 'utf-8' encoding to copy filtered resources.
[INFO] Copying 1 resource to META-INF
[INFO] Copying 1 resource
[INFO] Copying 3 resources
[INFO] Copying 3 resources
[INFO] Copying 3 resources
[INFO] Copying 3 resources

[INFO] [compiler:compile {execution: default-compile}]
[INFO] Nothing to compile - all classes are up to date
[INFO] [site:site {execution: default-site}]
[INFO] Parent project loaded from repository.
[INFO] Skipped "Maven Surefire Report" report, file "surefire-report.html" already exists
for the English version.
[INFO] Generating "Distribution Management" report.
[WARNING] Deprecated API called - not org.apache.maven.doxia.sink.Sink instance and no SinkFactory
available. Please update this plugin.
[INFO] Generating "Issue Tracking" report.
[WARNING] Deprecated API called - not org.apache.maven.doxia.sink.Sink instance and no SinkFactory
available. Please update this plugin.
[INFO] Generating "Project Team" report.
[WARNING] Deprecated API called - not org.apache.maven.doxia.sink.Sink instance and no SinkFactory
available. Please update this plugin.
[INFO] Generating "Maven Surefire Report" report.
[WARNING] Unable to locate Test Source XRef to link to - DISABLED
[INFO] Generating "Dependency Management" report.
[WARNING] Deprecated API called - not org.apache.maven.doxia.sink.Sink instance and no SinkFactory
available. Please update this plugin.
[INFO] ------------------------------------------------------------------------
[ERROR] FATAL ERROR
[INFO] ------------------------------------------------------------------------
[INFO] 1
[INFO] ------------------------------------------------------------------------
[INFO] Trace
java.lang.ArrayIndexOutOfBoundsException: 1
	at org.apache.maven.doxia.module.xhtml.XhtmlSink.tableCell(XhtmlSink.java:791)
	at org.apache.maven.doxia.module.xhtml.XhtmlSink.tableHeaderCell(XhtmlSink.java:777)
	at org.apache.maven.reporting.AbstractMavenReportRenderer.tableHeaderCell(AbstractMavenReportRenderer.java:267)
	at org.apache.maven.reporting.AbstractMavenReportRenderer.tableHeader(AbstractMavenReportRenderer.java:356)
	at org.apache.maven.report.projectinfo.dependencies.renderer.DependencyManagementRenderer.renderDependenciesForScope(DependencyManagementRenderer.java:200)
	at org.apache.maven.report.projectinfo.dependencies.renderer.DependencyManagementRenderer.renderDependenciesForAllScopes(DependencyManagementRenderer.java:153)
	at org.apache.maven.report.projectinfo.dependencies.renderer.DependencyManagementRenderer.renderSectionProjectDependencies(DependencyManagementRenderer.java:146)
	at org.apache.maven.report.projectinfo.dependencies.renderer.DependencyManagementRenderer.renderBody(DependencyManagementRenderer.java:132)
	at org.apache.maven.reporting.AbstractMavenReportRenderer.render(AbstractMavenReportRenderer.java:79)
	at org.apache.maven.report.projectinfo.DependencyManagementReport.executeReport(DependencyManagementReport.java:116)
	at org.apache.maven.reporting.AbstractMavenReport.generate(AbstractMavenReport.java:190)
	at org.apache.maven.reporting.AbstractMavenReport.generate(AbstractMavenReport.java:144)
	at sun.reflect.NativeMethodAccessorImpl.invoke0(Native Method)
	at sun.reflect.NativeMethodAccessorImpl.invoke(NativeMethodAccessorImpl.java:39)
	at sun.reflect.DelegatingMethodAccessorImpl.invoke(DelegatingMethodAccessorImpl.java:25)
	at java.lang.reflect.Method.invoke(Method.java:597)
	at hudson.maven.agent.ComponentInterceptor.invoke(ComponentInterceptor.java:47)
	at hudson.maven.agent.PluginManagerInterceptor$3.invoke(PluginManagerInterceptor.java:229)
	at $Proxy3.generate(Unknown Source)
	at org.apache.maven.plugins.site.ReportDocumentRenderer.renderDocument(ReportDocumentRenderer.java:139)
	at org.apache.maven.doxia.siterenderer.DefaultSiteRenderer.renderModule(DefaultSiteRenderer.java:303)
	at org.apache.maven.doxia.siterenderer.DefaultSiteRenderer.render(DefaultSiteRenderer.java:135)
	at org.apache.maven.plugins.site.SiteMojo.renderLocale(SiteMojo.java:133)
	at org.apache.maven.plugins.site.SiteMojo.execute(SiteMojo.java:100)
	at org.apache.maven.plugin.DefaultPluginManager.executeMojo(DefaultPluginManager.java:490)
	at hudson.maven.agent.PluginManagerInterceptor.executeMojo(PluginManagerInterceptor.java:182)
	at org.apache.maven.lifecycle.DefaultLifecycleExecutor.executeGoals(DefaultLifecycleExecutor.java:694)
	at org.apache.maven.lifecycle.DefaultLifecycleExecutor.executeGoalWithLifecycle(DefaultLifecycleExecutor.java:556)
	at org.apache.maven.lifecycle.DefaultLifecycleExecutor.executeGoal(DefaultLifecycleExecutor.java:535)
	at org.apache.maven.lifecycle.DefaultLifecycleExecutor.executeGoalAndHandleFailures(DefaultLifecycleExecutor.java:387)
	at org.apache.maven.lifecycle.DefaultLifecycleExecutor.executeTaskSegments(DefaultLifecycleExecutor.java:348)
	at org.apache.maven.lifecycle.DefaultLifecycleExecutor.execute(DefaultLifecycleExecutor.java:180)
	at org.apache.maven.lifecycle.LifecycleExecutorInterceptor.execute(LifecycleExecutorInterceptor.java:65)
	at org.apache.maven.DefaultMaven.doExecute(DefaultMaven.java:328)
	at org.apache.maven.DefaultMaven.execute(DefaultMaven.java:138)
	at org.apache.maven.cli.MavenCli.main(MavenCli.java:362)
	at sun.reflect.NativeMethodAccessorImpl.invoke0(Native Method)
	at sun.reflect.NativeMethodAccessorImpl.invoke(NativeMethodAccessorImpl.java:39)
	at sun.reflect.DelegatingMethodAccessorImpl.invoke(DelegatingMethodAccessorImpl.java:25)
	at java.lang.reflect.Method.invoke(Method.java:597)
	at org.codehaus.classworlds.Launcher.launchEnhanced(Launcher.java:315)
	at org.codehaus.classworlds.Launcher.launch(Launcher.java:255)
	at hudson.maven.agent.Main.launch(Main.java:185)
	at hudson.maven.MavenBuilder.call(MavenBuilder.java:151)
	at hudson.maven.Maven2Builder.call(Maven2Builder.java:77)
	at hudson.maven.Maven2Builder.call(Maven2Builder.java:53)
	at hudson.remoting.UserRequest.perform(UserRequest.java:118)
	at hudson.remoting.UserRequest.perform(UserRequest.java:48)
	at hudson.remoting.Request$2.run(Request.java:287)
	at java.util.concurrent.Executors$RunnableAdapter.call(Executors.java:441)
	at java.util.concurrent.FutureTask$Sync.innerRun(FutureTask.java:303)
	at java.util.concurrent.FutureTask.run(FutureTask.java:138)
	at java.util.concurrent.ThreadPoolExecutor$Worker.runTask(ThreadPoolExecutor.java:886)
	at java.util.concurrent.ThreadPoolExecutor$Worker.run(ThreadPoolExecutor.java:908)
	at java.lang.Thread.run(Thread.java:662)
[INFO] ------------------------------------------------------------------------
[INFO] Total time: 1 minute 3 seconds
[INFO] Finished at: Thu Jan 05 11:36:15 UTC 2012
[INFO] Final Memory: 104M/461M
[INFO] ------------------------------------------------------------------------
channel stopped
[locks-and-latches] Releasing all the locks
[locks-and-latches] All the locks released


Mime
View raw message