clerezza-commits mailing list archives

Site index · List index
Message view « Date » · « Thread »
Top « Date » · « Thread »
From Apache Jenkins Server <jenk...@builds.apache.org>
Subject Build failed in Jenkins: clerezza-site #363
Date Thu, 03 Nov 2011 12:07:26 GMT
See <https://builds.apache.org/job/clerezza-site/363/changes>

Changes:

[tommaso] [CLEREZZA-646] - added AL headers where reported by RAT running on rdf.core/jena.parser

[tommaso] [CLEREZZA-645] - added exclusion of test graph/nt/ttl files to RAT conf

------------------------------------------
[...truncated 139 lines...]
[INFO]   Clerezza - Platform Launcher Storageless Parent POM
[INFO]   Clerezza - Platform Launcher Storageless
[INFO]   Clerezza - SCB Jena TDB Storage Provider
[INFO]   Clerezza - Platform Launcher with Jena TDB
[INFO]   Clerezza - SCB File Storage Provider
[INFO]   Clerezza - RDF Utility for MGraph lock monitoring
[INFO]   Clerezza - Stable Serializer
[INFO]   Clerezza - Tools Offline Site Generator
[INFO]   Clerezza - Apache UIMA extension module
[INFO]   Clerezza - Apache UIMA related ontologies
[INFO]   Clerezza - Apache UIMA and Annotation Ontology
[INFO]   Clerezza - Apache UIMA extension utils
[INFO]   Clerezza - Apache UIMA CAS Consumer for Graph objects
[INFO]   Clerezza - Apache UIMA extension for metadata generation
[INFO]   Clerezza - Apache UIMA extension for concept tagging
[INFO]   Clerezza - Classic Style
[INFO]   Clerezza - SCB Literal Externalizing Storage Provider
[WARNING] POM for 'biz.aQute:bndlib:pom:1.15.0:runtime' is invalid.

Its dependencies (if any) will NOT be available to the current build.
[INFO] ------------------------------------------------------------------------
[INFO] Building Clerezza - Utilities Project
[INFO]    task-segment: [install, site]
[INFO] ------------------------------------------------------------------------
[INFO] [remote-resources:process {execution: default}]
[INFO] snapshot org.apache.clerezza.ext:slf4j-scala-api:1.6.1-incubating-SNAPSHOT: checking
for updates from apache
[INFO] [resources:resources {execution: default-resources}]
[INFO] Using 'utf-8' encoding to copy filtered resources.
[INFO] Copying 1 resource to META-INF
[INFO] skip non existing resourceDirectory <https://builds.apache.org/job/clerezza-site/ws/trunk-1.6/utils/src/main/resources>
[INFO] Copying 3 resources
[INFO] [compiler:compile {execution: default-compile}]
[INFO] Nothing to compile - all classes are up to date
[INFO] [scr:scr {execution: generate-scr-scrdescriptor}]
[INFO] [resources:testResources {execution: default-testResources}]
[INFO] Using 'utf-8' encoding to copy filtered resources.
[INFO] Copying 0 resource
[INFO] Copying 3 resources
[INFO] [compiler:testCompile {execution: default-testCompile}]
[INFO] Nothing to compile - all classes are up to date
[INFO] [surefire:test {execution: default-test}]
[INFO] Surefire report directory: <https://builds.apache.org/job/clerezza-site/ws/trunk-1.6/utils/target/surefire-reports>

-------------------------------------------------------
 T E S T S
-------------------------------------------------------
Running org.apache.clerezza.utils.UriUtilTest
Tests run: 1, Failures: 0, Errors: 0, Skipped: 0, Time elapsed: 0.034 sec
Running org.apache.clerezza.utils.security.PermissionParserTest
Tests run: 1, Failures: 0, Errors: 0, Skipped: 0, Time elapsed: 0.014 sec
Running org.apache.clerezza.utils.ReplacingOutputStreamTest
Tests run: 1, Failures: 0, Errors: 0, Skipped: 0, Time elapsed: 0.005 sec

Results :

Tests run: 3, Failures: 0, Errors: 0, Skipped: 0

[JENKINS] Recording test results
log4j:WARN No appenders could be found for logger (org.apache.commons.beanutils.converters.BooleanConverter).
log4j:WARN Please initialize the log4j system properly.
[INFO] [bundle:bundle {execution: default-bundle}]
[INFO] Preparing source:jar
[WARNING] Removing: jar from forked lifecycle, to prevent recursive invocation.
[INFO] No goals needed for project - skipping
[INFO] [source:jar {execution: default}]
[INFO] Building jar: <https://builds.apache.org/job/clerezza-site/ws/trunk-1.6/utils/target/utils-0.1-incubating-SNAPSHOT-sources.jar>
[INFO] [apache-rat:check {execution: default-cli}]
[INFO] Exclude: release.properties
[INFO] Exclude: **/*.sh
[INFO] Exclude: **/shell/**/*
[INFO] Exclude: .scala_dependencies
[INFO] Exclude: **/.project
[INFO] Exclude: **/.settings/**/*
[INFO] Exclude: **/*.iml
[INFO] Exclude: **/target/**/*
[INFO] Exclude: **/test/**/*.nt
[INFO] Exclude: **/test/**/*.ttl
[INFO] Exclude: **/test/**/*.rdf
[INFO] [install:install {execution: default-install}]
[INFO] Installing <https://builds.apache.org/job/clerezza-site/ws/trunk-1.6/utils/target/utils-0.1-incubating-SNAPSHOT.jar>
to /home/jenkins/.m2/repository/org/apache/clerezza/utils/0.1-incubating-SNAPSHOT/utils-0.1-incubating-SNAPSHOT.jar
[INFO] Installing <https://builds.apache.org/job/clerezza-site/ws/trunk-1.6/utils/target/utils-0.1-incubating-SNAPSHOT-sources.jar>
to /home/jenkins/.m2/repository/org/apache/clerezza/utils/0.1-incubating-SNAPSHOT/utils-0.1-incubating-SNAPSHOT-sources.jar
[INFO] [bundle:install {execution: default-install}]
[INFO] Installing org/apache/clerezza/utils/0.1-incubating-SNAPSHOT/utils-0.1-incubating-SNAPSHOT.jar
[INFO] Writing OBR metadata
[INFO] Setting property: classpath.resource.loader.class => 'org.codehaus.plexus.velocity.ContextClassLoaderResourceLoader'.
[INFO] Setting property: velocimacro.messages.on => 'false'.
[INFO] Setting property: resource.loader => 'classpath'.
[INFO] Setting property: resource.manager.logwhenfound => 'false'.
[INFO] ************************************************************** 
[INFO] Starting Jakarta Velocity v1.4
[INFO] RuntimeInstance initializing.
[INFO] Default Properties File: org/apache/velocity/runtime/defaults/velocity.properties
[INFO] Default ResourceManager initializing. (class org.apache.velocity.runtime.resource.ResourceManagerImpl)
[INFO] Resource Loader Instantiated: org.codehaus.plexus.velocity.ContextClassLoaderResourceLoader
[INFO] ClasspathResourceLoader : initialization starting.
[INFO] ClasspathResourceLoader : initialization complete.
[INFO] ResourceCache : initialized. (class org.apache.velocity.runtime.resource.ResourceCacheImpl)
[INFO] Default ResourceManager initialization complete.
[INFO] Loaded System Directive: org.apache.velocity.runtime.directive.Literal
[INFO] Loaded System Directive: org.apache.velocity.runtime.directive.Macro
[INFO] Loaded System Directive: org.apache.velocity.runtime.directive.Parse
[INFO] Loaded System Directive: org.apache.velocity.runtime.directive.Include
[INFO] Loaded System Directive: org.apache.velocity.runtime.directive.Foreach
[INFO] Created: 20 parsers.
[INFO] Velocimacro : initialization starting.
[INFO] Velocimacro : adding VMs from VM library template : VM_global_library.vm
[ERROR] ResourceManager : unable to find resource 'VM_global_library.vm' in any resource loader.
[INFO] Velocimacro : error using  VM library template VM_global_library.vm : org.apache.velocity.exception.ResourceNotFoundException:
Unable to find resource 'VM_global_library.vm'
[INFO] Velocimacro :  VM library template macro registration complete.
[INFO] Velocimacro : allowInline = true : VMs can be defined inline in templates
[INFO] Velocimacro : allowInlineToOverride = false : VMs defined inline may NOT replace previous
VM definitions
[INFO] Velocimacro : allowInlineLocal = false : VMs defined inline will be  global in scope
if allowed.
[INFO] Velocimacro : initialization complete.
[INFO] Velocity successfully started.
[INFO] Preparing surefire-report:report
[JENKINS] Archiving <https://builds.apache.org/job/clerezza-site/ws/trunk-1.6/utils/pom.xml>
to /home/hudson/hudson/jobs/clerezza-site/modules/org.apache.clerezza$utils/builds/2011-11-03_12-06-09/archive/org.apache.clerezza/utils/0.1-incubating-SNAPSHOT/utils-0.1-incubating-SNAPSHOT.pom
[JENKINS] Archiving <https://builds.apache.org/job/clerezza-site/ws/trunk-1.6/utils/target/utils-0.1-incubating-SNAPSHOT.jar>
to /home/hudson/hudson/jobs/clerezza-site/modules/org.apache.clerezza$utils/builds/2011-11-03_12-06-09/archive/org.apache.clerezza/utils/0.1-incubating-SNAPSHOT/utils-0.1-incubating-SNAPSHOT.jar
[JENKINS] Archiving <https://builds.apache.org/job/clerezza-site/ws/trunk-1.6/utils/target/utils-0.1-incubating-SNAPSHOT-sources.jar>
to /home/hudson/hudson/jobs/clerezza-site/modules/org.apache.clerezza$utils/builds/2011-11-03_12-06-09/archive/org.apache.clerezza/utils/0.1-incubating-SNAPSHOT/utils-0.1-incubating-SNAPSHOT-sources.jar
[INFO] [remote-resources:process {execution: default}]
[INFO] [resources:resources {execution: default-resources}]
[INFO] Using 'utf-8' encoding to copy filtered resources.
[INFO] Copying 1 resource to META-INF
[INFO] skip non existing resourceDirectory <https://builds.apache.org/job/clerezza-site/ws/trunk-1.6/utils/src/main/resources>
[INFO] Copying 3 resources
[INFO] Copying 3 resources
[INFO] [compiler:compile {execution: default-compile}]
[INFO] Nothing to compile - all classes are up to date
[INFO] [scr:scr {execution: generate-scr-scrdescriptor}]
[INFO] [resources:testResources {execution: default-testResources}]
[INFO] Using 'utf-8' encoding to copy filtered resources.
[INFO] Copying 0 resource
[INFO] Copying 3 resources
[INFO] Copying 3 resources
[INFO] [compiler:testCompile {execution: default-testCompile}]
[INFO] Nothing to compile - all classes are up to date
[INFO] [surefire:test {execution: default-test}]
[INFO] Surefire report directory: <https://builds.apache.org/job/clerezza-site/ws/trunk-1.6/utils/target/surefire-reports>

-------------------------------------------------------
 T E S T S
-------------------------------------------------------
Running org.apache.clerezza.utils.UriUtilTest
Tests run: 1, Failures: 0, Errors: 0, Skipped: 0, Time elapsed: 0.035 sec
Running org.apache.clerezza.utils.security.PermissionParserTest
Tests run: 1, Failures: 0, Errors: 0, Skipped: 0, Time elapsed: 0.014 sec
Running org.apache.clerezza.utils.ReplacingOutputStreamTest
Tests run: 1, Failures: 0, Errors: 0, Skipped: 0, Time elapsed: 0.005 sec

Results :

Tests run: 3, Failures: 0, Errors: 0, Skipped: 0

[INFO] Preparing surefire-report:report-only
[JENKINS] Recording test results[INFO] No goals needed for project - skipping
[INFO] Preparing plugin:report
[INFO] [remote-resources:process {execution: default}]
[INFO] [resources:resources {execution: default-resources}]
[INFO] Using 'utf-8' encoding to copy filtered resources.
[INFO] Copying 1 resource to META-INF
[INFO] skip non existing resourceDirectory <https://builds.apache.org/job/clerezza-site/ws/trunk-1.6/utils/src/main/resources>
[INFO] Copying 3 resources
[INFO] Copying 3 resources
[INFO] Copying 3 resources

[INFO] [compiler:compile {execution: default-compile}]
[INFO] Nothing to compile - all classes are up to date
[INFO] [site:site {execution: default-site}]
[INFO] Parent project loaded from repository.
[INFO] Skipped "Maven Surefire Report" report, file "surefire-report.html" already exists
for the English version.
[INFO] Generating "Distribution Management" report.
[WARNING] Deprecated API called - not org.apache.maven.doxia.sink.Sink instance and no SinkFactory
available. Please update this plugin.
[INFO] Generating "Issue Tracking" report.
[WARNING] Deprecated API called - not org.apache.maven.doxia.sink.Sink instance and no SinkFactory
available. Please update this plugin.
[INFO] Generating "Project Team" report.
[WARNING] Deprecated API called - not org.apache.maven.doxia.sink.Sink instance and no SinkFactory
available. Please update this plugin.
[INFO] Generating "Maven Surefire Report" report.
[WARNING] Unable to locate Test Source XRef to link to - DISABLED
[INFO] Generating "Dependency Management" report.
[WARNING] Deprecated API called - not org.apache.maven.doxia.sink.Sink instance and no SinkFactory
available. Please update this plugin.
[INFO] ------------------------------------------------------------------------
[ERROR] FATAL ERROR
[INFO] ------------------------------------------------------------------------
[INFO] 1
[INFO] ------------------------------------------------------------------------
[INFO] Trace
java.lang.ArrayIndexOutOfBoundsException: 1
	at org.apache.maven.doxia.module.xhtml.XhtmlSink.tableCell(XhtmlSink.java:791)
	at org.apache.maven.doxia.module.xhtml.XhtmlSink.tableHeaderCell(XhtmlSink.java:777)
	at org.apache.maven.reporting.AbstractMavenReportRenderer.tableHeaderCell(AbstractMavenReportRenderer.java:267)
	at org.apache.maven.reporting.AbstractMavenReportRenderer.tableHeader(AbstractMavenReportRenderer.java:356)
	at org.apache.maven.report.projectinfo.dependencies.renderer.DependencyManagementRenderer.renderDependenciesForScope(DependencyManagementRenderer.java:200)
	at org.apache.maven.report.projectinfo.dependencies.renderer.DependencyManagementRenderer.renderDependenciesForAllScopes(DependencyManagementRenderer.java:153)
	at org.apache.maven.report.projectinfo.dependencies.renderer.DependencyManagementRenderer.renderSectionProjectDependencies(DependencyManagementRenderer.java:146)
	at org.apache.maven.report.projectinfo.dependencies.renderer.DependencyManagementRenderer.renderBody(DependencyManagementRenderer.java:132)
	at org.apache.maven.reporting.AbstractMavenReportRenderer.render(AbstractMavenReportRenderer.java:79)
	at org.apache.maven.report.projectinfo.DependencyManagementReport.executeReport(DependencyManagementReport.java:116)
	at org.apache.maven.reporting.AbstractMavenReport.generate(AbstractMavenReport.java:190)
	at org.apache.maven.reporting.AbstractMavenReport.generate(AbstractMavenReport.java:144)
	at sun.reflect.NativeMethodAccessorImpl.invoke0(Native Method)
	at sun.reflect.NativeMethodAccessorImpl.invoke(NativeMethodAccessorImpl.java:39)
	at sun.reflect.DelegatingMethodAccessorImpl.invoke(DelegatingMethodAccessorImpl.java:25)
	at java.lang.reflect.Method.invoke(Method.java:597)
	at hudson.maven.agent.ComponentInterceptor.invoke(ComponentInterceptor.java:47)
	at hudson.maven.agent.PluginManagerInterceptor$3.invoke(PluginManagerInterceptor.java:229)
	at $Proxy3.generate(Unknown Source)
	at org.apache.maven.plugins.site.ReportDocumentRenderer.renderDocument(ReportDocumentRenderer.java:139)
	at org.apache.maven.doxia.siterenderer.DefaultSiteRenderer.renderModule(DefaultSiteRenderer.java:303)
	at org.apache.maven.doxia.siterenderer.DefaultSiteRenderer.render(DefaultSiteRenderer.java:135)
	at org.apache.maven.plugins.site.SiteMojo.renderLocale(SiteMojo.java:133)
	at org.apache.maven.plugins.site.SiteMojo.execute(SiteMojo.java:100)
	at org.apache.maven.plugin.DefaultPluginManager.executeMojo(DefaultPluginManager.java:490)
	at hudson.maven.agent.PluginManagerInterceptor.executeMojo(PluginManagerInterceptor.java:182)
	at org.apache.maven.lifecycle.DefaultLifecycleExecutor.executeGoals(DefaultLifecycleExecutor.java:694)
	at org.apache.maven.lifecycle.DefaultLifecycleExecutor.executeGoalWithLifecycle(DefaultLifecycleExecutor.java:556)
	at org.apache.maven.lifecycle.DefaultLifecycleExecutor.executeGoal(DefaultLifecycleExecutor.java:535)
	at org.apache.maven.lifecycle.DefaultLifecycleExecutor.executeGoalAndHandleFailures(DefaultLifecycleExecutor.java:387)
	at org.apache.maven.lifecycle.DefaultLifecycleExecutor.executeTaskSegments(DefaultLifecycleExecutor.java:348)
	at org.apache.maven.lifecycle.DefaultLifecycleExecutor.execute(DefaultLifecycleExecutor.java:180)
	at org.apache.maven.lifecycle.LifecycleExecutorInterceptor.execute(LifecycleExecutorInterceptor.java:65)
	at org.apache.maven.DefaultMaven.doExecute(DefaultMaven.java:328)
	at org.apache.maven.DefaultMaven.execute(DefaultMaven.java:138)
	at org.apache.maven.cli.MavenCli.main(MavenCli.java:362)
	at sun.reflect.NativeMethodAccessorImpl.invoke0(Native Method)
	at sun.reflect.NativeMethodAccessorImpl.invoke(NativeMethodAccessorImpl.java:39)
	at sun.reflect.DelegatingMethodAccessorImpl.invoke(DelegatingMethodAccessorImpl.java:25)
	at java.lang.reflect.Method.invoke(Method.java:597)
	at org.codehaus.classworlds.Launcher.launchEnhanced(Launcher.java:315)
	at org.codehaus.classworlds.Launcher.launch(Launcher.java:255)
	at hudson.maven.agent.Main.launch(Main.java:185)
	at hudson.maven.MavenBuilder.call(MavenBuilder.java:160)
	at hudson.maven.MavenModuleSetBuild$Builder.call(MavenModuleSetBuild.java:1059)
	at hudson.maven.MavenModuleSetBuild$Builder.call(MavenModuleSetBuild.java:990)
	at hudson.remoting.UserRequest.perform(UserRequest.java:118)
	at hudson.remoting.UserRequest.perform(UserRequest.java:48)
	at hudson.remoting.Request$2.run(Request.java:287)
	at java.util.concurrent.Executors$RunnableAdapter.call(Executors.java:441)
	at java.util.concurrent.FutureTask$Sync.innerRun(FutureTask.java:303)
	at java.util.concurrent.FutureTask.run(FutureTask.java:138)
	at java.util.concurrent.ThreadPoolExecutor$Worker.runTask(ThreadPoolExecutor.java:886)
	at java.util.concurrent.ThreadPoolExecutor$Worker.run(ThreadPoolExecutor.java:908)
	at java.lang.Thread.run(Thread.java:662)
[INFO] ------------------------------------------------------------------------
[INFO] Total time: 45 seconds
[INFO] Finished at: Thu Nov 03 12:07:23 UTC 2011
[INFO] Final Memory: 104M/455M
[INFO] ------------------------------------------------------------------------
channel stopped
[locks-and-latches] Releasing all the locks
[locks-and-latches] All the locks released


Mime
View raw message