clerezza-commits mailing list archives

Site index · List index
Message view « Date » · « Thread »
Top « Date » · « Thread »
From Apache Jenkins Server <jenk...@builds.apache.org>
Subject Build failed in Jenkins: clerezza-trunk-1.6 » Clerezza - Platform Account Control Panel Core #646
Date Tue, 12 Jul 2011 00:36:55 GMT
See <https://builds.apache.org/job/clerezza-trunk-1.6/org.apache.clerezza$platform.accountcontrolpanel.core/646/changes>

Changes:

[reto] CLEREZZA-605: Added a simple implementations to add/remove contacts. The code from
open issues, namely code committed for the unresolved CLEREZZA-473, CLEREZZA-509 and CLEREZZA-516
has been partially integrated and partially removed. The naked-resource template in platform.content
is configured to also apply for *-naked mode, so that the uri of foaf:Knows target that are
not known to be persons are  displayed as well

------------------------------------------
[INFO] ------------------------------------------------------------------------
[INFO] Building Clerezza - Platform Account Control Panel Core
[INFO]    task-segment: [clean, deploy]
[INFO] ------------------------------------------------------------------------
[INFO] [clean:clean {execution: default-clean}]
[INFO] Deleting file set: <https://builds.apache.org/job/clerezza-trunk-1.6/org.apache.clerezza$platform.accountcontrolpanel.core/ws/target>
(included: [**], excluded: [])
[INFO] [resources:resources {execution: default-resources}]
[INFO] Using 'utf-8' encoding to copy filtered resources.
[INFO] Copying 0 resource to META-INF
[INFO] Copying 4 resources
[INFO] snapshot org.apache.clerezza:platform.typerendering.scala:0.1-incubating-SNAPSHOT:
checking for updates from apache
[INFO] snapshot org.apache.clerezza:platform.dashboard.core:0.2-incubating-SNAPSHOT: checking
for updates from apache
[INFO] snapshot org.apache.clerezza:platform.accountcontrolpanel.ontologies:0.2-incubating-SNAPSHOT:
checking for updates from apache
[INFO] snapshot org.apache.clerezza:ssl.keygen.base:0.5-incubating-SNAPSHOT: checking for
updates from apache
[INFO] [compiler:compile {execution: default-compile}]
[INFO] Nothing to compile - all classes are up to date
[INFO] [scala:compile {execution: default}]
[ERROR] <https://builds.apache.org/job/clerezza-trunk-1.6/org.apache.clerezza$platform.accountcontrolpanel.core/ws/src/main/java>
[ERROR] <https://builds.apache.org/job/clerezza-trunk-1.6/org.apache.clerezza$platform.accountcontrolpanel.core/ws/src/main/scala>
[INFO] Compiling 10 source files to <https://builds.apache.org/job/clerezza-trunk-1.6/org.apache.clerezza$platform.accountcontrolpanel.core/ws/target/classes>
[WARNING] <https://builds.apache.org/job/clerezza-trunk-1.6/org.apache.clerezza$platform.accountcontrolpanel.core/ws/src/main/scala/org/apache/clerezza/platform/accountcontrolpanel/ProfilePanel.scala>:209:
error: value a is not a member of org.apache.clerezza.rdf.utils.GraphNode
[WARNING] 		result a CONTROLPANEL.ContactConfirmPage
[WARNING]                 ^
[WARNING] <https://builds.apache.org/job/clerezza-trunk-1.6/org.apache.clerezza$platform.accountcontrolpanel.core/ws/src/main/scala/org/apache/clerezza/platform/accountcontrolpanel/ProfilePanel.scala>:210:
error: value -- is not a member of org.apache.clerezza.rdf.utils.GraphNode
[WARNING] 		result -- FOAF.primaryTopic --> contactNode
[WARNING]                 ^
[WARNING] two errors found
[JENKINS] Archiving <https://builds.apache.org/job/clerezza-trunk-1.6/org.apache.clerezza$platform.accountcontrolpanel.core/ws/pom.xml>
to /home/hudson/hudson/jobs/clerezza-trunk-1.6/modules/org.apache.clerezza$platform.accountcontrolpanel.core/builds/2011-07-12_00-20-44/archive/org.apache.clerezza/platform.accountcontrolpanel.core/0.2-incubating-SNAPSHOT/platform.accountcontrolpanel.core-0.2-incubating-SNAPSHOT.pom
[INFO] ------------------------------------------------------------------------
[ERROR] BUILD FAILURE
[INFO] ------------------------------------------------------------------------
[INFO] command line returned non-zero value:1
[INFO] ------------------------------------------------------------------------
[INFO] For more information, run Maven with the -e switch
[INFO] ------------------------------------------------------------------------
[INFO] Total time: 15 minutes 43 seconds
[INFO] Finished at: Mon Jul 11 17:36:53 PDT 2011
[INFO] Final Memory: 161M/949M
[INFO] ------------------------------------------------------------------------


Mime
View raw message