clerezza-commits mailing list archives

Site index · List index
Message view « Date » · « Thread »
Top « Date » · « Thread »
From Apache Jenkins Server <jenk...@builds.apache.org>
Subject Build failed in Jenkins: clerezza-trunk-1.6 » Clerezza - Platform Account Control Panel Core #614
Date Wed, 22 Jun 2011 23:41:06 GMT
See <https://builds.apache.org/job/clerezza-trunk-1.6/org.apache.clerezza$platform.accountcontrolpanel.core/614/>

------------------------------------------
[INFO] ------------------------------------------------------------------------
[INFO] Building Clerezza - Platform Account Control Panel Core
[INFO]    task-segment: [clean, deploy]
[INFO] ------------------------------------------------------------------------
[INFO] [clean:clean {execution: default-clean}]
[INFO] Deleting file set: <https://builds.apache.org/job/clerezza-trunk-1.6/org.apache.clerezza$platform.accountcontrolpanel.core/ws/target>
(included: [**], excluded: [])
[INFO] [resources:resources {execution: default-resources}]
[INFO] Using 'utf-8' encoding to copy filtered resources.
[INFO] Copying 0 resource to META-INF
[INFO] Copying 4 resources
[INFO] snapshot org.apache.clerezza:platform.typerendering.scala:0.1-incubating-SNAPSHOT:
checking for updates from apache
[INFO] snapshot org.apache.clerezza:platform.dashboard.core:0.2-incubating-SNAPSHOT: checking
for updates from apache
[INFO] snapshot org.apache.clerezza:platform.accountcontrolpanel.ontologies:0.2-incubating-SNAPSHOT:
checking for updates from apache
[INFO] snapshot org.apache.clerezza:ssl.keygen.base:0.5-incubating-SNAPSHOT: checking for
updates from apache
[INFO] [compiler:compile {execution: default-compile}]
[INFO] Nothing to compile - all classes are up to date
[INFO] [scala:compile {execution: default}]
[ERROR] <https://builds.apache.org/job/clerezza-trunk-1.6/org.apache.clerezza$platform.accountcontrolpanel.core/ws/src/main/java>
[ERROR] <https://builds.apache.org/job/clerezza-trunk-1.6/org.apache.clerezza$platform.accountcontrolpanel.core/ws/src/main/scala>
[INFO] Compiling 13 source files to <https://builds.apache.org/job/clerezza-trunk-1.6/org.apache.clerezza$platform.accountcontrolpanel.core/ws/target/classes>
[WARNING] <https://builds.apache.org/job/clerezza-trunk-1.6/org.apache.clerezza$platform.accountcontrolpanel.core/ws/src/main/scala/org/apache/clerezza/platform/accountcontrolpanel/FoafBrowser.scala>:80:
error: type mismatch;
[WARNING]  found   : org.apache.clerezza.rdf.utils.UnionMGraph
[WARNING]  required: java.util.HashSet[org.apache.clerezza.rdf.core.Triple]
[WARNING] 		val inference = new EasyGraph(new UnionMGraph(new SimpleMGraph(),profile))
[WARNING]                                               ^
[WARNING] <https://builds.apache.org/job/clerezza-trunk-1.6/org.apache.clerezza$platform.accountcontrolpanel.core/ws/src/main/scala/org/apache/clerezza/platform/accountcontrolpanel/PingBack.scala>:135:
error: type mismatch;
[WARNING]  found   : org.apache.clerezza.rdf.core.MGraph
[WARNING]  required: java.util.HashSet[org.apache.clerezza.rdf.core.Triple]
[WARNING] 		new EasyGraph(tcgraph)
[WARNING]                               ^
[WARNING] <https://builds.apache.org/job/clerezza-trunk-1.6/org.apache.clerezza$platform.accountcontrolpanel.core/ws/src/main/scala/org/apache/clerezza/platform/accountcontrolpanel/PingBack.scala>:284:
error: type mismatch;
[WARNING]  found   : org.apache.clerezza.rdf.utils.UnionMGraph
[WARNING]  required: java.util.HashSet[org.apache.clerezza.rdf.core.Triple]
[WARNING] 			new EasyGraph(new UnionMGraph(new SimpleMGraph(),targetGrph)).bnode ? PLATFORM.HeadedPage
[WARNING]                                       ^
[WARNING] <https://builds.apache.org/job/clerezza-trunk-1.6/org.apache.clerezza$platform.accountcontrolpanel.core/ws/src/main/scala/org/apache/clerezza/platform/accountcontrolpanel/ProfilePanel.scala>:292:
error: type mismatch;
[WARNING]  found   : org.apache.clerezza.rdf.core.access.LockableMGraph
[WARNING]  required: java.util.HashSet[org.apache.clerezza.rdf.core.Triple]
[WARNING] 			val certNode = new EasyGraph(webIdInfo.localPublicUserData).bnode
[WARNING]                                                                ^
[WARNING] four errors found
[JENKINS] Archiving <https://builds.apache.org/job/clerezza-trunk-1.6/org.apache.clerezza$platform.accountcontrolpanel.core/ws/pom.xml>
to /home/hudson/hudson/jobs/clerezza-trunk-1.6/modules/org.apache.clerezza$platform.accountcontrolpanel.core/builds/2011-06-22_23-37-31/archive/org.apache.clerezza/platform.accountcontrolpanel.core/0.2-incubating-SNAPSHOT/platform.accountcontrolpanel.core-0.2-incubating-SNAPSHOT.pom
[INFO] ------------------------------------------------------------------------
[ERROR] BUILD FAILURE
[INFO] ------------------------------------------------------------------------
[INFO] command line returned non-zero value:1
[INFO] ------------------------------------------------------------------------
[INFO] For more information, run Maven with the -e switch
[INFO] ------------------------------------------------------------------------
[INFO] Total time: 3 minutes 5 seconds
[INFO] Finished at: Wed Jun 22 16:41:05 PDT 2011
[INFO] Final Memory: 138M/470M
[INFO] ------------------------------------------------------------------------


Mime
View raw message