clerezza-commits mailing list archives

Site index · List index
Message view « Date » · « Thread »
Top « Date » · « Thread »
From Apache Jenkins Server <hud...@hudson.apache.org>
Subject Build failed in Jenkins: clerezza-site #279
Date Sat, 28 May 2011 16:04:00 GMT
See <https://builds.apache.org/hudson/job/clerezza-site/279/changes>

Changes:

[bblfish] Revert "Generalised the profile browser so that it can be useful for remote users
without accounts. CLEREZZA-516. This is perhaps the most basic linked data app one can havea.
Users with an account will be able to add contacts as they browser the network."

This reverts commit fd7c74856c3614f50cbf7a29d35212c2789af89c.

------------------------------------------
[...truncated 118 lines...]
[INFO]   Clerezza - SCB Enrichment Core
[INFO]   Clerezza - Platform RDF Enrichment
[INFO]   Clerezza - Platform Language
[INFO]   Clerezza - Platform Language Ontologies
[INFO]   Clerezza - Platform Language Core
[INFO]   Clerezza - Platform Logging
[INFO]   Clerezza - Platform Logging Ontologies
[INFO]   Clerezza - Platform Logging Core
[INFO]   Clerezza - Platform Logging Initializer
[INFO]   Clerezza - jQuery bundlized
[INFO]   Clerezza - Utils Custom Property
[INFO]   Clerezza - Platform Mail Deliverly
[INFO]   Clerezza - Platform Usermanager Webinterface
[INFO]   Clerezza - SCB Jena Storage Provider
[INFO]   Clerezza - SCB Jena SPARQL engine
[INFO]   Clerezza - SCB RDFa parsing support
[INFO]   Clerezza - SCB rdf/json Parser and Serializer
[INFO]   Clerezza - Shell Service
[INFO]   Clerezza - Platform Shell customizer
[INFO]   Clerezza - Integartion of felix shell commands into clerezza shell
[INFO]   Clerezza - Bundle Development Tools
[INFO]   Clerezza - SSH Shell Access
[INFO]   Clerezza - SCB Web Access
[INFO]   Clerezza - SCB Web Access Ontologies
[INFO]   Clerezza - SCB Web Access Core
[INFO]   Clerezza - Platform Security foaf+ssl Core
[INFO]   Clerezza - Platform Security foaf+ssl Test Pages
[INFO]   Clerezza - Platform Security Basic Authentication
[INFO]   Clerezza - Platform Security Cookie Authentication
[INFO]   Clerezza - Platform Typerendering GUI
[INFO]   Clerezza - Platform Scripting
[INFO]   Clerezza - Platform Script Manager
[INFO]   Clerezza - Filter for browsers that do not support XHTML
[INFO]   Clerezza Ext - Yui JS
[INFO]   Clerezza - Scripts
[INFO]   Clerezza - Platform Launcher Storageless Parent POM
[INFO]   Clerezza - Platform Launcher Storageless
[INFO]   Clerezza - SCB Jena TDB Storage Provider
[INFO]   Clerezza - Platform Launcher with Jena TDB
[INFO]   Clerezza - SCB File Storage Provider
[INFO]   Clerezza - RDF Utility for MGraph lock monitoring
[INFO]   Clerezza - Stable Serializer
[INFO]   Clerezza - Tools Offline Site Generator
[INFO]   Clerezza - Apache UIMA extension module
[INFO]   Clerezza - Apache UIMA related ontologies
[INFO]   Clerezza - Apache UIMA extension utils
[INFO]   Clerezza - Apache Clerezza UIMA extension for metadata generation
[INFO]   Clerezza - Apache UIMA CAS Consumer for Graph objects
[INFO]   Apache Clerezza UIMA extension for concept tagging
[INFO]   Clerezza - SCB Literal Externalizing Storage Provider
[WARNING] POM for 'biz.aQute:bndlib:pom:1.15.0:runtime' is invalid.

Its dependencies (if any) will NOT be available to the current build.
[INFO] ------------------------------------------------------------------------
[INFO] Building SLF4J Scala API Module
[INFO]    task-segment: [clean, install, site-deploy]
[INFO] ------------------------------------------------------------------------
[INFO] [clean:clean {execution: default-clean}]
[INFO] Deleting directory <https://builds.apache.org/hudson/job/clerezza-site/ws/trunk-1.6/slf4j-scala-api/target>
[INFO] [build-helper:parse-version {execution: parse-version}]
[INFO] [resources:resources {execution: default-resources}]
[INFO] Using 'UTF-8' encoding to copy filtered resources.
[INFO] skip non existing resourceDirectory <https://builds.apache.org/hudson/job/clerezza-site/ws/trunk-1.6/slf4j-scala-api/src/main/resources>
[INFO] [compiler:compile {execution: default-compile}]
[INFO] No sources to compile
[INFO] [scala:compile {execution: default}]
[INFO] Checking for multiple versions of scala
[INFO] includes = [**/*.scala,**/*.java,]
[INFO] excludes = []
[INFO] <https://builds.apache.org/hudson/job/clerezza-site/ws/trunk-1.6/slf4j-scala-api/src/main/scala>:-1:
info: compiling
[INFO] Compiling 2 source files to <https://builds.apache.org/hudson/job/clerezza-site/ws/trunk-1.6/slf4j-scala-api/target/classes>
at 1306598586501
[INFO] No known dependencies. Compiling everything
[INFO] prepare-compile in 0 s
[INFO] compile in 4 s
[INFO] [resources:testResources {execution: default-testResources}]
[INFO] Using 'UTF-8' encoding to copy filtered resources.
[INFO] skip non existing resourceDirectory <https://builds.apache.org/hudson/job/clerezza-site/ws/trunk-1.6/slf4j-scala-api/src/test/resources>
[INFO] [compiler:testCompile {execution: default-testCompile}]
[INFO] No sources to compile
[INFO] [scala:testCompile {execution: default}]
[INFO] Checking for multiple versions of scala
[INFO] includes = [**/*.scala,**/*.java,]
[INFO] excludes = []
[INFO] <https://builds.apache.org/hudson/job/clerezza-site/ws/trunk-1.6/slf4j-scala-api/src/test/scala>:-1:
info: compiling
[INFO] Compiling 2 source files to <https://builds.apache.org/hudson/job/clerezza-site/ws/trunk-1.6/slf4j-scala-api/target/test-classes>
at 1306598591085
[INFO] No known dependencies. Compiling everything
[INFO] prepare-compile in 0 s
[INFO] compile in 8 s
[INFO] [surefire:test {execution: default-test}]
[INFO] Surefire report directory: <https://builds.apache.org/hudson/job/clerezza-site/ws/trunk-1.6/slf4j-scala-api/target/surefire-reports>

-------------------------------------------------------
 T E S T S
-------------------------------------------------------
Running org.slf4j.scala.LoggerSpec
Tests run: 24, Failures: 0, Errors: 0, Skipped: 0, Time elapsed: 0.82 sec
Running org.slf4j.scala.LoggingSpec
Tests run: 1, Failures: 0, Errors: 0, Skipped: 0, Time elapsed: 0.008 sec

Results :

Tests run: 25, Failures: 0, Errors: 0, Skipped: 0

[JENKINS] Recording test results
[INFO] [bundle:bundle {execution: default-bundle}]
[INFO] Preparing source:jar
[WARNING] Removing: jar from forked lifecycle, to prevent recursive invocation.
[JENKINS] Archiving <https://builds.apache.org/hudson/job/clerezza-site/ws/trunk-1.6/slf4j-scala-api/pom.xml>
to /home/hudson/hudson/jobs/clerezza-site/modules/org.apache.clerezza.ext$slf4j-scala-api/builds/2011-05-28_16-02-28/archive/org.apache.clerezza.ext/slf4j-scala-api/1.6.1-SNAPSHOT/slf4j-scala-api-1.6.1-SNAPSHOT.pom
[JENKINS] Archiving <https://builds.apache.org/hudson/job/clerezza-site/ws/trunk-1.6/slf4j-scala-api/target/slf4j-scala-api-1.6.1-SNAPSHOT.jar>
to /home/hudson/hudson/jobs/clerezza-site/modules/org.apache.clerezza.ext$slf4j-scala-api/builds/2011-05-28_16-02-28/archive/org.apache.clerezza.ext/slf4j-scala-api/1.6.1-SNAPSHOT/slf4j-scala-api-1.6.1-SNAPSHOT.jar
[INFO] [build-helper:parse-version {execution: parse-version}]
[INFO] [source:jar {execution: default}]
[INFO] Building jar: <https://builds.apache.org/hudson/job/clerezza-site/ws/trunk-1.6/slf4j-scala-api/target/slf4j-scala-api-1.6.1-SNAPSHOT-sources.jar>
[INFO] [install:install {execution: default-install}]
[INFO] Installing <https://builds.apache.org/hudson/job/clerezza-site/ws/trunk-1.6/slf4j-scala-api/target/slf4j-scala-api-1.6.1-SNAPSHOT.jar>
to /home/hudson/.m2/repository/org/apache/clerezza/ext/slf4j-scala-api/1.6.1-SNAPSHOT/slf4j-scala-api-1.6.1-SNAPSHOT.jar
[INFO] Installing <https://builds.apache.org/hudson/job/clerezza-site/ws/trunk-1.6/slf4j-scala-api/target/slf4j-scala-api-1.6.1-SNAPSHOT-sources.jar>
to /home/hudson/.m2/repository/org/apache/clerezza/ext/slf4j-scala-api/1.6.1-SNAPSHOT/slf4j-scala-api-1.6.1-SNAPSHOT-sources.jar
[INFO] [bundle:install {execution: default-install}]
[INFO] Installing org/apache/clerezza/ext/slf4j-scala-api/1.6.1-SNAPSHOT/slf4j-scala-api-1.6.1-SNAPSHOT.jar
[INFO] Writing OBR metadata
[INFO] snapshot org.apache.maven.plugins:maven-site-plugin:2.4-SNAPSHOT: checking for updates
from apache.snapshots
[INFO] snapshot org.apache.maven.plugins:maven-project-info-reports-plugin:2.4.1-SNAPSHOT:
checking for updates from apache.snapshots
[INFO] snapshot org.apache.maven.plugins:maven-jxr-plugin:2.3-SNAPSHOT: checking for updates
from apache.snapshots
[INFO] snapshot org.apache.maven.jxr:jxr:2.3-SNAPSHOT: checking for updates from apache.snapshots
[INFO] snapshot org.apache.maven.doxia:doxia-decoration-model:1.2.1-SNAPSHOT: checking for
updates from apache.snapshots
Downloading: http://repository.apache.org/snapshots/org/apache/maven/doxia/doxia-decoration-model/1.2.1-SNAPSHOT/doxia-decoration-model-1.2.1-20110528.051042-2.pom
2K downloaded  (doxia-decoration-model-1.2.1-20110528.051042-2.pom)
[INFO] snapshot org.apache.maven.doxia:doxia-sitetools:1.2.1-SNAPSHOT: checking for updates
from apache.snapshots
Downloading: http://repository.apache.org/snapshots/org/apache/maven/doxia/doxia-sitetools/1.2.1-SNAPSHOT/doxia-sitetools-1.2.1-20110528.051042-2.pom
15K downloaded  (doxia-sitetools-1.2.1-20110528.051042-2.pom)
[INFO] snapshot org.apache.maven.doxia:doxia-site-renderer:1.2.1-SNAPSHOT: checking for updates
from apache.snapshots
Downloading: http://repository.apache.org/snapshots/org/apache/maven/doxia/doxia-site-renderer/1.2.1-SNAPSHOT/doxia-site-renderer-1.2.1-20110528.051042-2.pom
5K downloaded  (doxia-site-renderer-1.2.1-20110528.051042-2.pom)
Downloading: http://repository.apache.org/snapshots/org/apache/maven/doxia/doxia-decoration-model/1.2.1-SNAPSHOT/doxia-decoration-model-1.2.1-20110528.051042-2.jar
58K downloaded  (doxia-decoration-model-1.2.1-20110528.051042-2.jar)
Downloading: http://repository.apache.org/snapshots/org/apache/maven/doxia/doxia-site-renderer/1.2.1-SNAPSHOT/doxia-site-renderer-1.2.1-20110528.051042-2.jar
50K downloaded  (doxia-site-renderer-1.2.1-20110528.051042-2.jar)
[INFO] snapshot org.apache.maven:maven-jxr:2.3-SNAPSHOT: checking for updates from apache.snapshots
[INFO] Setting property: classpath.resource.loader.class => 'org.codehaus.plexus.velocity.ContextClassLoaderResourceLoader'.
[INFO] Setting property: velocimacro.messages.on => 'false'.
[INFO] Setting property: resource.loader => 'classpath'.
[INFO] Setting property: resource.manager.logwhenfound => 'false'.
[INFO] ************************************************************** 
[INFO] Starting Jakarta Velocity v1.4
[INFO] RuntimeInstance initializing.
[INFO] Default Properties File: org/apache/velocity/runtime/defaults/velocity.properties
[INFO] Default ResourceManager initializing. (class org.apache.velocity.runtime.resource.ResourceManagerImpl)
[INFO] Resource Loader Instantiated: org.codehaus.plexus.velocity.ContextClassLoaderResourceLoader
[INFO] ClasspathResourceLoader : initialization starting.
[INFO] ClasspathResourceLoader : initialization complete.
[INFO] ResourceCache : initialized. (class org.apache.velocity.runtime.resource.ResourceCacheImpl)
[INFO] Default ResourceManager initialization complete.
[INFO] Loaded System Directive: org.apache.velocity.runtime.directive.Literal
[INFO] Loaded System Directive: org.apache.velocity.runtime.directive.Macro
[INFO] Loaded System Directive: org.apache.velocity.runtime.directive.Parse
[INFO] Loaded System Directive: org.apache.velocity.runtime.directive.Include
[INFO] Loaded System Directive: org.apache.velocity.runtime.directive.Foreach
[INFO] Created: 20 parsers.
[INFO] Velocimacro : initialization starting.
[INFO] Velocimacro : adding VMs from VM library template : VM_global_library.vm
[ERROR] ResourceManager : unable to find resource 'VM_global_library.vm' in any resource loader.
[INFO] Velocimacro : error using  VM library template VM_global_library.vm : org.apache.velocity.exception.ResourceNotFoundException:
Unable to find resource 'VM_global_library.vm'
[INFO] Velocimacro :  VM library template macro registration complete.
[INFO] Velocimacro : allowInline = true : VMs can be defined inline in templates
[INFO] Velocimacro : allowInlineToOverride = false : VMs defined inline may NOT replace previous
VM definitions
[INFO] Velocimacro : allowInlineLocal = false : VMs defined inline will be  global in scope
if allowed.
[INFO] Velocimacro : initialization complete.
[INFO] Velocity successfully started.
[INFO] Preparing clirr:clirr
[JENKINS] Archiving <https://builds.apache.org/hudson/job/clerezza-site/ws/trunk-1.6/slf4j-scala-api/target/slf4j-scala-api-1.6.1-SNAPSHOT-sources.jar>
to /home/hudson/hudson/jobs/clerezza-site/modules/org.apache.clerezza.ext$slf4j-scala-api/builds/2011-05-28_16-02-28/archive/org.apache.clerezza.ext/slf4j-scala-api/1.6.1-SNAPSHOT/slf4j-scala-api-1.6.1-SNAPSHOT-sources.jar
[INFO] [build-helper:parse-version {execution: parse-version}]
[INFO] [resources:resources {execution: default-resources}]
[INFO] Using 'UTF-8' encoding to copy filtered resources.
[INFO] skip non existing resourceDirectory <https://builds.apache.org/hudson/job/clerezza-site/ws/trunk-1.6/slf4j-scala-api/src/main/resources>
[INFO] [compiler:compile {execution: default-compile}]
[INFO] Nothing to compile - all classes are up to date
[INFO] [scala:compile {execution: default}]
[INFO] Checking for multiple versions of scala
[INFO] Nothing to compile - all classes are up to date
[INFO] [site:site {execution: default-site}]
[INFO] Parent project loaded from repository.
[INFO] artifact org.apache.maven.skins:maven-default-skin: checking for updates from central
[INFO] Generating "Clirr" report.
[INFO] Comparing to version: 1.5.6
Downloading: http://repo1.maven.org/maven2/org/apache/clerezza/ext/slf4j-scala-api/1.5.6/slf4j-scala-api-1.5.6.jar
[INFO] Unable to find resource 'org.apache.clerezza.ext:slf4j-scala-api:bundle:1.5.6' in repository
central (http://repo1.maven.org/maven2)
[WARNING] Impossible to find previous version
[ERROR] Unable to find information in class org.slf4j.scala.Logger referring back to nested
class org.slf4j.scala.Logger$
[INFO] ------------------------------------------------------------------------
[ERROR] FATAL ERROR
[INFO] ------------------------------------------------------------------------
[INFO] null
[INFO] ------------------------------------------------------------------------
[INFO] Trace
java.lang.NegativeArraySizeException
	at org.codehaus.mojo.clirr.AbstractClirrMojo.reportDiffs(AbstractClirrMojo.java:660)
	at org.codehaus.mojo.clirr.AbstractClirrMojo.executeClirr(AbstractClirrMojo.java:263)
	at org.codehaus.mojo.clirr.ClirrReport.doReport(ClirrReport.java:243)
	at org.codehaus.mojo.clirr.ClirrReport.generate(ClirrReport.java:219)
	at org.codehaus.mojo.clirr.ClirrReport.generate(ClirrReport.java:355)
	at sun.reflect.NativeMethodAccessorImpl.invoke0(Native Method)
	at sun.reflect.NativeMethodAccessorImpl.invoke(NativeMethodAccessorImpl.java:39)
	at sun.reflect.DelegatingMethodAccessorImpl.invoke(DelegatingMethodAccessorImpl.java:25)
	at java.lang.reflect.Method.invoke(Method.java:597)
	at hudson.maven.agent.ComponentInterceptor.invoke(ComponentInterceptor.java:47)
	at hudson.maven.agent.PluginManagerInterceptor$3.invoke(PluginManagerInterceptor.java:229)
	at $Proxy4.generate(Unknown Source)
	at org.apache.maven.plugins.site.ReportDocumentRenderer.renderDocument(ReportDocumentRenderer.java:139)
	at org.apache.maven.doxia.siterenderer.DefaultSiteRenderer.renderModule(DefaultSiteRenderer.java:269)
	at org.apache.maven.doxia.siterenderer.DefaultSiteRenderer.render(DefaultSiteRenderer.java:101)
	at org.apache.maven.plugins.site.SiteMojo.renderLocale(SiteMojo.java:133)
	at org.apache.maven.plugins.site.SiteMojo.execute(SiteMojo.java:100)
	at org.apache.maven.plugin.DefaultPluginManager.executeMojo(DefaultPluginManager.java:490)
	at hudson.maven.agent.PluginManagerInterceptor.executeMojo(PluginManagerInterceptor.java:182)
	at org.apache.maven.lifecycle.DefaultLifecycleExecutor.executeGoals(DefaultLifecycleExecutor.java:694)
	at org.apache.maven.lifecycle.DefaultLifecycleExecutor.executeGoalWithLifecycle(DefaultLifecycleExecutor.java:556)
	at org.apache.maven.lifecycle.DefaultLifecycleExecutor.executeGoal(DefaultLifecycleExecutor.java:535)
	at org.apache.maven.lifecycle.DefaultLifecycleExecutor.executeGoalAndHandleFailures(DefaultLifecycleExecutor.java:387)
	at org.apache.maven.lifecycle.DefaultLifecycleExecutor.executeTaskSegments(DefaultLifecycleExecutor.java:348)
	at org.apache.maven.lifecycle.DefaultLifecycleExecutor.execute(DefaultLifecycleExecutor.java:180)
	at org.apache.maven.lifecycle.LifecycleExecutorInterceptor.execute(LifecycleExecutorInterceptor.java:65)
	at org.apache.maven.DefaultMaven.doExecute(DefaultMaven.java:328)
	at org.apache.maven.DefaultMaven.execute(DefaultMaven.java:138)
	at org.apache.maven.cli.MavenCli.main(MavenCli.java:362)
	at sun.reflect.NativeMethodAccessorImpl.invoke0(Native Method)
	at sun.reflect.NativeMethodAccessorImpl.invoke(NativeMethodAccessorImpl.java:39)
	at sun.reflect.DelegatingMethodAccessorImpl.invoke(DelegatingMethodAccessorImpl.java:25)
	at java.lang.reflect.Method.invoke(Method.java:597)
	at org.codehaus.classworlds.Launcher.launchEnhanced(Launcher.java:315)
	at org.codehaus.classworlds.Launcher.launch(Launcher.java:255)
	at hudson.maven.agent.Main.launch(Main.java:185)
	at hudson.maven.MavenBuilder.call(MavenBuilder.java:164)
	at hudson.maven.MavenModuleSetBuild$Builder.call(MavenModuleSetBuild.java:987)
	at hudson.maven.MavenModuleSetBuild$Builder.call(MavenModuleSetBuild.java:918)
	at hudson.remoting.UserRequest.perform(UserRequest.java:118)
	at hudson.remoting.UserRequest.perform(UserRequest.java:48)
	at hudson.remoting.Request$2.run(Request.java:270)
	at java.util.concurrent.Executors$RunnableAdapter.call(Executors.java:441)
	at java.util.concurrent.FutureTask$Sync.innerRun(FutureTask.java:303)
	at java.util.concurrent.FutureTask.run(FutureTask.java:138)
	at java.util.concurrent.ThreadPoolExecutor$Worker.runTask(ThreadPoolExecutor.java:886)
	at java.util.concurrent.ThreadPoolExecutor$Worker.run(ThreadPoolExecutor.java:908)
	at java.lang.Thread.run(Thread.java:619)
[INFO] ------------------------------------------------------------------------
[INFO] Total time: 1 minute 
[INFO] Finished at: Sat May 28 09:03:56 PDT 2011
[INFO] Final Memory: 91M/421M
[INFO] ------------------------------------------------------------------------
channel stopped
[locks-and-latches] Releasing all the locks
[locks-and-latches] All the locks released


Mime
View raw message