clerezza-commits mailing list archives

Site index · List index
Message view « Date » · « Thread »
Top « Date » · « Thread »
From Apache Hudson Server <hud...@hudson.apache.org>
Subject Build failed in Hudson: clerezza-trunk-1.6 » Clerezza - Platform Account Control Panel Core #475
Date Thu, 24 Feb 2011 17:37:51 GMT
See <https://hudson.apache.org/hudson/job/clerezza-trunk-1.6/org.apache.clerezza$platform.accountcontrolpanel.core/475/>

------------------------------------------
[INFO] ------------------------------------------------------------------------
[INFO] Building Clerezza - Platform Account Control Panel Core
[INFO]    task-segment: [clean, deploy]
[INFO] ------------------------------------------------------------------------
[INFO] [clean:clean]
[INFO] Deleting file set: <https://hudson.apache.org/hudson/job/clerezza-trunk-1.6/org.apache.clerezza$platform.accountcontrolpanel.core/ws/target>
(included: [**], excluded: [])
[INFO] [resources:resources]
[INFO] Using 'utf-8' encoding to copy filtered resources.
[INFO] Copying 0 resource to META-INF
[INFO] Copying 4 resources
[INFO] snapshot org.apache.clerezza:platform.users.core:0.1-incubating-SNAPSHOT: checking
for updates from apache
[INFO] snapshot org.apache.clerezza:platform.typerendering.scala:0.1-incubating-SNAPSHOT:
checking for updates from apache
[INFO] snapshot org.apache.clerezza:platform.dashboard.core:0.2-incubating-SNAPSHOT: checking
for updates from apache
[INFO] snapshot org.apache.clerezza:platform.accountcontrolpanel.ontologies:0.2-incubating-SNAPSHOT:
checking for updates from apache
[INFO] snapshot org.apache.clerezza:ssl.keygen.base:0.5-incubating-SNAPSHOT: checking for
updates from apache
[INFO] [compiler:compile]
[INFO] Compiling 7 source files to <https://hudson.apache.org/hudson/job/clerezza-trunk-1.6/org.apache.clerezza$platform.accountcontrolpanel.core/ws/target/classes>
[INFO] [scala:compile {execution: default}]
[ERROR] <https://hudson.apache.org/hudson/job/clerezza-trunk-1.6/org.apache.clerezza$platform.accountcontrolpanel.core/ws/src/main/java>
[ERROR] <https://hudson.apache.org/hudson/job/clerezza-trunk-1.6/org.apache.clerezza$platform.accountcontrolpanel.core/ws/src/main/scala>
[INFO] Compiling 9 source files to <https://hudson.apache.org/hudson/job/clerezza-trunk-1.6/org.apache.clerezza$platform.accountcontrolpanel.core/ws/target/classes>
[WARNING] <https://hudson.apache.org/hudson/job/clerezza-trunk-1.6/org.apache.clerezza$platform.accountcontrolpanel.core/ws/src/main/scala/org/apache/clerezza/platform/accountcontrolpanel/profile_panel.scala>:224:
error: value size_= is not a member of org.apache.clerezza.rdf.scala.utils.CollectedIter[org.apache.clerezza.rdf.scala.utils.RichGraphNode]
[WARNING] 	  if (dtIt.size = 0) return "_"
[WARNING]                    ^
[WARNING] <https://hudson.apache.org/hudson/job/clerezza-trunk-1.6/org.apache.clerezza$platform.accountcontrolpanel.core/ws/src/main/scala/org/apache/clerezza/platform/accountcontrolpanel/profile_panel.scala>:230:
error: value size_= is not a member of org.apache.clerezza.rdf.scala.utils.CollectedIter[org.apache.clerezza.rdf.scala.utils.RichGraphNode]
[WARNING] 	  if (dtIt.size = 0) return "warning! missing. Key invalid"
[WARNING]                    ^
[WARNING] <https://hudson.apache.org/hudson/job/clerezza-trunk-1.6/org.apache.clerezza$platform.accountcontrolpanel.core/ws/src/main/scala/org/apache/clerezza/platform/accountcontrolpanel/profile_panel.scala>:247:
error: value size_= is not a member of org.apache.clerezza.rdf.scala.utils.CollectedIter[org.apache.clerezza.rdf.scala.utils.RichGraphNode]
[WARNING] 	  if (dtIt.size = 0) return "warning! missing. Key invalid"
[WARNING]                    ^
[WARNING] three errors found
[HUDSON] Archiving <https://hudson.apache.org/hudson/job/clerezza-trunk-1.6/org.apache.clerezza$platform.accountcontrolpanel.core/ws/pom.xml>
to /home/hudson/hudson/jobs/clerezza-trunk-1.6/modules/org.apache.clerezza$platform.accountcontrolpanel.core/builds/2011-02-24_17-26-30/archive/org.apache.clerezza/platform.accountcontrolpanel.core/0.2-incubating-SNAPSHOT/pom.xml
[INFO] ------------------------------------------------------------------------
[ERROR] BUILD FAILURE
[INFO] ------------------------------------------------------------------------
[INFO] command line returned non-zero value:1
[INFO] ------------------------------------------------------------------------
[INFO] For more information, run Maven with the -e switch
[INFO] ------------------------------------------------------------------------
[INFO] Total time: 10 minutes 53 seconds
[INFO] Finished at: Thu Feb 24 09:37:50 PST 2011
[INFO] Final Memory: 153M/932M
[INFO] ------------------------------------------------------------------------


Mime
View raw message