clerezza-commits mailing list archives

Site index · List index
Message view « Date » · « Thread »
Top « Date » · « Thread »
From Apache Hudson Server <hud...@hudson.apache.org>
Subject Build failed in Hudson: clerezza-trunk-1.6 #368
Date Thu, 23 Sep 2010 17:45:12 GMT
See <https://hudson.apache.org/hudson/job/clerezza-trunk-1.6/368/changes>

Changes:

[mir] CLEREZZA-232: besides resizing, images can now additionally be cropped to match a given
resolution exactly. This is configurable over the felix webconsole

[reto] CLEREZZA-307: fixed synchronization issue causing nullpointer and unavailable renderlet
exception

------------------------------------------
[...truncated 13815 lines...]
 WARN [main] (SetupTDB.java:755) - No BGP optimizer
 WARN [main] (SetupTDB.java:755) - No BGP optimizer
 WARN [main] (SetupTDB.java:755) - No BGP optimizer
 WARN [main] (SetupTDB.java:755) - No BGP optimizer
 WARN [main] (SetupTDB.java:755) - No BGP optimizer
 WARN [main] (SetupTDB.java:755) - No BGP optimizer
 WARN [main] (SetupTDB.java:755) - No BGP optimizer
 WARN [main] (SetupTDB.java:755) - No BGP optimizer
 WARN [main] (SetupTDB.java:755) - No BGP optimizer
 WARN [main] (SetupTDB.java:755) - No BGP optimizer
 WARN [main] (SetupTDB.java:755) - No BGP optimizer
 WARN [main] (SetupTDB.java:755) - No BGP optimizer
Tests run: 25, Failures: 0, Errors: 0, Skipped: 0, Time elapsed: 3.382 sec
Running org.apache.clerezza.rdf.jena.tdb.storage.TdbTcProviderTest
 WARN [main] (SetupTDB.java:755) - No BGP optimizer
 WARN [main] (SetupTDB.java:755) - No BGP optimizer
 WARN [main] (SetupTDB.java:755) - No BGP optimizer
 WARN [main] (SetupTDB.java:755) - No BGP optimizer
 WARN [main] (SetupTDB.java:755) - No BGP optimizer
 WARN [main] (SetupTDB.java:755) - No BGP optimizer
 WARN [main] (SetupTDB.java:755) - No BGP optimizer
 WARN [main] (SetupTDB.java:755) - No BGP optimizer
 WARN [main] (SetupTDB.java:755) - No BGP optimizer
 WARN [main] (SetupTDB.java:755) - No BGP optimizer
 WARN [main] (SetupTDB.java:755) - No BGP optimizer
 WARN [main] (SetupTDB.java:755) - No BGP optimizer
 WARN [main] (SetupTDB.java:755) - No BGP optimizer
 WARN [main] (SetupTDB.java:755) - No BGP optimizer
 WARN [main] (SetupTDB.java:755) - No BGP optimizer
 WARN [main] (SetupTDB.java:755) - No BGP optimizer
 WARN [main] (SetupTDB.java:755) - No BGP optimizer
 WARN [main] (SetupTDB.java:755) - No BGP optimizer
 WARN [main] (SetupTDB.java:755) - No BGP optimizer
 WARN [main] (SetupTDB.java:755) - No BGP optimizer
 WARN [main] (SetupTDB.java:755) - No BGP optimizer
 WARN [main] (SetupTDB.java:755) - No BGP optimizer
 WARN [main] (SetupTDB.java:755) - No BGP optimizer
 WARN [main] (SetupTDB.java:755) - No BGP optimizer
 WARN [main] (SetupTDB.java:755) - No BGP optimizer
 WARN [main] (SetupTDB.java:755) - No BGP optimizer
 WARN [main] (SetupTDB.java:755) - No BGP optimizer
 WARN [main] (SetupTDB.java:755) - No BGP optimizer
 WARN [main] (SetupTDB.java:755) - No BGP optimizer
Tests run: 15, Failures: 0, Errors: 0, Skipped: 0, Time elapsed: 0.553 sec

Results :

Tests run: 40, Failures: 0, Errors: 0, Skipped: 0

[HUDSON] Recording test results
[INFO] [bundle:bundle]
[INFO] Preparing source:jar
[WARNING] Removing: jar from forked lifecycle, to prevent recursive invocation.
[INFO] No goals needed for project - skipping
[INFO] [source:jar {execution: default}]
[INFO] Building jar: <https://hudson.apache.org/hudson/job/clerezza-trunk-1.6/ws/trunk-1.6/org.apache.clerezza.rdf.jena.tdb.storage/target/org.apache.clerezza.rdf.jena.tdb.storage-0.5-incubating-SNAPSHOT-sources.jar>
[INFO] [install:install]
[INFO] Installing <https://hudson.apache.org/hudson/job/clerezza-trunk-1.6/ws/trunk-1.6/org.apache.clerezza.rdf.jena.tdb.storage/target/org.apache.clerezza.rdf.jena.tdb.storage-0.5-incubating-SNAPSHOT.jar>
to /home/hudson/.m2/repository/org/apache/clerezza/org.apache.clerezza.rdf.jena.tdb.storage/0.5-incubating-SNAPSHOT/org.apache.clerezza.rdf.jena.tdb.storage-0.5-incubating-SNAPSHOT.jar
[INFO] Installing <https://hudson.apache.org/hudson/job/clerezza-trunk-1.6/ws/trunk-1.6/org.apache.clerezza.rdf.jena.tdb.storage/target/org.apache.clerezza.rdf.jena.tdb.storage-0.5-incubating-SNAPSHOT-sources.jar>
to /home/hudson/.m2/repository/org/apache/clerezza/org.apache.clerezza.rdf.jena.tdb.storage/0.5-incubating-SNAPSHOT/org.apache.clerezza.rdf.jena.tdb.storage-0.5-incubating-SNAPSHOT-sources.jar
[INFO] [bundle:install]
[WARNING] Exception while updating local OBR: Unable to read repository xml: file:/home/hudson/.m2/repository/repository.xml
org.apache.maven.plugin.MojoExecutionException: Unable to read repository xml: file:/home/hudson/.m2/repository/repository.xml
	at org.apache.felix.obrplugin.ObrUpdate.parseRepositoryXml(ObrUpdate.java:295)
	at org.apache.felix.obrplugin.ObrInstall.execute(ObrInstall.java:140)
	at org.apache.maven.plugin.DefaultPluginManager.executeMojo(DefaultPluginManager.java:451)
	at hudson.maven.agent.PluginManagerInterceptor.executeMojo(PluginManagerInterceptor.java:182)
	at org.apache.maven.lifecycle.DefaultLifecycleExecutor.executeGoals(DefaultLifecycleExecutor.java:558)
	at org.apache.maven.lifecycle.DefaultLifecycleExecutor.executeGoalWithLifecycle(DefaultLifecycleExecutor.java:499)
	at org.apache.maven.lifecycle.DefaultLifecycleExecutor.executeGoal(DefaultLifecycleExecutor.java:478)
	at org.apache.maven.lifecycle.DefaultLifecycleExecutor.executeGoalAndHandleFailures(DefaultLifecycleExecutor.java:330)
	at org.apache.maven.lifecycle.DefaultLifecycleExecutor.executeTaskSegments(DefaultLifecycleExecutor.java:291)
	at org.apache.maven.lifecycle.DefaultLifecycleExecutor.execute(DefaultLifecycleExecutor.java:142)
	at org.apache.maven.lifecycle.LifecycleExecutorInterceptor.execute(LifecycleExecutorInterceptor.java:65)
	at org.apache.maven.DefaultMaven.doExecute(DefaultMaven.java:336)
	at org.apache.maven.DefaultMaven.execute(DefaultMaven.java:129)
	at org.apache.maven.cli.MavenCli.main(MavenCli.java:287)
	at sun.reflect.NativeMethodAccessorImpl.invoke0(Native Method)
	at sun.reflect.NativeMethodAccessorImpl.invoke(NativeMethodAccessorImpl.java:39)
	at sun.reflect.DelegatingMethodAccessorImpl.invoke(DelegatingMethodAccessorImpl.java:25)
	at java.lang.reflect.Method.invoke(Method.java:597)
	at org.codehaus.classworlds.Launcher.launchEnhanced(Launcher.java:315)
	at org.codehaus.classworlds.Launcher.launch(Launcher.java:255)
	at hudson.maven.agent.Main.launch(Main.java:165)
	at hudson.maven.MavenBuilder.call(MavenBuilder.java:165)
	at hudson.maven.MavenModuleSetBuild$Builder.call(MavenModuleSetBuild.java:681)
	at hudson.maven.MavenModuleSetBuild$Builder.call(MavenModuleSetBuild.java:625)
	at hudson.remoting.UserRequest.perform(UserRequest.java:114)
	at hudson.remoting.UserRequest.perform(UserRequest.java:48)
	at hudson.remoting.Request$2.run(Request.java:270)
	at java.util.concurrent.Executors$RunnableAdapter.call(Executors.java:441)
	at java.util.concurrent.FutureTask$Sync.innerRun(FutureTask.java:303)
	at java.util.concurrent.FutureTask.run(FutureTask.java:138)
	at java.util.concurrent.ThreadPoolExecutor$Worker.runTask(ThreadPoolExecutor.java:886)
	at java.util.concurrent.ThreadPoolExecutor$Worker.run(ThreadPoolExecutor.java:908)
	at java.lang.Thread.run(Thread.java:619)
Caused by: org.xmlpull.v1.XmlPullParserException: unexpected type (position:END_DOCUMENT null@3:1
in java.io.InputStreamReader@19c5c0c) 
	at org.kxml2.io.KXmlParser.exception(Unknown Source)
	at org.kxml2.io.KXmlParser.nextTag(Unknown Source)
	at org.apache.felix.bundlerepository.impl.PullParser.parseRepository(PullParser.java:43)
	at org.apache.felix.bundlerepository.impl.DataModelHelperImpl.repository(DataModelHelperImpl.java:147)
	at org.apache.felix.bundlerepository.impl.DataModelHelperImpl.repository(DataModelHelperImpl.java:118)
	at org.apache.felix.obrplugin.ObrUpdate.parseRepositoryXml(ObrUpdate.java:291)
	... 32 more
[INFO] [deploy:deploy]
[INFO] Retrieving previous build number from apache.snapshots.https
Uploading: https://repository.apache.org/content/repositories/snapshots/org/apache/clerezza/org.apache.clerezza.rdf.jena.tdb.storage/0.5-incubating-SNAPSHOT/org.apache.clerezza.rdf.jena.tdb.storage-0.5-incubating-20100923.154705-98.jar
10K uploaded
[INFO] Retrieving previous metadata from apache.snapshots.https
[INFO] Uploading repository metadata for: 'snapshot org.apache.clerezza:org.apache.clerezza.rdf.jena.tdb.storage:0.5-incubating-SNAPSHOT'
[INFO] Retrieving previous metadata from apache.snapshots.https
[INFO] Uploading repository metadata for: 'artifact org.apache.clerezza:org.apache.clerezza.rdf.jena.tdb.storage'
[INFO] Uploading project information for org.apache.clerezza.rdf.jena.tdb.storage 0.5-incubating-20100923.154705-98
[INFO] Retrieving previous build number from apache.snapshots.https
Uploading: https://repository.apache.org/content/repositories/snapshots/org/apache/clerezza/org.apache.clerezza.rdf.jena.tdb.storage/0.5-incubating-SNAPSHOT/org.apache.clerezza.rdf.jena.tdb.storage-0.5-incubating-20100923.154705-98-sources.jar
4K uploaded
[INFO] [bundle:deploy]
[INFO] Remote OBR update disabled (enable with -DremoteOBR)
[HUDSON] Archiving <https://hudson.apache.org/hudson/job/clerezza-trunk-1.6/ws/trunk-1.6/org.apache.clerezza.rdf.jena.tdb.storage/pom.xml>
to /home/hudson/hudson/jobs/clerezza-trunk-1.6/modules/org.apache.clerezza$org.apache.clerezza.rdf.jena.tdb.storage/builds/2010-09-23_15-46-41/archive/org.apache.clerezza/org.apache.clerezza.rdf.jena.tdb.storage/0.5-incubating-SNAPSHOT/pom.xml
[HUDSON] Archiving <https://hudson.apache.org/hudson/job/clerezza-trunk-1.6/ws/trunk-1.6/org.apache.clerezza.rdf.jena.tdb.storage/target/org.apache.clerezza.rdf.jena.tdb.storage-0.5-incubating-SNAPSHOT.jar>
to /home/hudson/hudson/jobs/clerezza-trunk-1.6/modules/org.apache.clerezza$org.apache.clerezza.rdf.jena.tdb.storage/builds/2010-09-23_15-46-41/archive/org.apache.clerezza/org.apache.clerezza.rdf.jena.tdb.storage/0.5-incubating-20100923.154705-98/org.apache.clerezza.rdf.jena.tdb.storage-0.5-incubating-SNAPSHOT.jar
[HUDSON] Archiving <https://hudson.apache.org/hudson/job/clerezza-trunk-1.6/ws/trunk-1.6/org.apache.clerezza.rdf.jena.tdb.storage/target/org.apache.clerezza.rdf.jena.tdb.storage-0.5-incubating-SNAPSHOT-sources.jar>
to /home/hudson/hudson/jobs/clerezza-trunk-1.6/modules/org.apache.clerezza$org.apache.clerezza.rdf.jena.tdb.storage/builds/2010-09-23_15-46-41/archive/org.apache.clerezza/org.apache.clerezza.rdf.jena.tdb.storage/0.5-incubating-20100923.154705-98/org.apache.clerezza.rdf.jena.tdb.storage-0.5-incubating-SNAPSHOT-sources.jar
[INFO] ------------------------------------------------------------------------
[INFO] Building Clerezza - Platform Launcher with Jena TDB
[INFO]    task-segment: [clean, deploy]
[INFO] ------------------------------------------------------------------------
[INFO] [clean:clean]
[INFO] Deleting file set: <https://hudson.apache.org/hudson/job/clerezza-trunk-1.6/ws/trunk-1.6/org.apache.clerezza.platform.launcher.tdb/target>
(included: [**], excluded: [])
[INFO] snapshot org.apache.clerezza:org.apache.clerezza.rdf.jena.tdb.storage:0.5-incubating-SNAPSHOT:
checking for updates from ops4j
[INFO] snapshot org.apache.clerezza:org.apache.clerezza.rdf.jena.tdb.storage:0.5-incubating-SNAPSHOT:
checking for updates from apache
[INFO] snapshot org.apache.clerezza.ext:com.hp.hpl.jena.tdb:0.3-incubating-SNAPSHOT: checking
for updates from ops4j
[INFO] snapshot org.apache.clerezza.ext:com.hp.hpl.jena.tdb:0.3-incubating-SNAPSHOT: checking
for updates from apache
[INFO] [dependency:unpack-dependencies {execution: inline-jars}]
[INFO] Unpacking <https://hudson.apache.org/hudson/job/clerezza-trunk-1.6/ws/trunk-1.6/org.apache.clerezza.platform.launcher.storageless.parent/org.apache.clerezza.platform.launcher.storageless/target/org.apache.clerezza.platform.launcher.storageless-0.8-incubating-SNAPSHOT.jar>
to
  <https://hudson.apache.org/hudson/job/clerezza-trunk-1.6/ws/trunk-1.6/org.apache.clerezza.platform.launcher.tdb/target/extracted>
   with includes ** and excludes:META-INF/**,**/com.hp.hpl.jena*
[INFO] [dependency:copy-dependencies {execution: copy-platform-bundles}]
[INFO] Installing /home/hudson/.m2/repository/org/apache/clerezza/org.apache.clerezza.rdf.jena.tdb.storage/0.5-incubating-SNAPSHOT/org.apache.clerezza.rdf.jena.tdb.storage-0.5-incubating-SNAPSHOT.jar
to <https://hudson.apache.org/hudson/job/clerezza-trunk-1.6/ws/trunk-1.6/org.apache.clerezza.platform.launcher.tdb/target/bundles/startlevel-3/org/apache/clerezza/org.apache.clerezza.rdf.jena.tdb.storage/0.5-incubating-SNAPSHOT/org.apache.clerezza.rdf.jena.tdb.storage-0.5-incubating-20100923.154705-98.jar>
[INFO] Installing /home/hudson/.m2/repository/org/apache/clerezza/org.apache.clerezza.rdf.jena.tdb.storage/0.5-incubating-SNAPSHOT/org.apache.clerezza.rdf.jena.tdb.storage-0.5-incubating-SNAPSHOT.jar
to <https://hudson.apache.org/hudson/job/clerezza-trunk-1.6/ws/trunk-1.6/org.apache.clerezza.platform.launcher.tdb/target/bundles/startlevel-3/org/apache/clerezza/org.apache.clerezza.rdf.jena.tdb.storage/0.5-incubating-SNAPSHOT/org.apache.clerezza.rdf.jena.tdb.storage-0.5-incubating-SNAPSHOT.jar>
[INFO] Installing /home/hudson/.m2/repository/org/apache/clerezza/ext/com.hp.hpl.jena.tdb/0.3-incubating-SNAPSHOT/com.hp.hpl.jena.tdb-0.3-incubating-SNAPSHOT.jar
to <https://hudson.apache.org/hudson/job/clerezza-trunk-1.6/ws/trunk-1.6/org.apache.clerezza.platform.launcher.tdb/target/bundles/startlevel-3/org/apache/clerezza/ext/com.hp.hpl.jena.tdb/0.3-incubating-SNAPSHOT/com.hp.hpl.jena.tdb-0.3-incubating-20100923.154705-123.jar>
[INFO] Installing /home/hudson/.m2/repository/org/apache/clerezza/ext/com.hp.hpl.jena.tdb/0.3-incubating-SNAPSHOT/com.hp.hpl.jena.tdb-0.3-incubating-SNAPSHOT.jar
to <https://hudson.apache.org/hudson/job/clerezza-trunk-1.6/ws/trunk-1.6/org.apache.clerezza.platform.launcher.tdb/target/bundles/startlevel-3/org/apache/clerezza/ext/com.hp.hpl.jena.tdb/0.3-incubating-SNAPSHOT/com.hp.hpl.jena.tdb-0.3-incubating-SNAPSHOT.jar>
[INFO] [resources:resources]
[INFO] Using 'utf-8' encoding to copy filtered resources.
[INFO] Copying 635 resources
[INFO] Copying 1 resource to META-INF
[INFO] Copying 6 resources to bundles
[INFO] [compiler:compile]
[INFO] No sources to compile
[INFO] [scr:scr {execution: generate-scr-scrdescriptor}]
[INFO] [resources:testResources]
[INFO] Using 'utf-8' encoding to copy filtered resources.
[INFO] skip non existing resourceDirectory <https://hudson.apache.org/hudson/job/clerezza-trunk-1.6/ws/trunk-1.6/org.apache.clerezza.platform.launcher.tdb/src/test/resources>
[INFO] [compiler:testCompile]
[INFO] No sources to compile
[INFO] [surefire:test]
[INFO] No tests to run.
[HUDSON] Recording test results
[INFO] [jar:jar]
[INFO] Building jar: <https://hudson.apache.org/hudson/job/clerezza-trunk-1.6/ws/trunk-1.6/org.apache.clerezza.platform.launcher.tdb/target/org.apache.clerezza.platform.launcher.tdb-0.5-incubating-SNAPSHOT.jar>
[INFO] Preparing source:jar
[WARNING] Removing: jar from forked lifecycle, to prevent recursive invocation.
[INFO] No goals needed for project - skipping
[INFO] [source:jar {execution: default}]
[INFO] Building jar: <https://hudson.apache.org/hudson/job/clerezza-trunk-1.6/ws/trunk-1.6/org.apache.clerezza.platform.launcher.tdb/target/org.apache.clerezza.platform.launcher.tdb-0.5-incubating-SNAPSHOT-sources.jar>
[INFO] [install:install]
[INFO] Installing <https://hudson.apache.org/hudson/job/clerezza-trunk-1.6/ws/trunk-1.6/org.apache.clerezza.platform.launcher.tdb/target/org.apache.clerezza.platform.launcher.tdb-0.5-incubating-SNAPSHOT.jar>
to /home/hudson/.m2/repository/org/apache/clerezza/org.apache.clerezza.platform.launcher.tdb/0.5-incubating-SNAPSHOT/org.apache.clerezza.platform.launcher.tdb-0.5-incubating-SNAPSHOT.jar
[INFO] Installing <https://hudson.apache.org/hudson/job/clerezza-trunk-1.6/ws/trunk-1.6/org.apache.clerezza.platform.launcher.tdb/target/org.apache.clerezza.platform.launcher.tdb-0.5-incubating-SNAPSHOT-sources.jar>
to /home/hudson/.m2/repository/org/apache/clerezza/org.apache.clerezza.platform.launcher.tdb/0.5-incubating-SNAPSHOT/org.apache.clerezza.platform.launcher.tdb-0.5-incubating-SNAPSHOT-sources.jar
[INFO] [deploy:deploy]
[INFO] Retrieving previous build number from apache.snapshots.https
Uploading: https://repository.apache.org/content/repositories/snapshots/org/apache/clerezza/org.apache.clerezza.platform.launcher.tdb/0.5-incubating-SNAPSHOT/org.apache.clerezza.platform.launcher.tdb-0.5-incubating-20100923.154705-98.jar
80600K uploaded
[INFO] Retrieving previous metadata from apache.snapshots.https
[INFO] Uploading repository metadata for: 'artifact org.apache.clerezza:org.apache.clerezza.platform.launcher.tdb'
[INFO] Retrieving previous metadata from apache.snapshots.https
[INFO] Uploading repository metadata for: 'snapshot org.apache.clerezza:org.apache.clerezza.platform.launcher.tdb:0.5-incubating-SNAPSHOT'
[INFO] Uploading project information for org.apache.clerezza.platform.launcher.tdb 0.5-incubating-20100923.154705-98
[INFO] Retrieving previous build number from apache.snapshots.https
Uploading: https://repository.apache.org/content/repositories/snapshots/org/apache/clerezza/org.apache.clerezza.platform.launcher.tdb/0.5-incubating-SNAPSHOT/org.apache.clerezza.platform.launcher.tdb-0.5-incubating-20100923.154705-98-sources.jar
80597K uploaded
[HUDSON] Archiving <https://hudson.apache.org/hudson/job/clerezza-trunk-1.6/ws/trunk-1.6/org.apache.clerezza.platform.launcher.tdb/pom.xml>
to /home/hudson/hudson/jobs/clerezza-trunk-1.6/modules/org.apache.clerezza$org.apache.clerezza.platform.launcher.tdb/builds/2010-09-23_15-46-41/archive/org.apache.clerezza/org.apache.clerezza.platform.launcher.tdb/0.5-incubating-SNAPSHOT/pom.xml
[HUDSON] Archiving <https://hudson.apache.org/hudson/job/clerezza-trunk-1.6/ws/trunk-1.6/org.apache.clerezza.platform.launcher.tdb/target/org.apache.clerezza.platform.launcher.tdb-0.5-incubating-SNAPSHOT.jar>
to /home/hudson/hudson/jobs/clerezza-trunk-1.6/modules/org.apache.clerezza$org.apache.clerezza.platform.launcher.tdb/builds/2010-09-23_15-46-41/archive/org.apache.clerezza/org.apache.clerezza.platform.launcher.tdb/0.5-incubating-20100923.154705-98/org.apache.clerezza.platform.launcher.tdb-0.5-incubating-SNAPSHOT.jar
Build timed out. Aborting
Sending e-mails to: clerezza-commits@incubator.apache.org
channel stopped
[INFO] ------------------------------------------------------------------------
[ERROR] FATAL ERROR
[INFO] ------------------------------------------------------------------------
[INFO] null
[INFO] ------------------------------------------------------------------------
[INFO] Trace
java.lang.reflect.UndeclaredThrowableException
	at $Proxy2.isArchivingDisabled(Unknown Source)
	at hudson.maven.MavenBuildProxy$Filter.isArchivingDisabled(MavenBuildProxy.java:222)
	at hudson.maven.reporters.MavenArtifact.archive(MavenArtifact.java:192)
	at hudson.maven.reporters.MavenArtifactArchiver.postBuild(MavenArtifactArchiver.java:107)
	at hudson.maven.MavenModuleSetBuild$Builder.postModule(MavenModuleSetBuild.java:731)
	at hudson.maven.MavenBuilder$Adapter.fireLeaveModule(MavenBuilder.java:317)
	at hudson.maven.MavenBuilder$Adapter.postBuild(MavenBuilder.java:275)
	at org.apache.maven.lifecycle.LifecycleExecutorInterceptor.execute(LifecycleExecutorInterceptor.java:68)
	at org.apache.maven.DefaultMaven.doExecute(DefaultMaven.java:336)
	at org.apache.maven.DefaultMaven.execute(DefaultMaven.java:129)
	at org.apache.maven.cli.MavenCli.main(MavenCli.java:287)
	at sun.reflect.NativeMethodAccessorImpl.invoke0(Native Method)
	at sun.reflect.NativeMethodAccessorImpl.invoke(NativeMethodAccessorImpl.java:39)
	at sun.reflect.DelegatingMethodAccessorImpl.invoke(DelegatingMethodAccessorImpl.java:25)
	at java.lang.reflect.Method.invoke(Method.java:597)
	at org.codehaus.classworlds.Launcher.launchEnhanced(Launcher.java:315)
	at org.codehaus.classworlds.Launcher.launch(Launcher.java:255)
	at hudson.maven.agent.Main.launch(Main.java:165)
	at hudson.maven.MavenBuilder.call(MavenBuilder.java:165)
	at hudson.maven.MavenModuleSetBuild$Builder.call(MavenModuleSetBuild.java:681)
	at hudson.maven.MavenModuleSetBuild$Builder.call(MavenModuleSetBuild.java:625)
	at hudson.remoting.UserRequest.perform(UserRequest.java:114)
	at hudson.remoting.UserRequest.perform(UserRequest.java:48)
	at hudson.remoting.Request$2.run(Request.java:270)
	at java.util.concurrent.Executors$RunnableAdapter.call(Executors.java:441)
	at java.util.concurrent.FutureTask$Sync.innerRun(FutureTask.java:303)
	at java.util.concurrent.FutureTask.run(FutureTask.java:138)
	at java.util.concurrent.ThreadPoolExecutor$Worker.runTask(ThreadPoolExecutor.java:886)
	at java.util.concurrent.ThreadPoolExecutor$Worker.run(ThreadPoolExecutor.java:908)
	at java.lang.Thread.run(Thread.java:619)
Caused by: hudson.remoting.ChannelClosedException: channel is already closed
	at hudson.remoting.Channel.send(Channel.java:414)
	at hudson.remoting.Request.call(Request.java:105)
	at hudson.remoting.Channel.call(Channel.java:557)
	at hudson.remoting.RemoteInvocationHandler.invoke(RemoteInvocationHandler.java:158)
	... 30 more
Caused by: hudson.remoting.Channel$OrderlyShutdown
	at hudson.remoting.Channel$CloseCommand.execute(Channel.java:691)
	at hudson.remoting.Channel$ReaderThread.run(Channel.java:890)
Caused by: Command close created at
	at hudson.remoting.Command.<init>(Command.java:58)
	at hudson.remoting.Command.<init>(Command.java:47)
	at hudson.remoting.Channel$CloseCommand.<init>(Channel.java:687)
	at hudson.remoting.Channel$CloseCommand.<init>(Channel.java:687)
	at hudson.remoting.Channel.close(Channel.java:732)
	at hudson.slaves.Channels$1.close(Channels.java:91)
	at hudson.maven.ProcessCache$MavenProcess.discard(ProcessCache.java:145)
	at hudson.maven.MavenModuleSetBuild$RunnerImpl.doRun(MavenModuleSetBuild.java:472)
	at hudson.model.AbstractBuild$AbstractRunner.run(AbstractBuild.java:416)
	at hudson.model.Run.run(Run.java:1273)
	at hudson.maven.MavenModuleSetBuild.run(MavenModuleSetBuild.java:291)
	at hudson.model.ResourceController.execute(ResourceController.java:88)
	at hudson.model.Executor.run(Executor.java:129)
[INFO] ------------------------------------------------------------------------
[INFO] Total time: 118 minutes 19 seconds
[INFO] Finished at: Thu Sep 23 17:45:10 UTC 2010
[INFO] Final Memory: 146M/925M
[INFO] ------------------------------------------------------------------------
[locks-and-latches] Releasing all the locks
[locks-and-latches] All the locks released


Mime
View raw message