chukwa-dev mailing list archives

Site index · List index
Message view « Date » · « Thread »
Top « Date » · « Thread »
From Apache Jenkins Server <jenk...@builds.apache.org>
Subject Build failed in Jenkins: Chukwa-master #582
Date Sat, 27 May 2017 15:58:48 GMT
See <https://builds.apache.org/job/Chukwa-master/582/display/redirect?page=changes>

Changes:

[fay.y.wang] add Apache license header

------------------------------------------
[...truncated 9.10 KB...]
[INFO] Loading wadlGenerator com.sun.jersey.server.wadl.generators.WadlGeneratorGrammarsSupport
[INFO] Loading wadlGenerator com.sun.jersey.server.wadl.generators.resourcedoc.WadlGeneratorResourceDocSupport
May 27, 2017 3:38:57 PM com.sun.jersey.api.core.PackagesResourceConfig init
INFO: Scanning for root resource and provider classes in the packages:
  org.apache.hadoop.chukwa.datacollection.agent.rest
May 27, 2017 3:38:57 PM com.sun.jersey.api.core.ScanningResourceConfig logClasses
INFO: Root resource classes found:
  class org.apache.hadoop.chukwa.datacollection.agent.rest.AdaptorController
May 27, 2017 3:38:57 PM com.sun.jersey.api.core.ScanningResourceConfig logClasses
INFO: Provider classes found:
  class org.apache.hadoop.chukwa.datacollection.agent.rest.ContextProvider
[INFO] Wrote <https://builds.apache.org/job/Chukwa-master/ws/target/classes/application.wadl>
[INFO] 
[INFO] --- maven-wadl-plugin:1.8:generate (hicc-rest) @ chukwa ---
[INFO] Loading wadlGenerator com.sun.jersey.server.wadl.generators.WadlGeneratorApplicationDoc
[INFO] Loading wadlGenerator com.sun.jersey.server.wadl.generators.WadlGeneratorGrammarsSupport
[INFO] Loading wadlGenerator com.sun.jersey.server.wadl.generators.resourcedoc.WadlGeneratorResourceDocSupport
May 27, 2017 3:38:57 PM com.sun.jersey.api.core.PackagesResourceConfig init
INFO: Scanning for root resource and provider classes in the packages:
  org.apache.hadoop.chukwa.hicc.rest
May 27, 2017 3:38:57 PM com.sun.jersey.api.core.ScanningResourceConfig logClasses
INFO: Root resource classes found:
  class org.apache.hadoop.chukwa.hicc.rest.ChartController
  class org.apache.hadoop.chukwa.hicc.rest.CirclesController
  class org.apache.hadoop.chukwa.hicc.rest.HeatmapController
  class org.apache.hadoop.chukwa.hicc.rest.WidgetController
  class org.apache.hadoop.chukwa.hicc.rest.LoginController
  class org.apache.hadoop.chukwa.hicc.rest.PieChartController
  class org.apache.hadoop.chukwa.hicc.rest.SessionController
  class org.apache.hadoop.chukwa.hicc.rest.DashboardController
  class org.apache.hadoop.chukwa.hicc.rest.MetricsController
  class org.apache.hadoop.chukwa.hicc.rest.TileController
May 27, 2017 3:38:57 PM com.sun.jersey.api.core.ScanningResourceConfig logClasses
INFO: Provider classes found:
  class org.apache.hadoop.chukwa.hicc.rest.VelocityResolver
[INFO] Wrote <https://builds.apache.org/job/Chukwa-master/ws/target/classes/hicc-application.wadl>
[INFO] 
[INFO] --- maven-antrun-plugin:1.6:run (test-setup) @ chukwa ---
[INFO] Executing tasks

main:
    [mkdir] Created dir: <https://builds.apache.org/job/Chukwa-master/ws/target/test/conf>
    [mkdir] Created dir: <https://builds.apache.org/job/Chukwa-master/ws/target/test/var>
    [mkdir] Created dir: <https://builds.apache.org/job/Chukwa-master/ws/target/test/var/log>
    [mkdir] Created dir: <https://builds.apache.org/job/Chukwa-master/ws/target/test/var/run>
     [copy] Copying 3 files to <https://builds.apache.org/job/Chukwa-master/ws/target/test/var/log>
     [copy] Copying 1 file to <https://builds.apache.org/job/Chukwa-master/ws/target/test/conf>
     [copy] Copying 1 file to <https://builds.apache.org/job/Chukwa-master/ws/target/test/conf>
     [copy] Copying 1 file to <https://builds.apache.org/job/Chukwa-master/ws/target/test/conf>
     [copy] Copying 1 file to <https://builds.apache.org/job/Chukwa-master/ws/target/test/conf>
     [copy] Copying 1 file to <https://builds.apache.org/job/Chukwa-master/ws/target/test/conf>
     [copy] Copying 1 file to <https://builds.apache.org/job/Chukwa-master/ws/target/test/conf>
     [copy] Copying 1 file to <https://builds.apache.org/job/Chukwa-master/ws/target/test/conf>
     [copy] Copying 1 file to <https://builds.apache.org/job/Chukwa-master/ws/target/test/var>
[INFO] Executed tasks
[INFO] 
[INFO] --- maven-resources-plugin:2.6:testResources (default-testResources) @ chukwa ---
[INFO] Using 'UTF-8' encoding to copy filtered resources.
[INFO] Copying 0 resource
[INFO] Copying 7 resources
[INFO] 
[INFO] --- maven-compiler-plugin:3.1:testCompile (default-testCompile) @ chukwa ---
[INFO] Changes detected - recompiling the module!
[INFO] Compiling 103 source files to <https://builds.apache.org/job/Chukwa-master/ws/target/test-classes>
[WARNING] <https://builds.apache.org/job/Chukwa-master/ws/src/test/java/org/apache/hadoop/chukwa/datacollection/collector/TestDelayedAcks.java>:
Some input files use or override a deprecated API.
[WARNING] <https://builds.apache.org/job/Chukwa-master/ws/src/test/java/org/apache/hadoop/chukwa/datacollection/collector/TestDelayedAcks.java>:
Recompile with -Xlint:deprecation for details.
[WARNING] <https://builds.apache.org/job/Chukwa-master/ws/src/test/java/org/apache/hadoop/chukwa/datacollection/adaptor/TestRestAdaptor.java>:
Some input files use unchecked or unsafe operations.
[WARNING] <https://builds.apache.org/job/Chukwa-master/ws/src/test/java/org/apache/hadoop/chukwa/datacollection/adaptor/TestRestAdaptor.java>:
Recompile with -Xlint:unchecked for details.
[INFO] 
[INFO] --- maven-surefire-plugin:2.18.1:test (default-test) @ chukwa ---
[WARNING] The parameter forkMode is deprecated since version 2.14. Use forkCount and reuseForks
instead.
[INFO] Surefire report directory: <https://builds.apache.org/job/Chukwa-master/ws/target/test-reports>

-------------------------------------------------------
 T E S T S
-------------------------------------------------------
Running org.apache.hadoop.chukwa.extraction.demux.processor.mapper.TestLog4JMetricsContextChukwaRecord
Tests run: 1, Failures: 0, Errors: 0, Skipped: 0, Time elapsed: 0.298 sec - in org.apache.hadoop.chukwa.extraction.demux.processor.mapper.TestLog4JMetricsContextChukwaRecord
Running org.apache.hadoop.chukwa.extraction.demux.processor.mapper.TestAbtractProcessor
Tests run: 1, Failures: 0, Errors: 0, Skipped: 0, Time elapsed: 0.283 sec - in org.apache.hadoop.chukwa.extraction.demux.processor.mapper.TestAbtractProcessor
Running org.apache.hadoop.chukwa.extraction.demux.processor.mapper.TestJsonProcessors
Tests run: 7, Failures: 0, Errors: 0, Skipped: 0, Time elapsed: 0.341 sec - in org.apache.hadoop.chukwa.extraction.demux.processor.mapper.TestJsonProcessors
Running org.apache.hadoop.chukwa.extraction.demux.processor.mapper.TestHadoopLogProcessor
Tests run: 1, Failures: 0, Errors: 0, Skipped: 0, Time elapsed: 2.333 sec - in org.apache.hadoop.chukwa.extraction.demux.processor.mapper.TestHadoopLogProcessor
Running org.apache.hadoop.chukwa.extraction.demux.processor.mapper.TestTsProcessor
Tests run: 8, Failures: 0, Errors: 0, Skipped: 0, Time elapsed: 1.349 sec - in org.apache.hadoop.chukwa.extraction.demux.processor.mapper.TestTsProcessor
Running org.apache.hadoop.chukwa.extraction.demux.TestDemux
Tests run: 1, Failures: 0, Errors: 0, Skipped: 0, Time elapsed: 32.408 sec - in org.apache.hadoop.chukwa.extraction.demux.TestDemux
Running org.apache.hadoop.chukwa.extraction.demux.TestDemuxMapperConfigs
Tests run: 2, Failures: 0, Errors: 0, Skipped: 0, Time elapsed: 0.996 sec - in org.apache.hadoop.chukwa.extraction.demux.TestDemuxMapperConfigs
Running org.apache.hadoop.chukwa.extraction.demux.TestDemuxReducerConfigs
Tests run: 2, Failures: 0, Errors: 0, Skipped: 0, Time elapsed: 1.058 sec - in org.apache.hadoop.chukwa.extraction.demux.TestDemuxReducerConfigs
Running org.apache.hadoop.chukwa.extraction.demux.TestPostDemuxTrigger
Tests run: 2, Failures: 0, Errors: 0, Skipped: 0, Time elapsed: 1.588 sec - in org.apache.hadoop.chukwa.extraction.demux.TestPostDemuxTrigger
Running org.apache.hadoop.chukwa.database.TestMacro
Tests run: 2, Failures: 0, Errors: 0, Skipped: 0, Time elapsed: 0.29 sec - in org.apache.hadoop.chukwa.database.TestMacro
Running org.apache.hadoop.chukwa.datacollection.collector.TestBackpressure
Tests run: 1, Failures: 0, Errors: 0, Skipped: 0, Time elapsed: 42.122 sec - in org.apache.hadoop.chukwa.datacollection.collector.TestBackpressure
Running org.apache.hadoop.chukwa.datacollection.collector.TestAdaptorTimeout
Tests run: 1, Failures: 0, Errors: 0, Skipped: 0, Time elapsed: 38.108 sec - in org.apache.hadoop.chukwa.datacollection.collector.TestAdaptorTimeout
Running org.apache.hadoop.chukwa.datacollection.collector.TestFailedCollectorAck
Tests run: 1, Failures: 0, Errors: 0, Skipped: 0, Time elapsed: 28.494 sec - in org.apache.hadoop.chukwa.datacollection.collector.TestFailedCollectorAck
Running org.apache.hadoop.chukwa.datacollection.collector.TestDelayedAcks
Tests run: 3, Failures: 0, Errors: 0, Skipped: 0, Time elapsed: 45.873 sec - in org.apache.hadoop.chukwa.datacollection.collector.TestDelayedAcks
Running org.apache.hadoop.chukwa.datacollection.connector.TestFailedCollector
Tests run: 1, Failures: 0, Errors: 0, Skipped: 0, Time elapsed: 0.871 sec - in org.apache.hadoop.chukwa.datacollection.connector.TestFailedCollector
Running org.apache.hadoop.chukwa.datacollection.adaptor.JMX.TestJMXAdaptor
Tests run: 1, Failures: 0, Errors: 0, Skipped: 0, Time elapsed: 1.364 sec - in org.apache.hadoop.chukwa.datacollection.adaptor.JMX.TestJMXAdaptor
Running org.apache.hadoop.chukwa.datacollection.adaptor.TestSocketAdaptor
Tests run: 1, Failures: 0, Errors: 0, Skipped: 0, Time elapsed: 14.175 sec - in org.apache.hadoop.chukwa.datacollection.adaptor.TestSocketAdaptor
Running org.apache.hadoop.chukwa.datacollection.adaptor.TestExecAdaptor
Tests run: 2, Failures: 0, Errors: 0, Skipped: 0, Time elapsed: 6.312 sec - in org.apache.hadoop.chukwa.datacollection.adaptor.TestExecAdaptor
Running org.apache.hadoop.chukwa.datacollection.adaptor.TestAddAdaptor
Tests run: 1, Failures: 0, Errors: 0, Skipped: 0, Time elapsed: 5.46 sec - in org.apache.hadoop.chukwa.datacollection.adaptor.TestAddAdaptor
Running org.apache.hadoop.chukwa.datacollection.adaptor.filetailer.TestRCheckAdaptor
Tests run: 2, Failures: 0, Errors: 0, Skipped: 0, Time elapsed: 50.125 sec - in org.apache.hadoop.chukwa.datacollection.adaptor.filetailer.TestRCheckAdaptor
Running org.apache.hadoop.chukwa.datacollection.adaptor.filetailer.TestCharFileTailingAdaptorUTF8
Tests run: 1, Failures: 0, Errors: 0, Skipped: 0, Time elapsed: 2.845 sec - in org.apache.hadoop.chukwa.datacollection.adaptor.filetailer.TestCharFileTailingAdaptorUTF8
Running org.apache.hadoop.chukwa.datacollection.adaptor.filetailer.TestFileTailingAdaptorBigRecord
Tests run: 1, Failures: 0, Errors: 0, Skipped: 0, Time elapsed: 9.166 sec - in org.apache.hadoop.chukwa.datacollection.adaptor.filetailer.TestFileTailingAdaptorBigRecord
Running org.apache.hadoop.chukwa.datacollection.adaptor.filetailer.TestFileTailer
Tests run: 1, Failures: 0, Errors: 0, Skipped: 0, Time elapsed: 1.117 sec - in org.apache.hadoop.chukwa.datacollection.adaptor.filetailer.TestFileTailer
Running org.apache.hadoop.chukwa.datacollection.adaptor.filetailer.TestStartAtOffset
Tests run: 1, Failures: 0, Errors: 0, Skipped: 0, Time elapsed: 0.856 sec - in org.apache.hadoop.chukwa.datacollection.adaptor.filetailer.TestStartAtOffset
Running org.apache.hadoop.chukwa.datacollection.adaptor.filetailer.TestFileExpirationPolicy
Tests run: 2, Failures: 0, Errors: 0, Skipped: 0, Time elapsed: 102.396 sec - in org.apache.hadoop.chukwa.datacollection.adaptor.filetailer.TestFileExpirationPolicy
Running org.apache.hadoop.chukwa.datacollection.adaptor.filetailer.TestLogRotate
Tests run: 1, Failures: 0, Errors: 0, Skipped: 0, Time elapsed: 9.943 sec - in org.apache.hadoop.chukwa.datacollection.adaptor.filetailer.TestLogRotate
Running org.apache.hadoop.chukwa.datacollection.adaptor.filetailer.TestFileTailingAdaptorPreserveLines
Tests run: 3, Failures: 0, Errors: 0, Skipped: 0, Time elapsed: 5.314 sec - in org.apache.hadoop.chukwa.datacollection.adaptor.filetailer.TestFileTailingAdaptorPreserveLines
Running org.apache.hadoop.chukwa.datacollection.adaptor.filetailer.TestRawAdaptor
Tests run: 3, Failures: 0, Errors: 0, Skipped: 0, Time elapsed: 4.236 sec - in org.apache.hadoop.chukwa.datacollection.adaptor.filetailer.TestRawAdaptor
Running org.apache.hadoop.chukwa.datacollection.adaptor.filetailer.TestFileTailingAdaptors
Tests run: 4, Failures: 0, Errors: 0, Skipped: 0, Time elapsed: 15.41 sec - in org.apache.hadoop.chukwa.datacollection.adaptor.filetailer.TestFileTailingAdaptors
Running org.apache.hadoop.chukwa.datacollection.adaptor.TestOozieAdaptor
Tests run: 1, Failures: 0, Errors: 0, Skipped: 0, Time elapsed: 1.801 sec - in org.apache.hadoop.chukwa.datacollection.adaptor.TestOozieAdaptor
Running org.apache.hadoop.chukwa.datacollection.adaptor.TestHeartbeatAdaptor
Tests run: 1, Failures: 0, Errors: 0, Skipped: 0, Time elapsed: 11.231 sec - in org.apache.hadoop.chukwa.datacollection.adaptor.TestHeartbeatAdaptor
Running org.apache.hadoop.chukwa.datacollection.adaptor.TestBufferingWrappers
Tests run: 2, Failures: 0, Errors: 0, Skipped: 0, Time elapsed: 8.6 sec - in org.apache.hadoop.chukwa.datacollection.adaptor.TestBufferingWrappers
Running org.apache.hadoop.chukwa.datacollection.adaptor.jms.TestJMSAdaptor
Tests run: 4, Failures: 0, Errors: 0, Skipped: 0, Time elapsed: 5.482 sec - in org.apache.hadoop.chukwa.datacollection.adaptor.jms.TestJMSAdaptor
Running org.apache.hadoop.chukwa.datacollection.adaptor.jms.TestJMSMessagePropertyTransformer
Tests run: 9, Failures: 0, Errors: 0, Skipped: 0, Time elapsed: 11.081 sec - in org.apache.hadoop.chukwa.datacollection.adaptor.jms.TestJMSMessagePropertyTransformer
Running org.apache.hadoop.chukwa.datacollection.adaptor.TestRestAdaptor
Tests run: 1, Failures: 0, Errors: 0, Skipped: 0, Time elapsed: 3.314 sec - in org.apache.hadoop.chukwa.datacollection.adaptor.TestRestAdaptor
Running org.apache.hadoop.chukwa.datacollection.adaptor.TestDirTailingAdaptor
Tests run: 2, Failures: 0, Errors: 0, Skipped: 0, Time elapsed: 24.139 sec - in org.apache.hadoop.chukwa.datacollection.adaptor.TestDirTailingAdaptor
Running org.apache.hadoop.chukwa.datacollection.adaptor.TestFileAdaptor
Tests run: 2, Failures: 0, Errors: 0, Skipped: 0, Time elapsed: 3.186 sec - in org.apache.hadoop.chukwa.datacollection.adaptor.TestFileAdaptor
Running org.apache.hadoop.chukwa.datacollection.adaptor.TestUDPAdaptor
Tests run: 1, Failures: 0, Errors: 0, Skipped: 0, Time elapsed: 0.187 sec - in org.apache.hadoop.chukwa.datacollection.adaptor.TestUDPAdaptor
Running org.apache.hadoop.chukwa.datacollection.adaptor.TestSyslogAdaptor
Tests run: 1, Failures: 0, Errors: 0, Skipped: 0, Time elapsed: 0.794 sec - in org.apache.hadoop.chukwa.datacollection.adaptor.TestSyslogAdaptor
Running org.apache.hadoop.chukwa.datacollection.agent.TestCmd
Tests run: 4, Failures: 0, Errors: 0, Skipped: 0, Time elapsed: 7.535 sec - in org.apache.hadoop.chukwa.datacollection.agent.TestCmd
Running org.apache.hadoop.chukwa.datacollection.agent.TestChunkQueue
Tests run: 2, Failures: 0, Errors: 0, Skipped: 0, Time elapsed: 10.15 sec - in org.apache.hadoop.chukwa.datacollection.agent.TestChunkQueue
Running org.apache.hadoop.chukwa.datacollection.agent.TestChukwaSsl
Tests run: 1, Failures: 0, Errors: 0, Skipped: 0, Time elapsed: 5.164 sec - in org.apache.hadoop.chukwa.datacollection.agent.TestChukwaSsl
Running org.apache.hadoop.chukwa.datacollection.agent.TestAgent
Tests run: 3, Failures: 0, Errors: 0, Skipped: 0, Time elapsed: 163.591 sec - in org.apache.hadoop.chukwa.datacollection.agent.TestAgent
Running org.apache.hadoop.chukwa.datacollection.agent.rest.TestAdaptorController
Tests run: 5, Failures: 0, Errors: 0, Skipped: 0, Time elapsed: 5.811 sec - in org.apache.hadoop.chukwa.datacollection.agent.rest.TestAdaptorController
Running org.apache.hadoop.chukwa.datacollection.agent.TestAgentConfig
Tests run: 2, Failures: 0, Errors: 0, Skipped: 0, Time elapsed: 13.796 sec - in org.apache.hadoop.chukwa.datacollection.agent.TestAgentConfig
Running org.apache.hadoop.chukwa.datacollection.TestOffsetStatsManager
Tests run: 3, Failures: 0, Errors: 0, Skipped: 0, Time elapsed: 13.219 sec - in org.apache.hadoop.chukwa.datacollection.TestOffsetStatsManager
Running org.apache.hadoop.chukwa.datacollection.writer.TestChukwaParquetWriter
Tests run: 2, Failures: 0, Errors: 0, Skipped: 0, Time elapsed: 9.658 sec - in org.apache.hadoop.chukwa.datacollection.writer.TestChukwaParquetWriter
Running org.apache.hadoop.chukwa.datacollection.writer.TestClientAck
Tests run: 1, Failures: 0, Errors: 0, Skipped: 0, Time elapsed: 18.167 sec - in org.apache.hadoop.chukwa.datacollection.writer.TestClientAck
Running org.apache.hadoop.chukwa.datacollection.writer.solr.TestSolrWriter
Tests run: 1, Failures: 0, Errors: 0, Skipped: 0, Time elapsed: 3.311 sec - in org.apache.hadoop.chukwa.datacollection.writer.solr.TestSolrWriter
Running org.apache.hadoop.chukwa.datacollection.writer.TestChukwaWriters
Tests run: 2, Failures: 0, Errors: 0, Skipped: 0, Time elapsed: 13.55 sec - in org.apache.hadoop.chukwa.datacollection.writer.TestChukwaWriters
Running org.apache.hadoop.chukwa.datacollection.writer.TestSocketTee
Tests run: 1, Failures: 0, Errors: 0, Skipped: 0, Time elapsed: 0.753 sec - in org.apache.hadoop.chukwa.datacollection.writer.TestSocketTee
Running org.apache.hadoop.chukwa.datacollection.writer.TestHBaseWriter
Tests run: 1, Failures: 0, Errors: 0, Skipped: 0, Time elapsed: 18.243 sec - in org.apache.hadoop.chukwa.datacollection.writer.TestHBaseWriter
Running org.apache.hadoop.chukwa.datacollection.sender.TestAcksOnFailure
Tests run: 1, Failures: 0, Errors: 0, Skipped: 0, Time elapsed: 3.945 sec - in org.apache.hadoop.chukwa.datacollection.sender.TestAcksOnFailure
Running org.apache.hadoop.chukwa.datacollection.sender.TestRetryListOfCollectors
Tests run: 2, Failures: 0, Errors: 0, Skipped: 0, Time elapsed: 0.75 sec - in org.apache.hadoop.chukwa.datacollection.sender.TestRetryListOfCollectors
Running org.apache.hadoop.chukwa.datacollection.controller.TestAgentClient
Tests run: 1, Failures: 0, Errors: 0, Skipped: 0, Time elapsed: 0.987 sec - in org.apache.hadoop.chukwa.datacollection.controller.TestAgentClient
Running org.apache.hadoop.chukwa.TestChunkBuilder
Tests run: 1, Failures: 0, Errors: 0, Skipped: 0, Time elapsed: 0.172 sec - in org.apache.hadoop.chukwa.TestChunkBuilder
Running org.apache.hadoop.chukwa.dataloader.TestSocketDataLoader
Tests run: 1, Failures: 0, Errors: 0, Skipped: 0, Time elapsed: 120.956 sec - in org.apache.hadoop.chukwa.dataloader.TestSocketDataLoader
Running org.apache.hadoop.chukwa.inputtools.log4j.TestChukwaDailyRollingFileAppender
Tests run: 1, Failures: 0, Errors: 0, Skipped: 0, Time elapsed: 2.225 sec - in org.apache.hadoop.chukwa.inputtools.log4j.TestChukwaDailyRollingFileAppender
Running org.apache.hadoop.chukwa.inputtools.log4j.TestTaskLogAppender
Tests run: 1, Failures: 0, Errors: 0, Skipped: 0, Time elapsed: 2.332 sec - in org.apache.hadoop.chukwa.inputtools.log4j.TestTaskLogAppender
Running org.apache.hadoop.chukwa.inputtools.TestInputFormat
Tests run: 1, Failures: 0, Errors: 0, Skipped: 0, Time elapsed: 1.781 sec - in org.apache.hadoop.chukwa.inputtools.TestInputFormat
Running org.apache.hadoop.chukwa.hicc.TestChart
Tests run: 3, Failures: 0, Errors: 0, Skipped: 0, Time elapsed: 0.013 sec - in org.apache.hadoop.chukwa.hicc.TestChart
Running org.apache.hadoop.chukwa.util.TestXSSFilter
Tests run: 1, Failures: 0, Errors: 0, Skipped: 0, Time elapsed: 0.448 sec - in org.apache.hadoop.chukwa.util.TestXSSFilter
Running org.apache.hadoop.chukwa.util.TestRecordConsts
Tests run: 2, Failures: 0, Errors: 0, Skipped: 0, Time elapsed: 0.014 sec - in org.apache.hadoop.chukwa.util.TestRecordConsts
Running org.apache.hadoop.chukwa.util.TestCopySequenceFile
Tests run: 1, Failures: 0, Errors: 0, Skipped: 0, Time elapsed: 1.64 sec - in org.apache.hadoop.chukwa.util.TestCopySequenceFile
Running org.apache.hadoop.chukwa.util.TestCRValidator
Tests run: 3, Failures: 0, Errors: 0, Skipped: 0, Time elapsed: 1.646 sec - in org.apache.hadoop.chukwa.util.TestCRValidator
Running org.apache.hadoop.chukwa.util.TestFilter
Tests run: 3, Failures: 0, Errors: 0, Skipped: 0, Time elapsed: 0.185 sec - in org.apache.hadoop.chukwa.util.TestFilter
Running org.apache.hadoop.chukwa.util.TestDumpChunks
Tests run: 2, Failures: 0, Errors: 0, Skipped: 0, Time elapsed: 1.615 sec - in org.apache.hadoop.chukwa.util.TestDumpChunks
Running org.apache.hadoop.chukwa.util.TestCreateRecordFile
Tests run: 1, Failures: 0, Errors: 0, Skipped: 0, Time elapsed: 1.792 sec - in org.apache.hadoop.chukwa.util.TestCreateRecordFile
Running org.apache.hadoop.chukwa.tools.backfilling.TestBackfillingLoader
Tests run: 4, Failures: 1, Errors: 0, Skipped: 0, Time elapsed: 73.949 sec <<< FAILURE!
- in org.apache.hadoop.chukwa.tools.backfilling.TestBackfillingLoader
testBackfillingLoaderWithCharFileTailingAdaptorUTF8NewLineEscapedBigFileLocalWriter(org.apache.hadoop.chukwa.tools.backfilling.TestBackfillingLoader)
 Time elapsed: 5.727 sec  <<< FAILURE!
junit.framework.AssertionFailedError: null
	at junit.framework.Assert.fail(Assert.java:48)
	at junit.framework.Assert.fail(Assert.java:56)
	at org.apache.hadoop.chukwa.tools.backfilling.TestBackfillingLoader.testBackfillingLoaderWithCharFileTailingAdaptorUTF8NewLineEscapedBigFileLocalWriter(TestBackfillingLoader.java:279)


Results :

Failed tests: 
  TestBackfillingLoader.testBackfillingLoaderWithCharFileTailingAdaptorUTF8NewLineEscapedBigFileLocalWriter:279
null

Tests run: 139, Failures: 1, Errors: 0, Skipped: 0

[INFO] ------------------------------------------------------------------------
[INFO] BUILD FAILURE
[INFO] ------------------------------------------------------------------------
[INFO] Total time: 20:06 min
[INFO] Finished at: 2017-05-27T15:58:33+00:00
[INFO] Final Memory: 70M/1405M
[INFO] ------------------------------------------------------------------------
[ERROR] Failed to execute goal org.apache.maven.plugins:maven-surefire-plugin:2.18.1:test
(default-test) on project chukwa: There are test failures.
[ERROR] 
[ERROR] Please refer to <https://builds.apache.org/job/Chukwa-master/ws/target/test-reports>
for the individual test results.
[ERROR] -> [Help 1]
[ERROR] 
[ERROR] To see the full stack trace of the errors, re-run Maven with the -e switch.
[ERROR] Re-run Maven using the -X switch to enable full debug logging.
[ERROR] 
[ERROR] For more information about the errors and possible solutions, please read the following
articles:
[ERROR] [Help 1] http://cwiki.apache.org/confluence/display/MAVEN/MojoFailureException
Build step 'Invoke top-level Maven targets' marked build as failure
Archiving artifacts
Recording test results
Not sending mail to unregistered user fay.y.wang@gmail.com

Mime
View raw message