chukwa-dev mailing list archives

Site index · List index
Message view « Date » · « Thread »
Top « Date » · « Thread »
From Apache Jenkins Server <jenk...@builds.apache.org>
Subject Build failed in Jenkins: Chukwa-master #581
Date Fri, 26 May 2017 19:14:16 GMT
See <https://builds.apache.org/job/Chukwa-master/581/display/redirect?page=changes>

Changes:

[faywang] Chukwa JIRA-819

[fay.y.wang] Create Junit test case for caffe

[fay.y.wang] Fix test case

[fay.y.wang] Fix test case

[fay.y.wang] Add Apache license header

[fay.y.wang] add Apache license header to the Junit test case

------------------------------------------
[...truncated 1.08 MB...]
Running org.apache.hadoop.chukwa.inputtools.TestInputFormat
Tests run: 1, Failures: 0, Errors: 0, Skipped: 0, Time elapsed: 1.718 sec - in org.apache.hadoop.chukwa.inputtools.TestInputFormat
Running org.apache.hadoop.chukwa.hicc.TestChart
Tests run: 3, Failures: 0, Errors: 0, Skipped: 0, Time elapsed: 0.01 sec - in org.apache.hadoop.chukwa.hicc.TestChart
Running org.apache.hadoop.chukwa.util.TestXSSFilter
Tests run: 1, Failures: 0, Errors: 0, Skipped: 0, Time elapsed: 0.464 sec - in org.apache.hadoop.chukwa.util.TestXSSFilter
Running org.apache.hadoop.chukwa.util.TestRecordConsts
Tests run: 2, Failures: 0, Errors: 0, Skipped: 0, Time elapsed: 0.015 sec - in org.apache.hadoop.chukwa.util.TestRecordConsts
Running org.apache.hadoop.chukwa.util.TestCopySequenceFile
Tests run: 1, Failures: 0, Errors: 0, Skipped: 0, Time elapsed: 1.578 sec - in org.apache.hadoop.chukwa.util.TestCopySequenceFile
Running org.apache.hadoop.chukwa.util.TestCRValidator
Tests run: 3, Failures: 0, Errors: 0, Skipped: 0, Time elapsed: 1.599 sec - in org.apache.hadoop.chukwa.util.TestCRValidator
Running org.apache.hadoop.chukwa.util.TestFilter
Tests run: 3, Failures: 0, Errors: 0, Skipped: 0, Time elapsed: 0.18 sec - in org.apache.hadoop.chukwa.util.TestFilter
Running org.apache.hadoop.chukwa.util.TestDumpChunks
Tests run: 2, Failures: 0, Errors: 0, Skipped: 0, Time elapsed: 1.622 sec - in org.apache.hadoop.chukwa.util.TestDumpChunks
Running org.apache.hadoop.chukwa.util.TestCreateRecordFile
Tests run: 1, Failures: 0, Errors: 0, Skipped: 0, Time elapsed: 1.745 sec - in org.apache.hadoop.chukwa.util.TestCreateRecordFile
Running org.apache.hadoop.chukwa.tools.backfilling.TestBackfillingLoader
Tests run: 4, Failures: 0, Errors: 0, Skipped: 0, Time elapsed: 76.704 sec - in org.apache.hadoop.chukwa.tools.backfilling.TestBackfillingLoader

Results :

Tests run: 139, Failures: 0, Errors: 0, Skipped: 0

[INFO] 
[INFO] --- maven-jar-plugin:2.3.1:jar (core) @ chukwa ---
[INFO] Building jar: <https://builds.apache.org/job/Chukwa-master/ws/target/chukwa-0.8.0.jar>
[INFO] 
[INFO] --- maven-source-plugin:2.1.1:jar-no-fork (default) @ chukwa ---
Downloading: http://repo.maven.apache.org/maven2/org/apache/maven/maven-archiver/2.4/maven-archiver-2.4.pom
4/4 KB            Downloaded: http://repo.maven.apache.org/maven2/org/apache/maven/maven-archiver/2.4/maven-archiver-2.4.pom
(4 KB at 93.1 KB/sec)
Downloading: http://repo.maven.apache.org/maven2/org/codehaus/plexus/plexus-archiver/1.0-alpha-11/plexus-archiver-1.0-alpha-11.pom
2/2 KB            Downloaded: http://repo.maven.apache.org/maven2/org/codehaus/plexus/plexus-archiver/1.0-alpha-11/plexus-archiver-1.0-alpha-11.pom
(2 KB at 220.1 KB/sec)
Downloading: http://repo.maven.apache.org/maven2/org/codehaus/plexus/plexus-io/1.0-alpha-3/plexus-io-1.0-alpha-3.pom
2/2 KB            Downloaded: http://repo.maven.apache.org/maven2/org/codehaus/plexus/plexus-io/1.0-alpha-3/plexus-io-1.0-alpha-3.pom
(2 KB at 171.9 KB/sec)
Downloading: http://repo.maven.apache.org/maven2/org/apache/maven/maven-archiver/2.4/maven-archiver-2.4.jar
Downloading: http://repo.maven.apache.org/maven2/org/codehaus/plexus/plexus-interpolation/1.6/plexus-interpolation-1.6.jar
1/50 KB   5/50 KB   8/50 KB   10/50 KB   13/50 KB   17/50 KB   4/20 KB   21/50 KB   4/20 KB
  25/50 KB   4/20 KB   29/50 KB   4/20 KB   31/50 KB   4/20 KB   13/50 KB   4/20 KB   31/50
KB   8/20 KB   31/50 KB   12/20 KB   31/50 KB   16/20 KB   31/50 KB   20/20 KB   35/50 KB
  20/20 KB   39/50 KB   20/20 KB   41/50 KB   20/20 KB   42/50 KB   20/20 KB   46/50 KB  
20/20 KB   48/50 KB   20/20 KB   50/50 KB   20/20 KB                         Downloaded: http://repo.maven.apache.org/maven2/org/apache/maven/maven-archiver/2.4/maven-archiver-2.4.jar
(20 KB at 1368.6 KB/sec)
                      Downloaded: http://repo.maven.apache.org/maven2/org/codehaus/plexus/plexus-interpolation/1.6/plexus-interpolation-1.6.jar
(50 KB at 3113.3 KB/sec)
[INFO] Building jar: <https://builds.apache.org/job/Chukwa-master/ws/target/chukwa-0.8.0-sources.jar>
[INFO] 
[INFO] --- maven-jar-plugin:2.3.1:jar (default-jar) @ chukwa ---
[INFO] 
[INFO] --- maven-jar-plugin:2.3.1:test-jar (test) @ chukwa ---
[INFO] Building jar: <https://builds.apache.org/job/Chukwa-master/ws/target/chukwa-0.8.0-tests.jar>
[INFO] 
[INFO] --- maven-jar-plugin:2.3.1:jar (client) @ chukwa ---
[INFO] Building jar: <https://builds.apache.org/job/Chukwa-master/ws/target/chukwa-0.8.0-client.jar>
[INFO] 
[INFO] --- maven-war-plugin:2.1.1:war (build-hicc) @ chukwa ---
Downloading: http://repo.maven.apache.org/maven2/org/codehaus/plexus/plexus-archiver/1.2/plexus-archiver-1.2.pom
2/2 KB                         Downloaded: http://repo.maven.apache.org/maven2/org/codehaus/plexus/plexus-archiver/1.2/plexus-archiver-1.2.pom
(2 KB at 285.0 KB/sec)
Downloading: http://repo.maven.apache.org/maven2/org/codehaus/plexus/plexus-archiver/1.2/plexus-archiver-1.2.jar
3/178 KB   6/178 KB   8/178 KB   10/178 KB   11/178 KB   14/178 KB   17/178 KB   18/178 KB
  20/178 KB   21/178 KB   23/178 KB   25/178 KB   28/178 KB   32/178 KB   32/178 KB   34/178
KB   37/178 KB   38/178 KB   41/178 KB   42/178 KB   45/178 KB   49/178 KB   51/178 KB   55/178
KB   55/178 KB   56/178 KB   60/178 KB   61/178 KB   64/178 KB   68/178 KB   68/178 KB   72/178
KB   75/178 KB   79/178 KB   79/178 KB   83/178 KB   85/178 KB   88/178 KB   90/178 KB   94/178
KB   96/178 KB   99/178 KB   100/178 KB   104/178 KB   105/178 KB   109/178 KB   110/178 KB
  113/178 KB   116/178 KB   120/178 KB   123/178 KB   124/178 KB   128/178 KB   132/178 KB
  133/178 KB   136/178 KB   140/178 KB   143/178 KB   146/178 KB   150/178 KB   151/178 KB
  154/178 KB   158/178 KB   161/178 KB   163/178 KB   167/178 KB   171/178 KB   171/178 KB
  175/178 KB   177/178 KB   178/178 KB                Downloaded: http://repo.maven.apache.org/maven2/org/codehaus/plexus/plexus-archiver/1.2/plexus-archiver-1.2.jar
(178 KB at 5728.4 KB/sec)
[INFO] Packaging webapp
[INFO] Assembling webapp [chukwa] in [<https://builds.apache.org/job/Chukwa-master/ws/target/hicc]>
[INFO] Processing war project
[INFO] Copying webapp resources [<https://builds.apache.org/job/Chukwa-master/ws/src/main/web/hicc]>
[INFO] Webapp assembled in [1133 msecs]
[INFO] Building war: <https://builds.apache.org/job/Chukwa-master/ws/target/hicc.war>
[INFO] WEB-INF/web.xml already added, skipping
[INFO] 
[INFO] --- maven-assembly-plugin:2.2-beta-5:single (build-tarball) @ chukwa ---
Downloading: http://repo.maven.apache.org/maven2/org/apache/maven/shared/maven-common-artifact-filters/1.1/maven-common-artifact-filters-1.1.pom
1/3 KB       3/3 KB            Downloaded: http://repo.maven.apache.org/maven2/org/apache/maven/shared/maven-common-artifact-filters/1.1/maven-common-artifact-filters-1.1.pom
(3 KB at 300.3 KB/sec)
Downloading: http://repo.maven.apache.org/maven2/org/codehaus/plexus/plexus-interpolation/1.7/plexus-interpolation-1.7.pom
1/3 KB   3/3 KB            Downloaded: http://repo.maven.apache.org/maven2/org/codehaus/plexus/plexus-interpolation/1.7/plexus-interpolation-1.7.pom
(3 KB at 315.4 KB/sec)
Downloading: http://repo.maven.apache.org/maven2/org/codehaus/plexus/plexus-active-collections/1.0-beta-2/plexus-active-collections-1.0-beta-2.pom
3/3 KB   3/3 KB            Downloaded: http://repo.maven.apache.org/maven2/org/codehaus/plexus/plexus-active-collections/1.0-beta-2/plexus-active-collections-1.0-beta-2.pom
(3 KB at 339.8 KB/sec)
Downloading: http://repo.maven.apache.org/maven2/org/codehaus/plexus/plexus-container-default/1.0-alpha-22/plexus-container-default-1.0-alpha-22.pom
3/3 KB   3/3 KB            Downloaded: http://repo.maven.apache.org/maven2/org/codehaus/plexus/plexus-container-default/1.0-alpha-22/plexus-container-default-1.0-alpha-22.pom
(3 KB at 365.1 KB/sec)
Downloading: http://repo.maven.apache.org/maven2/org/codehaus/plexus/plexus-containers/1.0-alpha-22/plexus-containers-1.0-alpha-22.pom
2/2 KB            Downloaded: http://repo.maven.apache.org/maven2/org/codehaus/plexus/plexus-containers/1.0-alpha-22/plexus-containers-1.0-alpha-22.pom
(2 KB at 204.6 KB/sec)
Downloading: http://repo.maven.apache.org/maven2/org/apache/maven/shared/maven-common-artifact-filters/1.1/maven-common-artifact-filters-1.1.jar
Downloading: http://repo.maven.apache.org/maven2/org/codehaus/plexus/plexus-active-collections/1.0-beta-2/plexus-active-collections-1.0-beta-2.jar
Downloading: http://repo.maven.apache.org/maven2/org/codehaus/plexus/plexus-interpolation/1.7/plexus-interpolation-1.7.jar
Downloading: http://repo.maven.apache.org/maven2/org/codehaus/plexus/plexus-io/1.0-alpha-4/plexus-io-1.0-alpha-4.jar
1/50 KB   3/50 KB   6/50 KB   6/50 KB   4/21 KB   6/50 KB   8/21 KB   6/50 KB   12/21 KB 
 6/50 KB   16/21 KB   6/50 KB   20/21 KB   6/50 KB   21/21 KB   8/50 KB   21/21 KB   4/30
KB   8/50 KB   21/21 KB   4/30 KB   11/50 KB   21/21 KB   8/30 KB   11/50 KB   21/21 KB  
8/30 KB   14/50 KB   21/21 KB   12/30 KB   14/50 KB   21/21 KB   16/30 KB   14/50 KB   21/21
KB   16/30 KB   17/50 KB   21/21 KB   17/30 KB   17/50 KB   21/21 KB   18/30 KB   17/50 KB
  21/21 KB   21/30 KB   17/50 KB   21/21 KB   21/30 KB   20/50 KB   21/21 KB   25/30 KB  
20/50 KB   21/21 KB   27/30 KB   20/50 KB   21/21 KB   27/30 KB   23/50 KB   21/21 KB   30/30
KB   23/50 KB   21/21 KB   30/30 KB   27/50 KB   21/21 KB   30/30 KB   31/50 KB   21/21 KB
  30/30 KB   31/50 KB   21/21 KB                                    Downloaded: http://repo.maven.apache.org/maven2/org/codehaus/plexus/plexus-active-collections/1.0-beta-2/plexus-active-collections-1.0-beta-2.jar
(21 KB at 2055.2 KB/sec)
30/30 KB   35/50 KB              30/30 KB   35/50 KB   30/30 KB   39/50 KB   30/30 KB   41/50
KB   30/30 KB   41/50 KB   4/48 KB   30/30 KB   42/50 KB   4/48 KB   30/30 KB   42/50 KB 
 8/48 KB   30/30 KB   46/50 KB   8/48 KB   30/30 KB   47/50 KB   8/48 KB   30/30 KB   47/50
KB   12/48 KB   30/30 KB   47/50 KB   16/48 KB   30/30 KB   47/50 KB   20/48 KB   30/30 KB
  47/50 KB   24/48 KB   30/30 KB   50/50 KB   24/48 KB   30/30 KB   50/50 KB   28/48 KB  
30/30 KB   50/50 KB   32/48 KB   30/30 KB   50/50 KB   36/48 KB   30/30 KB   50/50 KB   40/48
KB   30/30 KB   50/50 KB   44/48 KB   30/30 KB   50/50 KB   48/48 KB                     
              Downloaded: http://repo.maven.apache.org/maven2/org/apache/maven/shared/maven-common-artifact-filters/1.1/maven-common-artifact-filters-1.1.jar
(30 KB at 1954.9 KB/sec)
                                 Downloaded: http://repo.maven.apache.org/maven2/org/codehaus/plexus/plexus-interpolation/1.7/plexus-interpolation-1.7.jar
(50 KB at 2770.9 KB/sec)
                                 Downloaded: http://repo.maven.apache.org/maven2/org/codehaus/plexus/plexus-io/1.0-alpha-4/plexus-io-1.0-alpha-4.jar
(48 KB at 2952.5 KB/sec)
[INFO] Reading assembly descriptor: src/packages/tarball/all.xml
Downloading: http://clojars.org/repo/org/apache/hadoop/hadoop-annotations/2.7.2/hadoop-annotations-2.7.2.jar
                                 Downloading: http://repo.maven.apache.org/maven2/org/apache/hadoop/hadoop-annotations/2.7.2/hadoop-annotations-2.7.2.jar
4/17 KB                          8/17 KB   8/17 KB   12/17 KB   13/17 KB   17/17 KB   17/17
KB   17/17 KB              Downloaded: http://repo.maven.apache.org/maven2/org/apache/hadoop/hadoop-annotations/2.7.2/hadoop-annotations-2.7.2.jar
(17 KB at 1543.4 KB/sec)
Downloading: http://clojars.org/repo/org/codehaus/jackson/jackson-jaxrs/1.9.13/jackson-jaxrs-1.9.13.pom
           Downloading: http://repo.maven.apache.org/maven2/org/codehaus/jackson/jackson-jaxrs/1.9.13/jackson-jaxrs-1.9.13.pom
           Downloaded: http://repo.maven.apache.org/maven2/org/codehaus/jackson/jackson-jaxrs/1.9.13/jackson-jaxrs-1.9.13.pom
(0 B at 0.0 KB/sec)
Downloading: http://repository.opencastproject.org/nexus/content/repositories/public/org/codehaus/jackson/jackson-jaxrs/1.9.13/jackson-jaxrs-1.9.13.pom
           Downloading: http://repository.pentaho.org/artifactory/repo/org/codehaus/jackson/jackson-jaxrs/1.9.13/jackson-jaxrs-1.9.13.pom
           Downloaded: http://repository.pentaho.org/artifactory/repo/org/codehaus/jackson/jackson-jaxrs/1.9.13/jackson-jaxrs-1.9.13.pom
(0 B at 0.0 KB/sec)
Downloading: http://clojars.org/repo/org/codehaus/jackson/jackson-xc/1.9.13/jackson-xc-1.9.13.pom
           Downloading: http://repo.maven.apache.org/maven2/org/codehaus/jackson/jackson-xc/1.9.13/jackson-xc-1.9.13.pom
           Downloaded: http://repo.maven.apache.org/maven2/org/codehaus/jackson/jackson-xc/1.9.13/jackson-xc-1.9.13.pom
(0 B at 0.0 KB/sec)
Downloading: http://repository.opencastproject.org/nexus/content/repositories/public/org/codehaus/jackson/jackson-xc/1.9.13/jackson-xc-1.9.13.pom
           Downloading: http://repository.pentaho.org/artifactory/repo/org/codehaus/jackson/jackson-xc/1.9.13/jackson-xc-1.9.13.pom
           Downloaded: http://repository.pentaho.org/artifactory/repo/org/codehaus/jackson/jackson-xc/1.9.13/jackson-xc-1.9.13.pom
(0 B at 0.0 KB/sec)
[INFO] Building tar : <https://builds.apache.org/job/Chukwa-master/581/artifact/target/chukwa-0.8.0.tar.gz>
[INFO] 
[INFO] --- exec-maven-plugin:1.1:exec (exec-xsltproc: target/application.html) @ chukwa ---
[INFO] compilation error: file src/main/webapps/wadl.xsl line 25 element stylesheet
[INFO] xsl:version: only 1.0 features are supported
[INFO] 
[INFO] --- exec-maven-plugin:1.1:exec (exec-xsltproc: target/hicc-application.html) @ chukwa
---
[INFO] compilation error: file src/main/webapps/wadl.xsl line 25 element stylesheet
[INFO] xsl:version: only 1.0 features are supported
[INFO] 
[INFO] --- maven-surefire-plugin:2.18.1:test (default) @ chukwa ---
[WARNING] The parameter forkMode is deprecated since version 2.14. Use forkCount and reuseForks
instead.
[INFO] 
[INFO] --- apache-rat-plugin:0.11:check (default) @ chukwa ---
[INFO] 51 implicit excludes (use -debug for more details).
[INFO] Exclude: CHANGES.txt
[INFO] Exclude: README.md
[INFO] Exclude: bin/VERSION
[INFO] Exclude: **/target/**
[INFO] Exclude: **/.classpath
[INFO] Exclude: **/.project
[INFO] Exclude: **/.settings/**
[INFO] Exclude: conf/agents
[INFO] Exclude: conf/alert
[INFO] Exclude: conf/auth.conf
[INFO] Exclude: conf/collectors
[INFO] Exclude: conf/hbase.schema
[INFO] Exclude: conf/initial_adaptors
[INFO] Exclude: conf/jmxremote.access
[INFO] Exclude: conf/jmxremote.password
[INFO] Exclude: contrib/solr/logs/conf/_schema_analysis_stopwords_english.json
[INFO] Exclude: contrib/solr/logs/conf/_schema_analysis_synonyms_english.json
[INFO] Exclude: src/main/web/hicc/descriptors/**
[INFO] Exclude: src/main/web/hicc/views/**
[INFO] Exclude: src/test/resources/Hadoop18JobHistoryLog.txt
[INFO] Exclude: src/test/resources/TestJobLog.txt
[INFO] Exclude: test/samples/ClientTrace.log
[INFO] Exclude: test/samples/Iostat.log
[INFO] Exclude: test/samples/JobHistory.log
[INFO] Exclude: contrib/solr/logs/conf/lang/stopwords_da.txt
[INFO] Exclude: contrib/solr/logs/conf/lang/stopwords_de.txt
[INFO] Exclude: contrib/solr/logs/conf/lang/stopwords_es.txt
[INFO] Exclude: contrib/solr/logs/conf/lang/stopwords_fa.txt
[INFO] Exclude: contrib/solr/logs/conf/lang/stopwords_fi.txt
[INFO] Exclude: contrib/solr/logs/conf/lang/stopwords_fr.txt
[INFO] Exclude: contrib/solr/logs/conf/lang/stopwords_hi.txt
[INFO] Exclude: contrib/solr/logs/conf/lang/stopwords_hu.txt
[INFO] Exclude: contrib/solr/logs/conf/lang/stopwords_it.txt
[INFO] Exclude: contrib/solr/logs/conf/lang/stopwords_nl.txt
[INFO] Exclude: contrib/solr/logs/conf/lang/stopwords_no.txt
[INFO] Exclude: contrib/solr/logs/conf/lang/stopwords_pt.txt
[INFO] Exclude: contrib/solr/logs/conf/lang/stopwords_ru.txt
[INFO] Exclude: contrib/solr/logs/conf/lang/stopwords_sv.txt
[INFO] Exclude: src/main/web/hicc/js/jquery*
[INFO] Exclude: src/main/web/hicc/home/js/jquery.js
[INFO] Exclude: src/main/web/hicc/css/jquery.circliful.css
[INFO] Exclude: src/main/web/hicc/css/iui.css
[INFO] Exclude: src/main/web/hicc/js/behaviour.js
[INFO] Exclude: src/main/web/hicc/js/heatmap.js
[INFO] Exclude: src/main/web/hicc/js/iui.js
[INFO] Exclude: src/main/web/hicc/js/yahoo-dom-event.js
[INFO] Exclude: src/main/web/hicc/js/treeview-min.js
[INFO] Exclude: src/main/resources/ESAPI.properties
[INFO] Exclude: contrib/solr/logs/conf/velocity/jquery.autocomplete.js
[INFO] Exclude: src/main/web/hicc/css/flexigrid/flexigrid.css
[INFO] Exclude: src/main/web/hicc/css/timeline.css
[INFO] Exclude: src/main/web/hicc/lib/timeline/**
[INFO] Exclude: lib/agent.dict
[INFO] Exclude: lib/collector.dict
[INFO] Exclude: lib/confspellcheck-README
[INFO] Exclude: lib/json-README.txt
[INFO] Exclude: src/main/web/hicc/js/ajaxtree.js
[INFO] Exclude: src/main/web/hicc/js/flexigrid.js
[INFO] Exclude: src/main/web/hicc/js/flexigrid.pack.js
[INFO] Exclude: src/main/web/hicc/js/workspace/builder.js
[INFO] Exclude: src/main/web/hicc/js/workspace/controls.js
[INFO] Exclude: src/main/web/hicc/js/workspace/dragdrop.js
[INFO] Exclude: src/main/web/hicc/js/workspace/effects.js
[INFO] Exclude: src/main/web/hicc/js/workspace/scriptaculous.js
[INFO] Exclude: src/main/web/hicc/js/workspace/slider.js
[INFO] Exclude: src/main/web/hicc/js/workspace/sound.js
[INFO] Exclude: src/main/web/hicc/js/org/tool-man/*
[INFO] Exclude: src/main/web/hicc/js/timeframe.js
[INFO] Exclude: src/main/web/hicc/js/workspace/prototype.js
[INFO] Exclude: src/main/web/hicc/js/jquery.flot.pack.js
[INFO] Exclude: src/main/web/hicc/js/gsv.js
[INFO] Exclude: src/main/web/hicc/js/bootstrap.min.js
[INFO] Exclude: src/main/web/hicc/js/js-cookie.js
[INFO] Exclude: src/main/web/hicc/css/bootstrap-theme.css.map
[INFO] Exclude: src/main/web/hicc/css/bootstrap-theme.min.css
[INFO] Exclude: src/main/web/hicc/css/bootstrap.min.css
[INFO] Exclude: src/main/web/hicc/fonts/glyphicons-halflings-regular.svg
[INFO] Exclude: src/main/web/hicc/home/js/jquery.gridster.min.js
[INFO] Exclude: src/main/web/hicc/home/js/jquery.gridster.with-extras.min.js
[INFO] Exclude: src/main/web/hicc/home/css/jquery.gridster.css
[INFO] Exclude: src/main/web/hicc/home/css/jquery.gridster.min.css
[INFO] Exclude: src/main/web/hicc/home/js/typeahead.bundle.js
[INFO] Exclude: src/main/web/hicc/home/js/classie.js
[INFO] Exclude: src/main/web/hicc/home/js/gnmenu.js
[INFO] Exclude: src/main/web/hicc/home/js/modernizr.custom.js
[INFO] Exclude: src/main/web/hicc/ajax-solr/chukwa/css/jquery-ui.min.css
[INFO] Exclude: src/main/web/hicc/ajax-solr/chukwa/css/jquery-ui.structure.min.css
[INFO] Exclude: src/main/web/hicc/ajax-solr/chukwa/css/jquery-ui.theme.min.css
[INFO] Exclude: src/main/web/hicc/ajax-solr/chukwa/js/jquery-ui.min.js
[INFO] Exclude: src/main/web/hicc/ajax-solr/chukwa/js/require.min.js
[INFO] Exclude: src/main/web/hicc/home/css/select2.min.css
[INFO] Exclude: src/main/web/hicc/home/js/select2.min.js
[INFO] Exclude: src/main/web/hicc/css/font-awesome.min.css
[INFO] Exclude: src/main/web/hicc/fonts/glyphicons-halflings-regular.*
[INFO] Exclude: src/main/web/hicc/home/css/gridstack.min.css
[INFO] Exclude: src/main/web/hicc/home/js/gridstack.min.*
[INFO] Exclude: src/main/web/hicc/home/js/jquery-ui.js
[INFO] Exclude: src/main/web/hicc/js/autoHeight.js
[INFO] Exclude: src/main/web/hicc/js/base64.js
[INFO] Exclude: src/main/web/hicc/js/canvas2image.js
[INFO] Exclude: src/main/web/hicc/js/json.js
[INFO] Exclude: src/main/web/hicc/home/fonts/codropsicons/*
[INFO] Exclude: src/main/web/hicc/home/fonts/ecoicons/*
[INFO] Exclude: src/main/web/hicc/home/js/lodash.min.js
[INFO] Exclude: src/main/web/hicc/css/chartist.css
[INFO] Exclude: src/main/web/hicc/css/chartist.css.map
[INFO] Exclude: src/main/web/hicc/js/chartist.min.js
[INFO] Exclude: src/main/web/hicc/js/chartist.min.js.map
[INFO] Exclude: src/main/resources/chukwachunk.json
[INFO] 813 resources included (use -debug for more details)
Warning: org.apache.xerces.jaxp.SAXParserImpl$JAXPSAXParser: Property 'http://www.oracle.com/xml/jaxp/properties/entityExpansionLimit'
is not recognized.
Compiler warnings:
  WARNING:  'org.apache.xerces.jaxp.SAXParserImpl: Property 'http://javax.xml.XMLConstants/property/accessExternalDTD'
is not recognized.'
Warning: org.apache.xerces.parsers.SAXParser: Feature 'http://javax.xml.XMLConstants/feature/secure-processing'
is not recognized.
Warning: org.apache.xerces.parsers.SAXParser: Property 'http://javax.xml.XMLConstants/property/accessExternalDTD'
is not recognized.
Warning: org.apache.xerces.parsers.SAXParser: Property 'http://www.oracle.com/xml/jaxp/properties/entityExpansionLimit'
is not recognized.
[INFO] Rat check: Summary of files. Unapproved: 2 unknown: 2 generated: 0 approved: 675 licence.
[INFO] ------------------------------------------------------------------------
[INFO] BUILD FAILURE
[INFO] ------------------------------------------------------------------------
[INFO] Total time: 01:53 h
[INFO] Finished at: 2017-05-26T19:10:39+00:00
[INFO] Final Memory: 75M/425M
[INFO] ------------------------------------------------------------------------
[ERROR] Failed to execute goal org.apache.rat:apache-rat-plugin:0.11:check (default) on project
chukwa: Too many files with unapproved license: 2 See RAT report in: <https://builds.apache.org/job/Chukwa-master/ws/target/rat.txt>
-> [Help 1]
[ERROR] 
[ERROR] To see the full stack trace of the errors, re-run Maven with the -e switch.
[ERROR] Re-run Maven using the -X switch to enable full debug logging.
[ERROR] 
[ERROR] For more information about the errors and possible solutions, please read the following
articles:
[ERROR] [Help 1] http://cwiki.apache.org/confluence/display/MAVEN/MojoFailureException
Build step 'Invoke top-level Maven targets' marked build as failure
Archiving artifacts
Recording test results
JIRA-819 issue doesn't exist in JIRA
Not sending mail to unregistered user fay.y.wang@gmail.com

Mime
View raw message