chukwa-dev mailing list archives

Site index · List index
Message view « Date » · « Thread »
Top « Date » · « Thread »
From Apache Jenkins Server <jenk...@builds.apache.org>
Subject Build failed in Jenkins: Chukwa-master #574
Date Sat, 12 Nov 2016 23:26:07 GMT
See <https://builds.apache.org/job/Chukwa-master/574/changes>

Changes:

[eyang] CHUKWA-810.  Update code documentation with Apache trademark. (Eric

[eyang] CHUKWA-812.  Added throttle to dashboard save. (Eric Yang)

------------------------------------------
[...truncated 38530 lines...]
42/50 KB   30/30 KB   15/173 KB   21/21 KB   
42/50 KB   30/30 KB   17/173 KB   21/21 KB   
42/50 KB   30/30 KB   17/173 KB   21/21 KB   
46/50 KB   30/30 KB   17/173 KB   21/21 KB   
50/50 KB   30/30 KB   17/173 KB   21/21 KB   
50/50 KB   30/30 KB   21/173 KB   21/21 KB   
50/50 KB   30/30 KB   21/173 KB   21/21 KB   
50/50 KB   30/30 KB   22/173 KB   21/21 KB   
50/50 KB   30/30 KB   26/173 KB   21/21 KB   
50/50 KB   30/30 KB   27/173 KB   21/21 KB   
50/50 KB   30/30 KB   31/173 KB   21/21 KB   
50/50 KB   4/48 KB   30/30 KB   31/173 KB   21/21 KB   
50/50 KB   4/48 KB   30/30 KB   34/173 KB   21/21 KB   
50/50 KB   8/48 KB   30/30 KB   34/173 KB   21/21 KB   
50/50 KB   12/48 KB   30/30 KB   34/173 KB   21/21 KB   
50/50 KB   13/48 KB   30/30 KB   34/173 KB   21/21 KB   
50/50 KB   13/48 KB   30/30 KB   38/173 KB   21/21 KB   
50/50 KB   13/48 KB   30/30 KB   42/173 KB   21/21 KB   
50/50 KB   13/48 KB   30/30 KB   42/173 KB   21/21 KB   
50/50 KB   13/48 KB   30/30 KB   46/173 KB   21/21 KB   
50/50 KB   13/48 KB   30/30 KB   50/173 KB   21/21 KB   
50/50 KB   13/48 KB   30/30 KB   51/173 KB   21/21 KB   
                                                        
Downloaded: http://repo.maven.apache.org/maven2/org/apache/maven/shared/maven-common-artifact-filters/1.1/maven-common-artifact-filters-1.1.jar
(30 KB at 1954.9 KB/sec)
                                                        
Downloaded: http://repo.maven.apache.org/maven2/org/codehaus/plexus/plexus-active-collections/1.0-beta-2/plexus-active-collections-1.0-beta-2.jar
(21 KB at 1580.9 KB/sec)
50/50 KB   13/48 KB   55/173 KB                         
50/50 KB   13/48 KB   59/173 KB   
50/50 KB   13/48 KB   61/173 KB   
50/50 KB   16/48 KB   61/173 KB   
50/50 KB   16/48 KB   65/173 KB   
50/50 KB   16/48 KB   66/173 KB   
50/50 KB   20/48 KB   66/173 KB   
50/50 KB   24/48 KB   66/173 KB   
                                  
Downloaded: http://repo.maven.apache.org/maven2/org/codehaus/plexus/plexus-interpolation/1.7/plexus-interpolation-1.7.jar
(50 KB at 2933.9 KB/sec)
26/48 KB   66/173 KB              
26/48 KB   70/173 KB   
26/48 KB   73/173 KB   
30/48 KB   73/173 KB   
34/48 KB   73/173 KB   
38/48 KB   73/173 KB   
40/48 KB   73/173 KB   
40/48 KB   77/173 KB   
40/48 KB   80/173 KB   
42/48 KB   80/173 KB   
42/48 KB   84/173 KB   
42/48 KB   88/173 KB   
42/48 KB   89/173 KB   
42/48 KB   90/173 KB   
42/48 KB   94/173 KB   
46/48 KB   94/173 KB   
46/48 KB   98/173 KB   
47/48 KB   98/173 KB   
47/48 KB   99/173 KB   
48/48 KB   99/173 KB   
48/48 KB   103/173 KB   
48/48 KB   107/173 KB   
48/48 KB   107/173 KB   
48/48 KB   111/173 KB   
48/48 KB   115/173 KB   
48/48 KB   116/173 KB   
48/48 KB   120/173 KB   
48/48 KB   124/173 KB   
48/48 KB   124/173 KB   
48/48 KB   128/173 KB   
48/48 KB   132/173 KB   
48/48 KB   133/173 KB   
48/48 KB   137/173 KB   
48/48 KB   141/173 KB   
48/48 KB   143/173 KB   
48/48 KB   147/173 KB   
48/48 KB   151/173 KB   
48/48 KB   153/173 KB   
48/48 KB   154/173 KB   
                        
Downloaded: http://repo.maven.apache.org/maven2/org/codehaus/plexus/plexus-io/1.0-alpha-4/plexus-io-1.0-alpha-4.jar
(48 KB at 1889.6 KB/sec)
158/173 KB              
162/173 KB   
164/173 KB   
168/173 KB   
172/173 KB   
173/173 KB   
             
Downloaded: http://repo.maven.apache.org/maven2/org/codehaus/plexus/plexus-archiver/1.0-alpha-12/plexus-archiver-1.0-alpha-12.jar
(173 KB at 5081.7 KB/sec)
[INFO] Reading assembly descriptor: src/packages/tarball/all.xml
Downloading: http://clojars.org/repo/org/apache/hadoop/hadoop-annotations/2.7.2/hadoop-annotations-2.7.2.jar
             
Downloading: http://repo.maven.apache.org/maven2/org/apache/hadoop/hadoop-annotations/2.7.2/hadoop-annotations-2.7.2.jar
4/17 KB      
5/17 KB   
9/17 KB   
11/17 KB   
15/17 KB   
17/17 KB   
17/17 KB   
           
Downloaded: http://repo.maven.apache.org/maven2/org/apache/hadoop/hadoop-annotations/2.7.2/hadoop-annotations-2.7.2.jar
(17 KB at 1131.8 KB/sec)
[INFO] Building tar : <https://builds.apache.org/job/Chukwa-master/574/artifact/target/chukwa-0.8.0.tar.gz>
[INFO] 
[INFO] --- exec-maven-plugin:1.1:exec (exec-xsltproc: target/application.html) @ chukwa ---
[INFO] compilation error: file src/main/webapps/wadl.xsl line 25 element stylesheet
[INFO] xsl:version: only 1.0 features are supported
[INFO] 
[INFO] --- exec-maven-plugin:1.1:exec (exec-xsltproc: target/hicc-application.html) @ chukwa
---
[INFO] compilation error: file src/main/webapps/wadl.xsl line 25 element stylesheet
[INFO] xsl:version: only 1.0 features are supported
[INFO] 
[INFO] --- maven-surefire-plugin:2.18.1:test (default) @ chukwa ---
[WARNING] The parameter forkMode is deprecated since version 2.14. Use forkCount and reuseForks
instead.
[INFO] 
[INFO] --- apache-rat-plugin:0.11:check (default) @ chukwa ---
[INFO] 51 implicit excludes (use -debug for more details).
[INFO] Exclude: CHANGES.txt
[INFO] Exclude: README.md
[INFO] Exclude: bin/VERSION
[INFO] Exclude: **/target/**
[INFO] Exclude: **/.classpath
[INFO] Exclude: **/.project
[INFO] Exclude: **/.settings/**
[INFO] Exclude: conf/agents
[INFO] Exclude: conf/alert
[INFO] Exclude: conf/auth.conf
[INFO] Exclude: conf/collectors
[INFO] Exclude: conf/hbase.schema
[INFO] Exclude: conf/initial_adaptors
[INFO] Exclude: conf/jmxremote.access
[INFO] Exclude: conf/jmxremote.password
[INFO] Exclude: contrib/solr/logs/conf/_schema_analysis_stopwords_english.json
[INFO] Exclude: contrib/solr/logs/conf/_schema_analysis_synonyms_english.json
[INFO] Exclude: src/main/web/hicc/descriptors/**
[INFO] Exclude: src/main/web/hicc/views/**
[INFO] Exclude: src/test/resources/Hadoop18JobHistoryLog.txt
[INFO] Exclude: src/test/resources/TestJobLog.txt
[INFO] Exclude: test/samples/ClientTrace.log
[INFO] Exclude: test/samples/Iostat.log
[INFO] Exclude: test/samples/JobHistory.log
[INFO] Exclude: contrib/solr/logs/conf/lang/stopwords_da.txt
[INFO] Exclude: contrib/solr/logs/conf/lang/stopwords_de.txt
[INFO] Exclude: contrib/solr/logs/conf/lang/stopwords_es.txt
[INFO] Exclude: contrib/solr/logs/conf/lang/stopwords_fa.txt
[INFO] Exclude: contrib/solr/logs/conf/lang/stopwords_fi.txt
[INFO] Exclude: contrib/solr/logs/conf/lang/stopwords_fr.txt
[INFO] Exclude: contrib/solr/logs/conf/lang/stopwords_hi.txt
[INFO] Exclude: contrib/solr/logs/conf/lang/stopwords_hu.txt
[INFO] Exclude: contrib/solr/logs/conf/lang/stopwords_it.txt
[INFO] Exclude: contrib/solr/logs/conf/lang/stopwords_nl.txt
[INFO] Exclude: contrib/solr/logs/conf/lang/stopwords_no.txt
[INFO] Exclude: contrib/solr/logs/conf/lang/stopwords_pt.txt
[INFO] Exclude: contrib/solr/logs/conf/lang/stopwords_ru.txt
[INFO] Exclude: contrib/solr/logs/conf/lang/stopwords_sv.txt
[INFO] Exclude: src/main/web/hicc/js/jquery*
[INFO] Exclude: src/main/web/hicc/home/js/jquery.js
[INFO] Exclude: src/main/web/hicc/css/jquery.circliful.css
[INFO] Exclude: src/main/web/hicc/css/iui.css
[INFO] Exclude: src/main/web/hicc/js/behaviour.js
[INFO] Exclude: src/main/web/hicc/js/heatmap.js
[INFO] Exclude: src/main/web/hicc/js/iui.js
[INFO] Exclude: src/main/web/hicc/js/yahoo-dom-event.js
[INFO] Exclude: src/main/web/hicc/js/treeview-min.js
[INFO] Exclude: src/main/resources/ESAPI.properties
[INFO] Exclude: contrib/solr/logs/conf/velocity/jquery.autocomplete.js
[INFO] Exclude: src/main/web/hicc/css/flexigrid/flexigrid.css
[INFO] Exclude: src/main/web/hicc/css/timeline.css
[INFO] Exclude: src/main/web/hicc/lib/timeline/**
[INFO] Exclude: lib/agent.dict
[INFO] Exclude: lib/collector.dict
[INFO] Exclude: lib/confspellcheck-README
[INFO] Exclude: lib/json-README.txt
[INFO] Exclude: src/main/web/hicc/js/ajaxtree.js
[INFO] Exclude: src/main/web/hicc/js/flexigrid.js
[INFO] Exclude: src/main/web/hicc/js/flexigrid.pack.js
[INFO] Exclude: src/main/web/hicc/js/workspace/builder.js
[INFO] Exclude: src/main/web/hicc/js/workspace/controls.js
[INFO] Exclude: src/main/web/hicc/js/workspace/dragdrop.js
[INFO] Exclude: src/main/web/hicc/js/workspace/effects.js
[INFO] Exclude: src/main/web/hicc/js/workspace/scriptaculous.js
[INFO] Exclude: src/main/web/hicc/js/workspace/slider.js
[INFO] Exclude: src/main/web/hicc/js/workspace/sound.js
[INFO] Exclude: src/main/web/hicc/js/org/tool-man/*
[INFO] Exclude: src/main/web/hicc/js/timeframe.js
[INFO] Exclude: src/main/web/hicc/js/workspace/prototype.js
[INFO] Exclude: src/main/web/hicc/js/jquery.flot.pack.js
[INFO] Exclude: src/main/web/hicc/js/gsv.js
[INFO] Exclude: src/main/web/hicc/js/bootstrap.min.js
[INFO] Exclude: src/main/web/hicc/js/js-cookie.js
[INFO] Exclude: src/main/web/hicc/css/bootstrap-theme.css.map
[INFO] Exclude: src/main/web/hicc/css/bootstrap-theme.min.css
[INFO] Exclude: src/main/web/hicc/css/bootstrap.min.css
[INFO] Exclude: src/main/web/hicc/fonts/glyphicons-halflings-regular.svg
[INFO] Exclude: src/main/web/hicc/home/js/jquery.gridster.min.js
[INFO] Exclude: src/main/web/hicc/home/js/jquery.gridster.with-extras.min.js
[INFO] Exclude: src/main/web/hicc/home/css/jquery.gridster.css
[INFO] Exclude: src/main/web/hicc/home/css/jquery.gridster.min.css
[INFO] Exclude: src/main/web/hicc/home/js/typeahead.bundle.js
[INFO] Exclude: src/main/web/hicc/home/js/classie.js
[INFO] Exclude: src/main/web/hicc/home/js/gnmenu.js
[INFO] Exclude: src/main/web/hicc/home/js/modernizr.custom.js
[INFO] Exclude: src/main/web/hicc/ajax-solr/chukwa/css/jquery-ui.min.css
[INFO] Exclude: src/main/web/hicc/ajax-solr/chukwa/css/jquery-ui.structure.min.css
[INFO] Exclude: src/main/web/hicc/ajax-solr/chukwa/css/jquery-ui.theme.min.css
[INFO] Exclude: src/main/web/hicc/ajax-solr/chukwa/js/jquery-ui.min.js
[INFO] Exclude: src/main/web/hicc/ajax-solr/chukwa/js/require.min.js
[INFO] Exclude: src/main/web/hicc/home/css/select2.min.css
[INFO] Exclude: src/main/web/hicc/home/js/select2.min.js
[INFO] Exclude: src/main/web/hicc/css/font-awesome.min.css
[INFO] Exclude: src/main/web/hicc/fonts/glyphicons-halflings-regular.*
[INFO] Exclude: src/main/web/hicc/home/css/gridstack.min.css
[INFO] Exclude: src/main/web/hicc/home/js/gridstack.min.*
[INFO] Exclude: src/main/web/hicc/home/js/jquery-ui.js
[INFO] Exclude: src/main/web/hicc/js/autoHeight.js
[INFO] Exclude: src/main/web/hicc/js/base64.js
[INFO] Exclude: src/main/web/hicc/js/canvas2image.js
[INFO] Exclude: src/main/web/hicc/js/json.js
[INFO] Exclude: src/main/web/hicc/home/fonts/codropsicons/*
[INFO] Exclude: src/main/web/hicc/home/fonts/ecoicons/*
[INFO] Exclude: src/main/web/hicc/home/js/lodash.min.js
[INFO] Exclude: src/main/web/hicc/css/chartist.css
[INFO] Exclude: src/main/web/hicc/css/chartist.css.map
[INFO] Exclude: src/main/web/hicc/js/chartist.min.js
[INFO] Exclude: src/main/web/hicc/js/chartist.min.js.map
[INFO] Exclude: src/main/resources/chukwachunk.json
[INFO] 803 resources included (use -debug for more details)
Warning: org.apache.xerces.jaxp.SAXParserImpl$JAXPSAXParser: Property 'http://www.oracle.com/xml/jaxp/properties/entityExpansionLimit'
is not recognized.
Compiler warnings:
  WARNING:  'org.apache.xerces.jaxp.SAXParserImpl: Property 'http://javax.xml.XMLConstants/property/accessExternalDTD'
is not recognized.'
Warning: org.apache.xerces.parsers.SAXParser: Feature 'http://javax.xml.XMLConstants/feature/secure-processing'
is not recognized.
Warning: org.apache.xerces.parsers.SAXParser: Property 'http://javax.xml.XMLConstants/property/accessExternalDTD'
is not recognized.
Warning: org.apache.xerces.parsers.SAXParser: Property 'http://www.oracle.com/xml/jaxp/properties/entityExpansionLimit'
is not recognized.
[INFO] Rat check: Summary of files. Unapproved: 1 unknown: 1 generated: 0 approved: 666 licence.
[INFO] ------------------------------------------------------------------------
[INFO] BUILD FAILURE
[INFO] ------------------------------------------------------------------------
[INFO] Total time: 01:11 h
[INFO] Finished at: 2016-11-12T23:19:10+00:00
[INFO] Final Memory: 79M/1244M
[INFO] ------------------------------------------------------------------------
[ERROR] Failed to execute goal org.apache.rat:apache-rat-plugin:0.11:check (default) on project
chukwa: Too many files with unapproved license: 1 See RAT report in: <https://builds.apache.org/job/Chukwa-master/ws/target/rat.txt>
-> [Help 1]
[ERROR] 
[ERROR] To see the full stack trace of the errors, re-run Maven with the -e switch.
[ERROR] Re-run Maven using the -X switch to enable full debug logging.
[ERROR] 
[ERROR] For more information about the errors and possible solutions, please read the following
articles:
[ERROR] [Help 1] http://cwiki.apache.org/confluence/display/MAVEN/MojoFailureException
Build step 'Invoke top-level Maven targets' marked build as failure
Archiving artifacts
Recording test results
Updating CHUKWA-810
Updating CHUKWA-812

Mime
View raw message