chukwa-dev mailing list archives

Site index · List index
Message view « Date » · « Thread »
Top « Date » · « Thread »
From Apache Jenkins Server <jenk...@builds.apache.org>
Subject Build failed in Jenkins: Chukwa-master #572
Date Tue, 21 Jun 2016 07:20:13 GMT
See <https://builds.apache.org/job/Chukwa-master/572/changes>

Changes:

[eyang] CHUKWA-809.  Prepare for 0.8.0 release.

------------------------------------------
[...truncated 43733 lines...]
244/350 KB   19/19 KB   131/131 KB   25/25 KB            
Downloaded: http://repo.maven.apache.org/maven2/org/codehaus/plexus/plexus-compiler-manager/2.2/plexus-compiler-manager-2.2.jar
(5 KB at 262.0 KB/sec)
248/350 KB   19/19 KB   131/131 KB   25/25 KB   
Downloading: http://repo.maven.apache.org/maven2/com/google/collections/google-collections/1.0/google-collections-1.0.jar
252/350 KB   19/19 KB   131/131 KB   25/25 KB   
                                                
Downloaded: http://repo.maven.apache.org/maven2/org/codehaus/plexus/plexus-compiler-api/2.2/plexus-compiler-api-2.2.jar
(25 KB at 1355.8 KB/sec)
256/350 KB   19/19 KB   131/131 KB              
Downloading: http://repo.maven.apache.org/maven2/junit/junit/3.8.2/junit-3.8.2.jar
260/350 KB   19/19 KB   131/131 KB   
264/350 KB   19/19 KB   131/131 KB   
268/350 KB   19/19 KB   131/131 KB   
272/350 KB   19/19 KB   131/131 KB   
276/350 KB   19/19 KB   131/131 KB   
280/350 KB   19/19 KB   131/131 KB   
284/350 KB   19/19 KB   131/131 KB   
288/350 KB   19/19 KB   131/131 KB   
292/350 KB   19/19 KB   131/131 KB   
296/350 KB   19/19 KB   131/131 KB   
300/350 KB   19/19 KB   131/131 KB   
304/350 KB   19/19 KB   131/131 KB   
308/350 KB   19/19 KB   131/131 KB   
312/350 KB   19/19 KB   131/131 KB   
316/350 KB   19/19 KB   131/131 KB   
320/350 KB   19/19 KB   131/131 KB   
324/350 KB   19/19 KB   131/131 KB   
328/350 KB   19/19 KB   131/131 KB   
332/350 KB   19/19 KB   131/131 KB   
                                     
336/350 KB   131/131 KB              
Downloaded: http://repo.maven.apache.org/maven2/org/codehaus/plexus/plexus-compiler-javac/2.2/plexus-compiler-javac-2.2.jar
(19 KB at 975.1 KB/sec)
340/350 KB   131/131 KB   
344/350 KB   131/131 KB   
348/350 KB   131/131 KB   
350/350 KB   131/131 KB   
                          
Downloaded: http://repo.maven.apache.org/maven2/org/apache/xbean/xbean-reflect/3.4/xbean-reflect-3.4.jar
(131 KB at 6878.4 KB/sec)
350/350 KB   4/625 KB     
350/350 KB   4/118 KB   4/625 KB   
350/350 KB   4/118 KB   8/625 KB   
350/350 KB   8/118 KB   8/625 KB   
350/350 KB   8/118 KB   12/625 KB   
350/350 KB   12/118 KB   12/625 KB   
350/350 KB   12/118 KB   16/625 KB   
350/350 KB   16/118 KB   16/625 KB   
350/350 KB   20/118 KB   16/625 KB   
350/350 KB   20/118 KB   20/625 KB   
350/350 KB   24/118 KB   20/625 KB   
350/350 KB   24/118 KB   24/625 KB   
350/350 KB   28/118 KB   24/625 KB   
350/350 KB   28/118 KB   28/625 KB   
350/350 KB   32/118 KB   28/625 KB   
350/350 KB   36/118 KB   28/625 KB   
350/350 KB   36/118 KB   32/625 KB   
350/350 KB   40/118 KB   32/625 KB   
350/350 KB   40/118 KB   36/625 KB   
350/350 KB   44/118 KB   36/625 KB   
350/350 KB   44/118 KB   40/625 KB   
350/350 KB   48/118 KB   40/625 KB   
350/350 KB   48/118 KB   44/625 KB   
350/350 KB   52/118 KB   44/625 KB   
350/350 KB   52/118 KB   48/625 KB   
350/350 KB   56/118 KB   48/625 KB   
350/350 KB   60/118 KB   48/625 KB   
350/350 KB   60/118 KB   52/625 KB   
350/350 KB   64/118 KB   52/625 KB   
350/350 KB   64/118 KB   56/625 KB   
350/350 KB   68/118 KB   56/625 KB   
350/350 KB   68/118 KB   60/625 KB   
350/350 KB   72/118 KB   60/625 KB   
350/350 KB   76/118 KB   60/625 KB   
350/350 KB   76/118 KB   64/625 KB   
350/350 KB   80/118 KB   64/625 KB   
350/350 KB   80/118 KB   68/625 KB   
350/350 KB   84/118 KB   68/625 KB   
350/350 KB   88/118 KB   68/625 KB   
                                     
92/118 KB   72/625 KB   
88/118 KB   72/625 KB                
96/118 KB   72/625 KB   
Downloaded: http://repo.maven.apache.org/maven2/log4j/log4j/1.2.12/log4j-1.2.12.jar (350 KB
at 13987.7 KB/sec)
100/118 KB   76/625 KB   
100/118 KB   76/625 KB   
104/118 KB   76/625 KB   
108/118 KB   76/625 KB   
108/118 KB   80/625 KB   
112/118 KB   80/625 KB   
112/118 KB   84/625 KB   
116/118 KB   84/625 KB   
118/118 KB   84/625 KB   
118/118 KB   88/625 KB   
118/118 KB   92/625 KB   
118/118 KB   96/625 KB   
118/118 KB   100/625 KB   
118/118 KB   104/625 KB   
118/118 KB   108/625 KB   
118/118 KB   112/625 KB   
118/118 KB   116/625 KB   
118/118 KB   120/625 KB   
118/118 KB   124/625 KB   
118/118 KB   128/625 KB   
118/118 KB   132/625 KB   
118/118 KB   136/625 KB   
118/118 KB   140/625 KB   
118/118 KB   144/625 KB   
118/118 KB   148/625 KB   
118/118 KB   152/625 KB   
118/118 KB   156/625 KB   
118/118 KB   160/625 KB   
118/118 KB   164/625 KB   
118/118 KB   168/625 KB   
118/118 KB   172/625 KB   
118/118 KB   176/625 KB   
118/118 KB   180/625 KB   
118/118 KB   184/625 KB   
118/118 KB   188/625 KB   
118/118 KB   192/625 KB   
118/118 KB   196/625 KB   
118/118 KB   200/625 KB   
118/118 KB   204/625 KB   
118/118 KB   208/625 KB   
118/118 KB   212/625 KB   
118/118 KB   216/625 KB   
118/118 KB   220/625 KB   
118/118 KB   224/625 KB   
118/118 KB   228/625 KB   
118/118 KB   232/625 KB   
118/118 KB   236/625 KB   
118/118 KB   240/625 KB   
118/118 KB   244/625 KB   
118/118 KB   248/625 KB   
118/118 KB   252/625 KB   
118/118 KB   256/625 KB   
118/118 KB   260/625 KB   
118/118 KB   264/625 KB   
118/118 KB   268/625 KB   
118/118 KB   272/625 KB   
118/118 KB   276/625 KB   
118/118 KB   280/625 KB   
118/118 KB   284/625 KB   
118/118 KB   288/625 KB   
118/118 KB   292/625 KB   
118/118 KB   296/625 KB   
118/118 KB   300/625 KB   
118/118 KB   304/625 KB   
118/118 KB   308/625 KB   
118/118 KB   312/625 KB   
118/118 KB   316/625 KB   
118/118 KB   320/625 KB   
118/118 KB   324/625 KB   
118/118 KB   328/625 KB   
118/118 KB   332/625 KB   
118/118 KB   336/625 KB   
118/118 KB   340/625 KB   
118/118 KB   344/625 KB   
118/118 KB   348/625 KB   
118/118 KB   352/625 KB   
118/118 KB   356/625 KB   
118/118 KB   360/625 KB   
118/118 KB   364/625 KB   
118/118 KB   368/625 KB   
118/118 KB   372/625 KB   
118/118 KB   376/625 KB   
118/118 KB   380/625 KB   
118/118 KB   384/625 KB   
118/118 KB   388/625 KB   
                          
392/625 KB                
396/625 KB   
Downloaded: http://repo.maven.apache.org/maven2/junit/junit/3.8.2/junit-3.8.2.jar (118 KB
at 5890.6 KB/sec)
400/625 KB   
404/625 KB   
408/625 KB   
412/625 KB   
416/625 KB   
420/625 KB   
424/625 KB   
428/625 KB   
432/625 KB   
436/625 KB   
440/625 KB   
444/625 KB   
448/625 KB   
452/625 KB   
456/625 KB   
460/625 KB   
464/625 KB   
468/625 KB   
472/625 KB   
476/625 KB   
480/625 KB   
484/625 KB   
488/625 KB   
492/625 KB   
496/625 KB   
500/625 KB   
504/625 KB   
508/625 KB   
512/625 KB   
516/625 KB   
520/625 KB   
524/625 KB   
528/625 KB   
532/625 KB   
536/625 KB   
540/625 KB   
544/625 KB   
548/625 KB   
552/625 KB   
556/625 KB   
560/625 KB   
564/625 KB   
568/625 KB   
572/625 KB   
576/625 KB   
580/625 KB   
584/625 KB   
588/625 KB   
592/625 KB   
596/625 KB   
600/625 KB   
604/625 KB   
608/625 KB   
612/625 KB   
616/625 KB   
620/625 KB   
624/625 KB   
625/625 KB   
             
Downloaded: http://repo.maven.apache.org/maven2/com/google/collections/google-collections/1.0/google-collections-1.0.jar
(625 KB at 18370.6 KB/sec)
[INFO] ------------------------------------------------------------------------
[INFO] BUILD FAILURE
[INFO] ------------------------------------------------------------------------
[INFO] Total time: 11:16 min
[INFO] Finished at: 2016-06-21T07:20:11+00:00
[INFO] Final Memory: 31M/220M
[INFO] ------------------------------------------------------------------------
[ERROR] Failed to execute goal org.apache.maven.plugins:maven-compiler-plugin:3.1:compile
(default-compile) on project chukwa: Execution default-compile of goal org.apache.maven.plugins:maven-compiler-plugin:3.1:compile
failed: Plugin org.apache.maven.plugins:maven-compiler-plugin:3.1 or one of its dependencies
could not be resolved: Could not find artifact commons-logging:commons-logging-api:jar:1.1
-> [Help 1]
[ERROR] 
[ERROR] To see the full stack trace of the errors, re-run Maven with the -e switch.
[ERROR] Re-run Maven using the -X switch to enable full debug logging.
[ERROR] 
[ERROR] For more information about the errors and possible solutions, please read the following
articles:
[ERROR] [Help 1] http://cwiki.apache.org/confluence/display/MAVEN/PluginResolutionException
Build step 'Invoke top-level Maven targets' marked build as failure
Archiving artifacts
Recording test results
ERROR: Step ‘Publish JUnit test result report’ failed: No test report files were found.
Configuration error?
Updating CHUKWA-809

Mime
View raw message