chukwa-dev mailing list archives

Site index · List index
Message view « Date » · « Thread »
Top « Date » · « Thread »
From Apache Jenkins Server <jenk...@builds.apache.org>
Subject Build failed in Jenkins: Chukwa-master #566
Date Sun, 01 May 2016 04:27:51 GMT
See <https://builds.apache.org/job/Chukwa-master/566/changes>

Changes:

[eyang] CHUKWA-806. Replace gridster with gridstack.  (Eric Yang)

------------------------------------------
[...truncated 153 lines...]
Running org.apache.hadoop.chukwa.datacollection.collector.TestDelayedAcks
Tests run: 3, Failures: 0, Errors: 0, Skipped: 0, Time elapsed: 44.748 sec - in org.apache.hadoop.chukwa.datacollection.collector.TestDelayedAcks
Running org.apache.hadoop.chukwa.datacollection.collector.TestAdaptorTimeout
Tests run: 1, Failures: 0, Errors: 0, Skipped: 0, Time elapsed: 37.034 sec - in org.apache.hadoop.chukwa.datacollection.collector.TestAdaptorTimeout
Running org.apache.hadoop.chukwa.datacollection.collector.TestBackpressure
Tests run: 1, Failures: 0, Errors: 0, Skipped: 0, Time elapsed: 41.484 sec - in org.apache.hadoop.chukwa.datacollection.collector.TestBackpressure
Running org.apache.hadoop.chukwa.datacollection.TestOffsetStatsManager
Tests run: 3, Failures: 0, Errors: 0, Skipped: 0, Time elapsed: 13.102 sec - in org.apache.hadoop.chukwa.datacollection.TestOffsetStatsManager
Running org.apache.hadoop.chukwa.datacollection.adaptor.JMX.TestJMXAdaptor
Tests run: 1, Failures: 0, Errors: 0, Skipped: 0, Time elapsed: 0.661 sec - in org.apache.hadoop.chukwa.datacollection.adaptor.JMX.TestJMXAdaptor
Running org.apache.hadoop.chukwa.datacollection.adaptor.filetailer.TestStartAtOffset
Tests run: 1, Failures: 0, Errors: 0, Skipped: 0, Time elapsed: 0.382 sec - in org.apache.hadoop.chukwa.datacollection.adaptor.filetailer.TestStartAtOffset
Running org.apache.hadoop.chukwa.datacollection.adaptor.filetailer.TestFileTailingAdaptorPreserveLines
Tests run: 3, Failures: 0, Errors: 0, Skipped: 0, Time elapsed: 4.506 sec - in org.apache.hadoop.chukwa.datacollection.adaptor.filetailer.TestFileTailingAdaptorPreserveLines
Running org.apache.hadoop.chukwa.datacollection.adaptor.filetailer.TestFileExpirationPolicy
Tests run: 2, Failures: 0, Errors: 0, Skipped: 0, Time elapsed: 101.652 sec - in org.apache.hadoop.chukwa.datacollection.adaptor.filetailer.TestFileExpirationPolicy
Running org.apache.hadoop.chukwa.datacollection.adaptor.filetailer.TestRawAdaptor
Tests run: 3, Failures: 0, Errors: 0, Skipped: 0, Time elapsed: 3.784 sec - in org.apache.hadoop.chukwa.datacollection.adaptor.filetailer.TestRawAdaptor
Running org.apache.hadoop.chukwa.datacollection.adaptor.filetailer.TestLogRotate
Tests run: 1, Failures: 0, Errors: 0, Skipped: 0, Time elapsed: 9.423 sec - in org.apache.hadoop.chukwa.datacollection.adaptor.filetailer.TestLogRotate
Running org.apache.hadoop.chukwa.datacollection.adaptor.filetailer.TestFileTailingAdaptors
Tests run: 4, Failures: 0, Errors: 0, Skipped: 0, Time elapsed: 15.311 sec - in org.apache.hadoop.chukwa.datacollection.adaptor.filetailer.TestFileTailingAdaptors
Running org.apache.hadoop.chukwa.datacollection.adaptor.filetailer.TestCharFileTailingAdaptorUTF8
Tests run: 1, Failures: 0, Errors: 0, Skipped: 0, Time elapsed: 2.388 sec - in org.apache.hadoop.chukwa.datacollection.adaptor.filetailer.TestCharFileTailingAdaptorUTF8
Running org.apache.hadoop.chukwa.datacollection.adaptor.filetailer.TestFileTailer
Tests run: 1, Failures: 0, Errors: 0, Skipped: 0, Time elapsed: 0.491 sec - in org.apache.hadoop.chukwa.datacollection.adaptor.filetailer.TestFileTailer
Running org.apache.hadoop.chukwa.datacollection.adaptor.filetailer.TestFileTailingAdaptorBigRecord
Tests run: 1, Failures: 0, Errors: 0, Skipped: 0, Time elapsed: 8.505 sec - in org.apache.hadoop.chukwa.datacollection.adaptor.filetailer.TestFileTailingAdaptorBigRecord
Running org.apache.hadoop.chukwa.datacollection.adaptor.filetailer.TestRCheckAdaptor
Tests run: 2, Failures: 0, Errors: 0, Skipped: 0, Time elapsed: 50.035 sec - in org.apache.hadoop.chukwa.datacollection.adaptor.filetailer.TestRCheckAdaptor
Running org.apache.hadoop.chukwa.datacollection.adaptor.TestUDPAdaptor
Tests run: 1, Failures: 0, Errors: 0, Skipped: 0, Time elapsed: 0.07 sec - in org.apache.hadoop.chukwa.datacollection.adaptor.TestUDPAdaptor
Running org.apache.hadoop.chukwa.datacollection.adaptor.TestBufferingWrappers
Tests run: 2, Failures: 0, Errors: 0, Skipped: 0, Time elapsed: 8.762 sec - in org.apache.hadoop.chukwa.datacollection.adaptor.TestBufferingWrappers
Running org.apache.hadoop.chukwa.datacollection.adaptor.TestDirTailingAdaptor
Tests run: 2, Failures: 0, Errors: 0, Skipped: 0, Time elapsed: 23.507 sec - in org.apache.hadoop.chukwa.datacollection.adaptor.TestDirTailingAdaptor
Running org.apache.hadoop.chukwa.datacollection.adaptor.TestSyslogAdaptor
Tests run: 1, Failures: 0, Errors: 0, Skipped: 0, Time elapsed: 0.289 sec - in org.apache.hadoop.chukwa.datacollection.adaptor.TestSyslogAdaptor
Running org.apache.hadoop.chukwa.datacollection.adaptor.TestSocketAdaptor
Tests run: 1, Failures: 0, Errors: 0, Skipped: 0, Time elapsed: 14.096 sec - in org.apache.hadoop.chukwa.datacollection.adaptor.TestSocketAdaptor
Running org.apache.hadoop.chukwa.datacollection.adaptor.TestRestAdaptor
Tests run: 1, Failures: 0, Errors: 0, Skipped: 0, Time elapsed: 2.547 sec - in org.apache.hadoop.chukwa.datacollection.adaptor.TestRestAdaptor
Running org.apache.hadoop.chukwa.datacollection.adaptor.TestHeartbeatAdaptor
Tests run: 1, Failures: 0, Errors: 0, Skipped: 0, Time elapsed: 10.554 sec - in org.apache.hadoop.chukwa.datacollection.adaptor.TestHeartbeatAdaptor
Running org.apache.hadoop.chukwa.datacollection.adaptor.TestFileAdaptor
Tests run: 2, Failures: 0, Errors: 0, Skipped: 0, Time elapsed: 2.934 sec - in org.apache.hadoop.chukwa.datacollection.adaptor.TestFileAdaptor
Running org.apache.hadoop.chukwa.datacollection.adaptor.TestOozieAdaptor
Tests run: 1, Failures: 0, Errors: 0, Skipped: 0, Time elapsed: 1.277 sec - in org.apache.hadoop.chukwa.datacollection.adaptor.TestOozieAdaptor
Running org.apache.hadoop.chukwa.datacollection.adaptor.TestAddAdaptor
Tests run: 1, Failures: 0, Errors: 0, Skipped: 0, Time elapsed: 3.109 sec - in org.apache.hadoop.chukwa.datacollection.adaptor.TestAddAdaptor
Running org.apache.hadoop.chukwa.datacollection.adaptor.TestExecAdaptor
Tests run: 2, Failures: 0, Errors: 0, Skipped: 0, Time elapsed: 6.857 sec - in org.apache.hadoop.chukwa.datacollection.adaptor.TestExecAdaptor
Running org.apache.hadoop.chukwa.datacollection.adaptor.jms.TestJMSAdaptor
Tests run: 4, Failures: 0, Errors: 0, Skipped: 0, Time elapsed: 4.902 sec - in org.apache.hadoop.chukwa.datacollection.adaptor.jms.TestJMSAdaptor
Running org.apache.hadoop.chukwa.datacollection.adaptor.jms.TestJMSMessagePropertyTransformer
Tests run: 9, Failures: 0, Errors: 0, Skipped: 0, Time elapsed: 10.18 sec - in org.apache.hadoop.chukwa.datacollection.adaptor.jms.TestJMSMessagePropertyTransformer
Running org.apache.hadoop.chukwa.datacollection.sender.TestRetryListOfCollectors
Tests run: 2, Failures: 0, Errors: 0, Skipped: 0, Time elapsed: 0.284 sec - in org.apache.hadoop.chukwa.datacollection.sender.TestRetryListOfCollectors
Running org.apache.hadoop.chukwa.datacollection.sender.TestAcksOnFailure
Tests run: 1, Failures: 0, Errors: 0, Skipped: 0, Time elapsed: 3.458 sec - in org.apache.hadoop.chukwa.datacollection.sender.TestAcksOnFailure
Running org.apache.hadoop.chukwa.datacollection.writer.TestChukwaWriters
Tests run: 2, Failures: 0, Errors: 0, Skipped: 0, Time elapsed: 11.357 sec - in org.apache.hadoop.chukwa.datacollection.writer.TestChukwaWriters
Running org.apache.hadoop.chukwa.datacollection.writer.solr.TestSolrWriter
Tests run: 1, Failures: 0, Errors: 0, Skipped: 0, Time elapsed: 2.081 sec - in org.apache.hadoop.chukwa.datacollection.writer.solr.TestSolrWriter
Running org.apache.hadoop.chukwa.datacollection.writer.TestSocketTee
Tests run: 1, Failures: 0, Errors: 0, Skipped: 0, Time elapsed: 0.29 sec - in org.apache.hadoop.chukwa.datacollection.writer.TestSocketTee
Running org.apache.hadoop.chukwa.datacollection.writer.TestChukwaParquetWriter
Tests run: 2, Failures: 0, Errors: 0, Skipped: 0, Time elapsed: 7.277 sec - in org.apache.hadoop.chukwa.datacollection.writer.TestChukwaParquetWriter
Running org.apache.hadoop.chukwa.datacollection.writer.TestHBaseWriter
Tests run: 1, Failures: 0, Errors: 0, Skipped: 0, Time elapsed: 19.034 sec - in org.apache.hadoop.chukwa.datacollection.writer.TestHBaseWriter
Running org.apache.hadoop.chukwa.datacollection.writer.TestClientAck
Tests run: 1, Failures: 0, Errors: 0, Skipped: 0, Time elapsed: 18.101 sec - in org.apache.hadoop.chukwa.datacollection.writer.TestClientAck
Running org.apache.hadoop.chukwa.inputtools.log4j.TestTaskLogAppender
Tests run: 1, Failures: 0, Errors: 0, Skipped: 0, Time elapsed: 2.126 sec - in org.apache.hadoop.chukwa.inputtools.log4j.TestTaskLogAppender
Running org.apache.hadoop.chukwa.inputtools.log4j.TestChukwaDailyRollingFileAppender
Tests run: 1, Failures: 0, Errors: 0, Skipped: 0, Time elapsed: 2.097 sec - in org.apache.hadoop.chukwa.inputtools.log4j.TestChukwaDailyRollingFileAppender
Running org.apache.hadoop.chukwa.inputtools.TestInputFormat
Tests run: 1, Failures: 0, Errors: 0, Skipped: 0, Time elapsed: 2.719 sec - in org.apache.hadoop.chukwa.inputtools.TestInputFormat
Running org.apache.hadoop.chukwa.database.TestMacro
Tests run: 2, Failures: 0, Errors: 0, Skipped: 0, Time elapsed: 0.125 sec - in org.apache.hadoop.chukwa.database.TestMacro

Results :

Tests run: 139, Failures: 0, Errors: 0, Skipped: 0

[INFO] 
[INFO] --- maven-jar-plugin:2.3.1:jar (core) @ chukwa ---
[INFO] Building jar: /x1/jenkins/jenkins-slave/workspace/Chukwa-master/target/chukwa-0.8.0-SNAPSHOT.jar
[INFO] 
[INFO] --- maven-source-plugin:2.1.1:jar-no-fork (default) @ chukwa ---
[INFO] Building jar: /x1/jenkins/jenkins-slave/workspace/Chukwa-master/target/chukwa-0.8.0-SNAPSHOT-sources.jar
[INFO] 
[INFO] --- maven-jar-plugin:2.3.1:jar (default-jar) @ chukwa ---
[INFO] 
[INFO] --- maven-jar-plugin:2.3.1:test-jar (test) @ chukwa ---
[INFO] Building jar: /x1/jenkins/jenkins-slave/workspace/Chukwa-master/target/chukwa-0.8.0-SNAPSHOT-tests.jar
[INFO] 
[INFO] --- maven-jar-plugin:2.3.1:jar (client) @ chukwa ---
[INFO] Building jar: /x1/jenkins/jenkins-slave/workspace/Chukwa-master/target/chukwa-0.8.0-SNAPSHOT-client.jar
[INFO] 
[INFO] --- maven-war-plugin:2.1.1:war (build-hicc) @ chukwa ---
[INFO] Packaging webapp
[INFO] Assembling webapp [chukwa] in [/x1/jenkins/jenkins-slave/workspace/Chukwa-master/target/hicc]
[INFO] Processing war project
[INFO] Copying webapp resources [/x1/jenkins/jenkins-slave/workspace/Chukwa-master/src/main/web/hicc]
[INFO] Webapp assembled in [2465 msecs]
[INFO] Building war: /x1/jenkins/jenkins-slave/workspace/Chukwa-master/target/hicc.war
[INFO] WEB-INF/web.xml already added, skipping
[INFO] 
[INFO] --- maven-assembly-plugin:2.2-beta-5:single (build-tarball) @ chukwa ---
[INFO] Reading assembly descriptor: src/packages/tarball/all.xml
[INFO] Building tar : /x1/jenkins/jenkins-slave/workspace/Chukwa-master/target/chukwa-0.8.0.tar.gz
[INFO] 
[INFO] --- maven-surefire-plugin:2.18.1:test (default) @ chukwa ---
[WARNING] The parameter forkMode is deprecated since version 2.14. Use forkCount and reuseForks
instead.
[INFO] 
[INFO] --- apache-rat-plugin:0.11:check (default) @ chukwa ---
[INFO] 51 implicit excludes (use -debug for more details).
[INFO] Exclude: CHANGES.txt
[INFO] Exclude: README.md
[INFO] Exclude: bin/VERSION
[INFO] Exclude: **/target/**
[INFO] Exclude: **/.classpath
[INFO] Exclude: **/.project
[INFO] Exclude: **/.settings/**
[INFO] Exclude: conf/agents
[INFO] Exclude: conf/alert
[INFO] Exclude: conf/auth.conf
[INFO] Exclude: conf/collectors
[INFO] Exclude: conf/hbase.schema
[INFO] Exclude: conf/initial_adaptors
[INFO] Exclude: conf/jmxremote.access
[INFO] Exclude: conf/jmxremote.password
[INFO] Exclude: contrib/solr/logs/conf/_schema_analysis_stopwords_english.json
[INFO] Exclude: contrib/solr/logs/conf/_schema_analysis_synonyms_english.json
[INFO] Exclude: src/main/web/hicc/descriptors/**
[INFO] Exclude: src/main/web/hicc/views/**
[INFO] Exclude: src/test/resources/Hadoop18JobHistoryLog.txt
[INFO] Exclude: src/test/resources/TestJobLog.txt
[INFO] Exclude: test/samples/ClientTrace.log
[INFO] Exclude: test/samples/Iostat.log
[INFO] Exclude: test/samples/JobHistory.log
[INFO] Exclude: contrib/solr/logs/conf/lang/stopwords_da.txt
[INFO] Exclude: contrib/solr/logs/conf/lang/stopwords_de.txt
[INFO] Exclude: contrib/solr/logs/conf/lang/stopwords_es.txt
[INFO] Exclude: contrib/solr/logs/conf/lang/stopwords_fa.txt
[INFO] Exclude: contrib/solr/logs/conf/lang/stopwords_fi.txt
[INFO] Exclude: contrib/solr/logs/conf/lang/stopwords_fr.txt
[INFO] Exclude: contrib/solr/logs/conf/lang/stopwords_hi.txt
[INFO] Exclude: contrib/solr/logs/conf/lang/stopwords_hu.txt
[INFO] Exclude: contrib/solr/logs/conf/lang/stopwords_it.txt
[INFO] Exclude: contrib/solr/logs/conf/lang/stopwords_nl.txt
[INFO] Exclude: contrib/solr/logs/conf/lang/stopwords_no.txt
[INFO] Exclude: contrib/solr/logs/conf/lang/stopwords_pt.txt
[INFO] Exclude: contrib/solr/logs/conf/lang/stopwords_ru.txt
[INFO] Exclude: contrib/solr/logs/conf/lang/stopwords_sv.txt
[INFO] Exclude: src/main/web/hicc/js/jquery*
[INFO] Exclude: src/main/web/hicc/home/js/jquery.js
[INFO] Exclude: src/main/web/hicc/css/jquery.circliful.css
[INFO] Exclude: src/main/web/hicc/css/iui.css
[INFO] Exclude: src/main/web/hicc/js/behaviour.js
[INFO] Exclude: src/main/web/hicc/js/heatmap.js
[INFO] Exclude: src/main/web/hicc/js/iui.js
[INFO] Exclude: src/main/web/hicc/js/yahoo-dom-event.js
[INFO] Exclude: src/main/web/hicc/js/treeview-min.js
[INFO] Exclude: src/main/resources/ESAPI.properties
[INFO] Exclude: contrib/solr/logs/conf/velocity/jquery.autocomplete.js
[INFO] Exclude: src/main/web/hicc/css/flexigrid/flexigrid.css
[INFO] Exclude: src/main/web/hicc/css/timeline.css
[INFO] Exclude: src/main/web/hicc/lib/timeline/**
[INFO] Exclude: lib/agent.dict
[INFO] Exclude: lib/collector.dict
[INFO] Exclude: lib/confspellcheck-README
[INFO] Exclude: lib/json-README.txt
[INFO] Exclude: src/main/web/hicc/js/ajaxtree.js
[INFO] Exclude: src/main/web/hicc/js/flexigrid.js
[INFO] Exclude: src/main/web/hicc/js/flexigrid.pack.js
[INFO] Exclude: src/main/web/hicc/js/workspace/builder.js
[INFO] Exclude: src/main/web/hicc/js/workspace/controls.js
[INFO] Exclude: src/main/web/hicc/js/workspace/dragdrop.js
[INFO] Exclude: src/main/web/hicc/js/workspace/effects.js
[INFO] Exclude: src/main/web/hicc/js/workspace/scriptaculous.js
[INFO] Exclude: src/main/web/hicc/js/workspace/slider.js
[INFO] Exclude: src/main/web/hicc/js/workspace/sound.js
[INFO] Exclude: src/main/web/hicc/js/org/tool-man/*
[INFO] Exclude: src/main/web/hicc/js/timeframe.js
[INFO] Exclude: src/main/web/hicc/js/workspace/prototype.js
[INFO] Exclude: src/main/web/hicc/js/jquery.flot.pack.js
[INFO] Exclude: src/main/web/hicc/js/gsv.js
[INFO] Exclude: src/main/web/hicc/js/bootstrap.min.js
[INFO] Exclude: src/main/web/hicc/js/js-cookie.js
[INFO] Exclude: src/main/web/hicc/css/bootstrap-theme.css.map
[INFO] Exclude: src/main/web/hicc/css/bootstrap-theme.min.css
[INFO] Exclude: src/main/web/hicc/css/bootstrap.min.css
[INFO] Exclude: src/main/web/hicc/fonts/glyphicons-halflings-regular.svg
[INFO] Exclude: src/main/web/hicc/home/js/jquery.gridster.min.js
[INFO] Exclude: src/main/web/hicc/home/js/jquery.gridster.with-extras.min.js
[INFO] Exclude: src/main/web/hicc/home/css/jquery.gridster.css
[INFO] Exclude: src/main/web/hicc/home/css/jquery.gridster.min.css
[INFO] Exclude: src/main/web/hicc/home/js/typeahead.bundle.js
[INFO] Exclude: src/main/web/hicc/home/js/classie.js
[INFO] Exclude: src/main/web/hicc/home/js/gnmenu.js
[INFO] Exclude: src/main/web/hicc/home/js/modernizr.custom.js
[INFO] Exclude: src/main/web/hicc/ajax-solr/chukwa/css/jquery-ui.min.css
[INFO] Exclude: src/main/web/hicc/ajax-solr/chukwa/css/jquery-ui.structure.min.css
[INFO] Exclude: src/main/web/hicc/ajax-solr/chukwa/css/jquery-ui.theme.min.css
[INFO] Exclude: src/main/web/hicc/ajax-solr/chukwa/js/jquery-ui.min.js
[INFO] Exclude: src/main/web/hicc/ajax-solr/chukwa/js/require.min.js
[INFO] Exclude: src/main/web/hicc/home/css/select2.min.css
[INFO] Exclude: src/main/web/hicc/home/js/select2.min.js
[INFO] Exclude: src/main/web/hicc/css/font-awesome.min.css
[INFO] Exclude: src/main/web/hicc/fonts/glyphicons-halflings-regular.*
[INFO] Exclude: src/main/web/hicc/js/autoHeight.js
[INFO] Exclude: src/main/web/hicc/js/base64.js
[INFO] Exclude: src/main/web/hicc/js/canvas2image.js
[INFO] Exclude: src/main/web/hicc/js/json.js
[INFO] Exclude: src/main/web/hicc/home/fonts/codropsicons/*
[INFO] Exclude: src/main/web/hicc/home/fonts/ecoicons/*
[INFO] Exclude: src/main/web/hicc/css/chartist.css
[INFO] Exclude: src/main/web/hicc/css/chartist.css.map
[INFO] Exclude: src/main/web/hicc/js/chartist.min.js
[INFO] Exclude: src/main/web/hicc/js/chartist.min.js.map
[INFO] Exclude: src/main/resources/chukwachunk.json
[INFO] 806 resources included (use -debug for more details)
Warning:  org.apache.xerces.jaxp.SAXParserImpl$JAXPSAXParser: Property 'http://www.oracle.com/xml/jaxp/properties/entityExpansionLimit'
is not recognized.
Compiler warnings:
  WARNING:  'org.apache.xerces.jaxp.SAXParserImpl: Property 'http://javax.xml.XMLConstants/property/accessExternalDTD'
is not recognized.'
Warning:  org.apache.xerces.parsers.SAXParser: Feature 'http://javax.xml.XMLConstants/feature/secure-processing'
is not recognized.
Warning:  org.apache.xerces.parsers.SAXParser: Property 'http://javax.xml.XMLConstants/property/accessExternalDTD'
is not recognized.
Warning:  org.apache.xerces.parsers.SAXParser: Property 'http://www.oracle.com/xml/jaxp/properties/entityExpansionLimit'
is not recognized.
[INFO] Rat check: Summary of files. Unapproved: 5 unknown: 5 generated: 0 approved: 666 licence.
[INFO] ------------------------------------------------------------------------
[INFO] BUILD FAILURE
[INFO] ------------------------------------------------------------------------
[INFO] Total time: 19:15 min
[INFO] Finished at: 2016-05-01T04:27:12+00:00
[INFO] Final Memory: 69M/895M
[INFO] ------------------------------------------------------------------------
[ERROR] Failed to execute goal org.apache.rat:apache-rat-plugin:0.11:check (default) on project
chukwa: Too many files with unapproved license: 5 See RAT report in: /x1/jenkins/jenkins-slave/workspace/Chukwa-master/target/rat.txt
-> [Help 1]
[ERROR] 
[ERROR] To see the full stack trace of the errors, re-run Maven with the -e switch.
[ERROR] Re-run Maven using the -X switch to enable full debug logging.
[ERROR] 
[ERROR] For more information about the errors and possible solutions, please read the following
articles:
[ERROR] [Help 1] http://cwiki.apache.org/confluence/display/MAVEN/MojoFailureException
Build step 'Invoke top-level Maven targets' marked build as failure
Archiving artifacts
Recording test results
Updating CHUKWA-806

Mime
View raw message