chukwa-dev mailing list archives

Site index · List index
Message view « Date » · « Thread »
Top « Date » · « Thread »
From Apache Jenkins Server <jenk...@builds.apache.org>
Subject Build failed in Jenkins: Chukwa-master #558
Date Sun, 03 Apr 2016 01:08:19 GMT
See <https://builds.apache.org/job/Chukwa-master/558/changes>

Changes:

[eyang] CHUKWA-803. Update Solr API to version 5 API.  (Eric Yang)

------------------------------------------
[...truncated 20830 lines...]
7498/8075 KB   
7502/8075 KB   
7506/8075 KB   
7508/8075 KB   
7512/8075 KB   
7516/8075 KB   
7519/8075 KB   
7523/8075 KB   
7525/8075 KB   
7529/8075 KB   
7530/8075 KB   
7534/8075 KB   
7538/8075 KB   
7542/8075 KB   
7546/8075 KB   
7550/8075 KB   
7554/8075 KB   
7558/8075 KB   
7562/8075 KB   
7566/8075 KB   
7567/8075 KB   
7571/8075 KB   
7573/8075 KB   
7577/8075 KB   
7578/8075 KB   
7582/8075 KB   
7586/8075 KB   
7590/8075 KB   
7594/8075 KB   
7598/8075 KB   
7602/8075 KB   
7604/8075 KB   
7608/8075 KB   
7612/8075 KB   
7615/8075 KB   
7619/8075 KB   
7621/8075 KB   
7625/8075 KB   
7627/8075 KB   
7631/8075 KB   
7635/8075 KB   
7639/8075 KB   
7643/8075 KB   
7647/8075 KB   
7651/8075 KB   
7652/8075 KB   
7656/8075 KB   
7660/8075 KB   
7663/8075 KB   
7667/8075 KB   
7669/8075 KB   
7673/8075 KB   
7675/8075 KB   
7679/8075 KB   
7683/8075 KB   
7687/8075 KB   
7691/8075 KB   
7695/8075 KB   
7699/8075 KB   
7700/8075 KB   
7704/8075 KB   
7708/8075 KB   
7711/8075 KB   
7715/8075 KB   
7717/8075 KB   
7721/8075 KB   
7723/8075 KB   
7727/8075 KB   
7731/8075 KB   
7735/8075 KB   
7739/8075 KB   
7743/8075 KB   
7747/8075 KB   
7748/8075 KB   
7752/8075 KB   
7756/8075 KB   
7759/8075 KB   
7763/8075 KB   
7765/8075 KB   
7769/8075 KB   
7771/8075 KB   
7775/8075 KB   
7779/8075 KB   
7783/8075 KB   
7787/8075 KB   
7791/8075 KB   
7795/8075 KB   
7796/8075 KB   
7800/8075 KB   
7804/8075 KB   
7808/8075 KB   
7812/8075 KB   
7813/8075 KB   
7817/8075 KB   
7819/8075 KB   
7823/8075 KB   
7827/8075 KB   
7831/8075 KB   
7835/8075 KB   
7839/8075 KB   
7843/8075 KB   
7844/8075 KB   
7848/8075 KB   
7852/8075 KB   
7856/8075 KB   
7860/8075 KB   
7861/8075 KB   
7865/8075 KB   
7867/8075 KB   
7871/8075 KB   
7875/8075 KB   
7879/8075 KB   
7883/8075 KB   
7887/8075 KB   
7891/8075 KB   
7895/8075 KB   
7899/8075 KB   
7903/8075 KB   
7904/8075 KB   
7908/8075 KB   
7909/8075 KB   
7913/8075 KB   
7915/8075 KB   
7919/8075 KB   
7923/8075 KB   
7927/8075 KB   
7931/8075 KB   
7935/8075 KB   
7939/8075 KB   
7943/8075 KB   
7947/8075 KB   
7951/8075 KB   
7952/8075 KB   
7956/8075 KB   
7957/8075 KB   
7961/8075 KB   
7963/8075 KB   
7967/8075 KB   
7971/8075 KB   
7975/8075 KB   
7979/8075 KB   
7983/8075 KB   
7987/8075 KB   
7991/8075 KB   
7995/8075 KB   
7999/8075 KB   
8000/8075 KB   
8004/8075 KB   
8006/8075 KB   
8010/8075 KB   
8011/8075 KB   
8015/8075 KB   
8019/8075 KB   
8023/8075 KB   
8027/8075 KB   
8031/8075 KB   
8035/8075 KB   
8039/8075 KB   
8043/8075 KB   
8047/8075 KB   
8048/8075 KB   
8052/8075 KB   
8054/8075 KB   
8058/8075 KB   
8059/8075 KB   
8063/8075 KB   
8067/8075 KB   
8071/8075 KB   
8075/8075 KB   
               
Downloaded: http://repo.maven.apache.org/maven2/org/apache/hadoop/hadoop-hdfs/2.7.2/hadoop-hdfs-2.7.2.jar
(8075 KB at 1041.9 KB/sec)
[INFO] 
[INFO] --- maven-clean-plugin:2.5:clean (default-clean) @ chukwa ---
[INFO] 
[INFO] --- maven-antrun-plugin:1.6:run (setup) @ chukwa ---
[INFO] Executing tasks

main:
    [mkdir] Created dir: /x1/jenkins/jenkins-slave/workspace/Chukwa-master/target/clover
[INFO] Executed tasks
[INFO] 
[INFO] --- maven-resources-plugin:2.6:copy-resources (copy-configuration) @ chukwa ---
[INFO] Using 'UTF-8' encoding to copy filtered resources.
[INFO] Copying 27 resources
[INFO] 
[INFO] --- maven-resources-plugin:2.6:resources (default-resources) @ chukwa ---
[INFO] Using 'UTF-8' encoding to copy filtered resources.
[INFO] Copying 10 resources
[INFO] 
[INFO] --- maven-antrun-plugin:1.6:run (chmod-jmx-file) @ chukwa ---
[INFO] Executing tasks

main:
[INFO] Executed tasks
[INFO] 
[INFO] --- maven-compiler-plugin:3.1:compile (default-compile) @ chukwa ---
[INFO] Changes detected - recompiling the module!
[INFO] Compiling 345 source files to /x1/jenkins/jenkins-slave/workspace/Chukwa-master/target/classes
[WARNING] /x1/jenkins/jenkins-slave/workspace/Chukwa-master/src/main/java/org/apache/hadoop/chukwa/extraction/engine/ChukwaRecordKey.java:
Some input files use or override a deprecated API.
[WARNING] /x1/jenkins/jenkins-slave/workspace/Chukwa-master/src/main/java/org/apache/hadoop/chukwa/extraction/engine/ChukwaRecordKey.java:
Recompile with -Xlint:deprecation for details.
[WARNING] /x1/jenkins/jenkins-slave/workspace/Chukwa-master/src/main/java/org/apache/hadoop/chukwa/analysis/salsa/fsm/FSMBuilder.java:
Some input files use unchecked or unsafe operations.
[WARNING] /x1/jenkins/jenkins-slave/workspace/Chukwa-master/src/main/java/org/apache/hadoop/chukwa/analysis/salsa/fsm/FSMBuilder.java:
Recompile with -Xlint:unchecked for details.
[INFO] 
[INFO] --- maven-antrun-plugin:1.6:run (test-setup) @ chukwa ---
[INFO] Executing tasks

main:
    [mkdir] Created dir: /x1/jenkins/jenkins-slave/workspace/Chukwa-master/target/test/conf
    [mkdir] Created dir: /x1/jenkins/jenkins-slave/workspace/Chukwa-master/target/test/var
    [mkdir] Created dir: /x1/jenkins/jenkins-slave/workspace/Chukwa-master/target/test/var/log
    [mkdir] Created dir: /x1/jenkins/jenkins-slave/workspace/Chukwa-master/target/test/var/run
     [copy] Copying 3 files to /x1/jenkins/jenkins-slave/workspace/Chukwa-master/target/test/var/log
     [copy] Copying 1 file to /x1/jenkins/jenkins-slave/workspace/Chukwa-master/target/test/conf
     [copy] Copying 1 file to /x1/jenkins/jenkins-slave/workspace/Chukwa-master/target/test/conf
     [copy] Copying 1 file to /x1/jenkins/jenkins-slave/workspace/Chukwa-master/target/test/conf
     [copy] Copying 1 file to /x1/jenkins/jenkins-slave/workspace/Chukwa-master/target/test/conf
     [copy] Copying 1 file to /x1/jenkins/jenkins-slave/workspace/Chukwa-master/target/test/conf
     [copy] Copying 1 file to /x1/jenkins/jenkins-slave/workspace/Chukwa-master/target/test/conf
     [copy] Copying 1 file to /x1/jenkins/jenkins-slave/workspace/Chukwa-master/target/test/conf
     [copy] Copying 1 file to /x1/jenkins/jenkins-slave/workspace/Chukwa-master/target/test/var
[INFO] Executed tasks
[INFO] 
[INFO] --- maven-resources-plugin:2.6:testResources (default-testResources) @ chukwa ---
[INFO] Using 'UTF-8' encoding to copy filtered resources.
[INFO] Copying 0 resource
[INFO] Copying 7 resources
[INFO] 
[INFO] --- maven-compiler-plugin:3.1:testCompile (default-testCompile) @ chukwa ---
[INFO] Changes detected - recompiling the module!
[INFO] Compiling 100 source files to /x1/jenkins/jenkins-slave/workspace/Chukwa-master/target/test-classes
[INFO] ------------------------------------------------------------------------
[INFO] BUILD FAILURE
[INFO] ------------------------------------------------------------------------
[INFO] Total time: 57.772 s
[INFO] Finished at: 2016-04-03T01:08:26+00:00
[INFO] Final Memory: 49M/439M
[INFO] ------------------------------------------------------------------------
[ERROR] Failed to execute goal org.apache.maven.plugins:maven-compiler-plugin:3.1:testCompile
(default-testCompile) on project chukwa: Fatal error compiling: invalid target release: 1.8
-> [Help 1]
[ERROR] 
[ERROR] To see the full stack trace of the errors, re-run Maven with the -e switch.
[ERROR] Re-run Maven using the -X switch to enable full debug logging.
[ERROR] 
[ERROR] For more information about the errors and possible solutions, please read the following
articles:
[ERROR] [Help 1] http://cwiki.apache.org/confluence/display/MAVEN/MojoExecutionException
Build step 'Invoke top-level Maven targets' marked build as failure
Archiving artifacts
Recording test results
ERROR: Step ?Publish JUnit test result report? failed: No test report files were found. Configuration
error?
Updating CHUKWA-803

Mime
View raw message