chukwa-dev mailing list archives

Site index · List index
Message view « Date » · « Thread »
Top « Date » · « Thread »
From Apache Jenkins Server <jenk...@builds.apache.org>
Subject Build failed in Jenkins: Chukwa-master #552
Date Sun, 20 Mar 2016 03:40:08 GMT
See <https://builds.apache.org/job/Chukwa-master/552/changes>

Changes:

[eyang] CHUKWA-798. Added retry logic for SolrWriter and update to Solr 5.5.0

------------------------------------------
[...truncated 18794 lines...]
1497/1497 KB   2645/3210 KB   162/162 KB   
1497/1497 KB   2649/3210 KB   162/162 KB   
1497/1497 KB   2653/3210 KB   162/162 KB   
1497/1497 KB   2657/3210 KB   162/162 KB   
1497/1497 KB   2661/3210 KB   162/162 KB   
1497/1497 KB   2665/3210 KB   162/162 KB   
1497/1497 KB   2669/3210 KB   162/162 KB   
1497/1497 KB   2673/3210 KB   162/162 KB   
1497/1497 KB   2677/3210 KB   162/162 KB   
1497/1497 KB   2681/3210 KB   162/162 KB   
1497/1497 KB   2685/3210 KB   162/162 KB   
1497/1497 KB   2689/3210 KB   162/162 KB   
1497/1497 KB   2693/3210 KB   162/162 KB   
1497/1497 KB   2697/3210 KB   162/162 KB   
1497/1497 KB   2701/3210 KB   162/162 KB   
1497/1497 KB   2705/3210 KB   162/162 KB   
1497/1497 KB   2709/3210 KB   162/162 KB   
1497/1497 KB   2713/3210 KB   162/162 KB   
1497/1497 KB   2717/3210 KB   162/162 KB   
1497/1497 KB   2721/3210 KB   162/162 KB   
1497/1497 KB   2725/3210 KB   162/162 KB   
1497/1497 KB   2729/3210 KB   162/162 KB   
1497/1497 KB   2733/3210 KB   162/162 KB   
1497/1497 KB   2737/3210 KB   162/162 KB   
1497/1497 KB   2741/3210 KB   162/162 KB   
1497/1497 KB   2745/3210 KB   162/162 KB   
1497/1497 KB   2749/3210 KB   162/162 KB   
1497/1497 KB   2753/3210 KB   162/162 KB   
1497/1497 KB   2757/3210 KB   162/162 KB   
1497/1497 KB   2761/3210 KB   162/162 KB   
1497/1497 KB   2765/3210 KB   162/162 KB   
1497/1497 KB   2769/3210 KB   162/162 KB   
1497/1497 KB   2773/3210 KB   162/162 KB   
1497/1497 KB   2777/3210 KB   162/162 KB   
1497/1497 KB   2781/3210 KB   162/162 KB   
1497/1497 KB   2785/3210 KB   162/162 KB   
1497/1497 KB   2789/3210 KB   162/162 KB   
1497/1497 KB   2793/3210 KB   162/162 KB   
1497/1497 KB   2797/3210 KB   162/162 KB   
1497/1497 KB   2801/3210 KB   162/162 KB   
1497/1497 KB   2805/3210 KB   162/162 KB   
1497/1497 KB   2809/3210 KB   162/162 KB   
1497/1497 KB   2813/3210 KB   162/162 KB   
1497/1497 KB   2817/3210 KB   162/162 KB   
1497/1497 KB   2821/3210 KB   162/162 KB   
1497/1497 KB   2825/3210 KB   162/162 KB   
1497/1497 KB   2829/3210 KB   162/162 KB   
1497/1497 KB   2833/3210 KB   162/162 KB   
1497/1497 KB   2837/3210 KB   162/162 KB   
1497/1497 KB   2841/3210 KB   162/162 KB   
1497/1497 KB   2845/3210 KB   162/162 KB   
1497/1497 KB   2849/3210 KB   162/162 KB   
1497/1497 KB   2853/3210 KB   162/162 KB   
1497/1497 KB   2857/3210 KB   162/162 KB   
1497/1497 KB   2861/3210 KB   162/162 KB   
1497/1497 KB   2865/3210 KB   162/162 KB   
1497/1497 KB   2869/3210 KB   162/162 KB   
1497/1497 KB   2873/3210 KB   162/162 KB   
                                           
2877/3210 KB   162/162 KB                  
2881/3210 KB   162/162 KB   
2885/3210 KB   162/162 KB   
2889/3210 KB   162/162 KB   
2893/3210 KB   162/162 KB   
2897/3210 KB   162/162 KB   
2901/3210 KB   162/162 KB   
2905/3210 KB   162/162 KB   
2909/3210 KB   162/162 KB   
2913/3210 KB   162/162 KB   
2917/3210 KB   162/162 KB   
2921/3210 KB   162/162 KB   
Downloaded: http://repo.maven.apache.org/maven2/org/apache/hadoop/hadoop-mapreduce-client-jobclient/2.7.2/hadoop-mapreduce-client-jobclient-2.7.2-tests.jar
(1497 KB at 8753.4 KB/sec)
2925/3210 KB   162/162 KB   
2929/3210 KB   162/162 KB   
2933/3210 KB   162/162 KB   
2937/3210 KB   162/162 KB   
2941/3210 KB   162/162 KB   
2945/3210 KB   162/162 KB   
2949/3210 KB   162/162 KB   
2953/3210 KB   162/162 KB   
2957/3210 KB   162/162 KB   
2961/3210 KB   162/162 KB   
2965/3210 KB   162/162 KB   
2969/3210 KB   162/162 KB   
2973/3210 KB   162/162 KB   
2977/3210 KB   162/162 KB   
2981/3210 KB   162/162 KB   
2985/3210 KB   162/162 KB   
2989/3210 KB   162/162 KB   
2993/3210 KB   162/162 KB   
2997/3210 KB   162/162 KB   
3001/3210 KB   162/162 KB   
3005/3210 KB   162/162 KB   
3009/3210 KB   162/162 KB   
3013/3210 KB   162/162 KB   
3017/3210 KB   162/162 KB   
3021/3210 KB   162/162 KB   
3025/3210 KB   162/162 KB   
3029/3210 KB   162/162 KB   
3033/3210 KB   162/162 KB   
3037/3210 KB   162/162 KB   
3041/3210 KB   162/162 KB   
3045/3210 KB   162/162 KB   
3049/3210 KB   162/162 KB   
3053/3210 KB   162/162 KB   
3057/3210 KB   162/162 KB   
3061/3210 KB   162/162 KB   
3065/3210 KB   162/162 KB   
3069/3210 KB   162/162 KB   
                            
Downloaded: http://repo.maven.apache.org/maven2/org/apache/hadoop/hadoop-mapreduce-client-hs/2.7.2/hadoop-mapreduce-client-hs-2.7.2.jar
(162 KB at 1078.3 KB/sec)
3073/3210 KB                
3077/3210 KB   
3081/3210 KB   
3085/3210 KB   
3089/3210 KB   
3093/3210 KB   
3097/3210 KB   
3101/3210 KB   
3105/3210 KB   
3109/3210 KB   
3113/3210 KB   
3117/3210 KB   
3121/3210 KB   
3125/3210 KB   
3129/3210 KB   
3133/3210 KB   
3137/3210 KB   
3141/3210 KB   
3145/3210 KB   
3149/3210 KB   
3153/3210 KB   
3157/3210 KB   
3161/3210 KB   
3165/3210 KB   
3169/3210 KB   
3173/3210 KB   
3177/3210 KB   
3181/3210 KB   
3185/3210 KB   
3189/3210 KB   
3193/3210 KB   
3197/3210 KB   
3201/3210 KB   
3205/3210 KB   
3209/3210 KB   
3210/3210 KB   
               
Downloaded: http://repo.maven.apache.org/maven2/org/apache/hadoop/hadoop-hdfs/2.7.2/hadoop-hdfs-2.7.2-tests.jar
(3210 KB at 11221.4 KB/sec)
[INFO] 
[INFO] --- maven-clean-plugin:2.5:clean (default-clean) @ chukwa ---
[INFO] 
[INFO] --- maven-antrun-plugin:1.6:run (setup) @ chukwa ---
[INFO] Executing tasks

main:
    [mkdir] Created dir: <https://builds.apache.org/job/Chukwa-master/ws/target/clover>
[INFO] Executed tasks
[INFO] 
[INFO] --- maven-resources-plugin:2.6:copy-resources (copy-configuration) @ chukwa ---
[INFO] Using 'UTF-8' encoding to copy filtered resources.
[INFO] Copying 27 resources
[INFO] 
[INFO] --- maven-resources-plugin:2.6:resources (default-resources) @ chukwa ---
[INFO] Using 'UTF-8' encoding to copy filtered resources.
[INFO] Copying 10 resources
[INFO] 
[INFO] --- maven-antrun-plugin:1.6:run (chmod-jmx-file) @ chukwa ---
[INFO] Executing tasks

main:
[INFO] Executed tasks
[INFO] 
[INFO] --- maven-compiler-plugin:3.1:compile (default-compile) @ chukwa ---
[INFO] Changes detected - recompiling the module!
[INFO] Compiling 345 source files to <https://builds.apache.org/job/Chukwa-master/ws/target/classes>
[WARNING] <https://builds.apache.org/job/Chukwa-master/ws/src/main/java/org/apache/hadoop/chukwa/extraction/engine/ChukwaRecordKey.java>:
Some input files use or override a deprecated API.
[WARNING] <https://builds.apache.org/job/Chukwa-master/ws/src/main/java/org/apache/hadoop/chukwa/extraction/engine/ChukwaRecordKey.java>:
Recompile with -Xlint:deprecation for details.
[WARNING] <https://builds.apache.org/job/Chukwa-master/ws/src/main/java/org/apache/hadoop/chukwa/extraction/engine/ChukwaRecordJT.java>:
Some input files use unchecked or unsafe operations.
[WARNING] <https://builds.apache.org/job/Chukwa-master/ws/src/main/java/org/apache/hadoop/chukwa/extraction/engine/ChukwaRecordJT.java>:
Recompile with -Xlint:unchecked for details.
[INFO] 
[INFO] >>> maven-javadoc-plugin:2.10.1:javadoc (agent-public-api) @ chukwa >>>
[INFO] 
[INFO] --- maven-antrun-plugin:1.6:run (setup) @ chukwa ---
[INFO] Executing tasks

main:
[INFO] Executed tasks
[INFO] 
[INFO] <<< maven-javadoc-plugin:2.10.1:javadoc (agent-public-api) @ chukwa <<<
[INFO] 
[INFO] --- maven-javadoc-plugin:2.10.1:javadoc (agent-public-api) @ chukwa ---
[INFO] 
Loading source files for package org.apache.hadoop.chukwa.datacollection.agent.rest...
Constructing Javadoc information...
[WARNING] Javadoc Warnings
[WARNING] Mar 20, 2016 3:32:30 AM com.sun.jersey.wadl.resourcedoc.ResourceDocletJSON start
[WARNING] INFO: Wrote <https://builds.apache.org/job/Chukwa-master/ws/target/classes/agent-rest.xml>
[INFO] 
[INFO] --- maven-wadl-plugin:1.8:generate (generate) @ chukwa ---
[INFO] Loading wadlGenerator com.sun.jersey.server.wadl.generators.WadlGeneratorApplicationDoc
[INFO] Loading wadlGenerator com.sun.jersey.server.wadl.generators.WadlGeneratorGrammarsSupport
[INFO] Loading wadlGenerator com.sun.jersey.server.wadl.generators.resourcedoc.WadlGeneratorResourceDocSupport
Mar 20, 2016 3:32:32 AM com.sun.jersey.api.core.PackagesResourceConfig init
INFO: Scanning for root resource and provider classes in the packages:
  org.apache.hadoop.chukwa.datacollection.agent.rest
Mar 20, 2016 3:32:32 AM com.sun.jersey.api.core.ScanningResourceConfig logClasses
INFO: Root resource classes found:
  class org.apache.hadoop.chukwa.datacollection.agent.rest.AdaptorController
Mar 20, 2016 3:32:32 AM com.sun.jersey.api.core.ScanningResourceConfig logClasses
INFO: Provider classes found:
  class org.apache.hadoop.chukwa.datacollection.agent.rest.ContextProvider
[INFO] Wrote <https://builds.apache.org/job/Chukwa-master/ws/target/classes/application.wadl>
[INFO] 
[INFO] --- maven-antrun-plugin:1.6:run (test-setup) @ chukwa ---
[INFO] Executing tasks

main:
    [mkdir] Created dir: <https://builds.apache.org/job/Chukwa-master/ws/target/test/conf>
    [mkdir] Created dir: <https://builds.apache.org/job/Chukwa-master/ws/target/test/var>
    [mkdir] Created dir: <https://builds.apache.org/job/Chukwa-master/ws/target/test/var/log>
    [mkdir] Created dir: <https://builds.apache.org/job/Chukwa-master/ws/target/test/var/run>
     [copy] Copying 3 files to <https://builds.apache.org/job/Chukwa-master/ws/target/test/var/log>
     [copy] Copying 1 file to <https://builds.apache.org/job/Chukwa-master/ws/target/test/conf>
     [copy] Copying 1 file to <https://builds.apache.org/job/Chukwa-master/ws/target/test/conf>
     [copy] Copying 1 file to <https://builds.apache.org/job/Chukwa-master/ws/target/test/conf>
     [copy] Copying 1 file to <https://builds.apache.org/job/Chukwa-master/ws/target/test/conf>
     [copy] Copying 1 file to <https://builds.apache.org/job/Chukwa-master/ws/target/test/conf>
     [copy] Copying 1 file to <https://builds.apache.org/job/Chukwa-master/ws/target/test/conf>
     [copy] Copying 1 file to <https://builds.apache.org/job/Chukwa-master/ws/target/test/conf>
[INFO] ------------------------------------------------------------------------
[INFO] BUILD FAILURE
[INFO] ------------------------------------------------------------------------
[INFO] Total time: 01:09 min
[INFO] Finished at: 2016-03-20T03:32:33+00:00
[INFO] Final Memory: 56M/862M
[INFO] ------------------------------------------------------------------------
[ERROR] Failed to execute goal org.apache.maven.plugins:maven-antrun-plugin:1.6:run (test-setup)
on project chukwa: An Ant BuildException has occured: Warning: Could not find file <https://builds.apache.org/job/Chukwa-master/ws/src/test/resources/solr.xml>
to copy. -> [Help 1]
[ERROR] 
[ERROR] To see the full stack trace of the errors, re-run Maven with the -e switch.
[ERROR] Re-run Maven using the -X switch to enable full debug logging.
[ERROR] 
[ERROR] For more information about the errors and possible solutions, please read the following
articles:
[ERROR] [Help 1] http://cwiki.apache.org/confluence/display/MAVEN/MojoExecutionException
Build step 'Invoke top-level Maven targets' marked build as failure
Archiving artifacts
Recording test results
ERROR: Step ?Publish JUnit test result report? failed: No test report files were found. Configuration
error?
Updating CHUKWA-798

Mime
View raw message