chukwa-dev mailing list archives

Site index · List index
Message view « Date » · « Thread »
Top « Date » · « Thread »
From Apache Jenkins Server <jenk...@builds.apache.org>
Subject Build failed in Jenkins: Chukwa-master #542
Date Tue, 01 Dec 2015 06:29:00 GMT
See <https://builds.apache.org/job/Chukwa-master/542/changes>

Changes:

[eyang] CHUKWA-790. Update pom.xml to support JDK 1.8. (Eric Yang)

------------------------------------------
[...truncated 35024 lines...]
40/151 KB   36/206 KB   5/5 KB   
40/151 KB   40/206 KB   5/5 KB   
44/151 KB   40/206 KB   5/5 KB   
44/151 KB   44/206 KB   5/5 KB   
48/151 KB   44/206 KB   5/5 KB   
48/151 KB   48/206 KB   5/5 KB   
52/151 KB   48/206 KB   5/5 KB   
52/151 KB   51/206 KB   5/5 KB   
56/151 KB   51/206 KB   5/5 KB   
60/151 KB   51/206 KB   5/5 KB   
64/151 KB   51/206 KB   5/5 KB   
68/151 KB   51/206 KB   5/5 KB   
72/151 KB   51/206 KB   5/5 KB   
76/151 KB   51/206 KB   5/5 KB   
80/151 KB   51/206 KB   5/5 KB   
84/151 KB   51/206 KB   5/5 KB   
88/151 KB   51/206 KB   5/5 KB   
92/151 KB   51/206 KB   5/5 KB   
96/151 KB   51/206 KB   5/5 KB   
100/151 KB   51/206 KB   5/5 KB   
104/151 KB   51/206 KB   5/5 KB   
105/151 KB   51/206 KB   5/5 KB   
108/151 KB   51/206 KB   5/5 KB   
112/151 KB   51/206 KB   5/5 KB   
112/151 KB   55/206 KB   5/5 KB   
116/151 KB   55/206 KB   5/5 KB   
116/151 KB   59/206 KB   5/5 KB   
120/151 KB   59/206 KB   5/5 KB   
120/151 KB   63/206 KB   5/5 KB   
124/151 KB   63/206 KB   5/5 KB   
124/151 KB   67/206 KB   5/5 KB   
124/151 KB   71/206 KB   5/5 KB   
128/151 KB   71/206 KB   5/5 KB   
128/151 KB   75/206 KB   5/5 KB   
132/151 KB   75/206 KB   5/5 KB   
132/151 KB   79/206 KB   5/5 KB   
136/151 KB   79/206 KB   5/5 KB   
136/151 KB   83/206 KB   5/5 KB   
140/151 KB   83/206 KB   5/5 KB   
140/151 KB   87/206 KB   5/5 KB   
144/151 KB   87/206 KB   5/5 KB   
144/151 KB   91/206 KB   5/5 KB   
144/151 KB   91/206 KB   4/25 KB   5/5 KB   
148/151 KB   95/206 KB   4/25 KB   5/5 KB   
148/151 KB   99/206 KB   4/25 KB   5/5 KB   
148/151 KB   99/206 KB   8/25 KB   5/5 KB   
148/151 KB   102/206 KB   8/25 KB   5/5 KB   
148/151 KB   102/206 KB   12/25 KB   5/5 KB   
148/151 KB   102/206 KB   16/25 KB   5/5 KB   
148/151 KB   102/206 KB   16/25 KB   4/14 KB   5/5 KB   
148/151 KB   102/206 KB   20/25 KB   4/14 KB   5/5 KB   
148/151 KB   102/206 KB   20/25 KB   6/14 KB   5/5 KB   
148/151 KB   91/206 KB   4/25 KB   5/5 KB   
148/151 KB   102/206 KB   24/25 KB   6/14 KB   5/5 KB   
148/151 KB   102/206 KB   24/25 KB   10/14 KB   5/5 KB   
148/151 KB   102/206 KB   25/25 KB   10/14 KB   5/5 KB   
148/151 KB   102/206 KB   25/25 KB   14/14 KB   5/5 KB   
151/151 KB   102/206 KB   25/25 KB   14/14 KB   5/5 KB   
                                                         
Downloaded: http://repo.maven.apache.org/maven2/org/codehaus/plexus/plexus-compiler-manager/2.2/plexus-compiler-manager-2.2.jar
(5 KB at 222.7 KB/sec)
Downloading: http://repo.maven.apache.org/maven2/org/codehaus/plexus/plexus-compiler-javac/2.2/plexus-compiler-javac-2.2.jar
151/151 KB   106/206 KB   25/25 KB   14/14 KB            
151/151 KB   110/206 KB   25/25 KB   14/14 KB   
151/151 KB   114/206 KB   25/25 KB   14/14 KB   
151/151 KB   118/206 KB   25/25 KB   14/14 KB   
151/151 KB   122/206 KB   25/25 KB   14/14 KB   
151/151 KB   126/206 KB   25/25 KB   14/14 KB   
151/151 KB   130/206 KB   25/25 KB   14/14 KB   
151/151 KB   134/206 KB   25/25 KB   14/14 KB   
151/151 KB   138/206 KB   25/25 KB   14/14 KB   
151/151 KB   142/206 KB   25/25 KB   14/14 KB   
151/151 KB   146/206 KB   25/25 KB   14/14 KB   
151/151 KB   150/206 KB   25/25 KB   14/14 KB   
151/151 KB   154/206 KB   25/25 KB   14/14 KB   
151/151 KB   156/206 KB   25/25 KB   14/14 KB   
                                                
Downloaded: http://repo.maven.apache.org/maven2/org/apache/maven/shared/maven-shared-utils/0.1/maven-shared-utils-0.1.jar
(151 KB at 5203.4 KB/sec)
Downloading: http://repo.maven.apache.org/maven2/log4j/log4j/1.2.12/log4j-1.2.12.jar
4/19 KB   156/206 KB   25/25 KB   14/14 KB      
8/19 KB   156/206 KB   25/25 KB   14/14 KB   
12/19 KB   156/206 KB   25/25 KB   14/14 KB   
16/19 KB   156/206 KB   25/25 KB   14/14 KB   
16/19 KB   160/206 KB   25/25 KB   14/14 KB   
19/19 KB   160/206 KB   25/25 KB   14/14 KB   
19/19 KB   164/206 KB   25/25 KB   14/14 KB   
19/19 KB   168/206 KB   25/25 KB   14/14 KB   
19/19 KB   172/206 KB   25/25 KB   14/14 KB   
19/19 KB   176/206 KB   25/25 KB   14/14 KB   
19/19 KB   180/206 KB   25/25 KB   14/14 KB   
19/19 KB   184/206 KB   25/25 KB   14/14 KB   
19/19 KB   188/206 KB   25/25 KB   14/14 KB   
19/19 KB   192/206 KB   25/25 KB   14/14 KB   
19/19 KB   196/206 KB   25/25 KB   14/14 KB   
19/19 KB   200/206 KB   25/25 KB   14/14 KB   
19/19 KB   204/206 KB   25/25 KB   14/14 KB   
19/19 KB   206/206 KB   25/25 KB   14/14 KB   
                                              
Downloaded: http://repo.maven.apache.org/maven2/org/apache/maven/shared/maven-shared-incremental/1.1/maven-shared-incremental-1.1.jar
(14 KB at 377.7 KB/sec)
Downloading: http://repo.maven.apache.org/maven2/junit/junit/3.8.2/junit-3.8.2.jar
                                              
Downloaded: http://repo.maven.apache.org/maven2/org/codehaus/plexus/plexus-compiler-api/2.2/plexus-compiler-api-2.2.jar
(25 KB at 697.3 KB/sec)
19/19 KB   206/206 KB   4/350 KB              
19/19 KB   206/206 KB   8/350 KB   
19/19 KB   206/206 KB   12/350 KB   
19/19 KB   206/206 KB   16/350 KB   
19/19 KB   206/206 KB   20/350 KB   
19/19 KB   206/206 KB   24/350 KB   
19/19 KB   206/206 KB   28/350 KB   
19/19 KB   206/206 KB   32/350 KB   
19/19 KB   206/206 KB   36/350 KB   
19/19 KB   206/206 KB   40/350 KB   
19/19 KB   206/206 KB   44/350 KB   
19/19 KB   206/206 KB   48/350 KB   
                                    
206/206 KB   52/350 KB              
Downloaded: http://repo.maven.apache.org/maven2/org/codehaus/plexus/plexus-compiler-javac/2.2/plexus-compiler-javac-2.2.jar
(19 KB at 975.1 KB/sec)
206/206 KB   56/350 KB   
                         
Downloaded: http://repo.maven.apache.org/maven2/org/codehaus/plexus/plexus-utils/1.5.1/plexus-utils-1.5.1.jar
(206 KB at 4898.6 KB/sec)
60/350 KB                
64/350 KB   
68/350 KB   
72/350 KB   
76/350 KB   
80/350 KB   
84/350 KB   
88/350 KB   
92/350 KB   
96/350 KB   
100/350 KB   
104/350 KB   
108/350 KB   
112/350 KB   
114/350 KB   
118/350 KB   
122/350 KB   
126/350 KB   
130/350 KB   
134/350 KB   
138/350 KB   
138/350 KB   4/118 KB   
142/350 KB   4/118 KB   
146/350 KB   4/118 KB   
146/350 KB   8/118 KB   
150/350 KB   8/118 KB   
150/350 KB   12/118 KB   
154/350 KB   12/118 KB   
154/350 KB   16/118 KB   
158/350 KB   16/118 KB   
158/350 KB   20/118 KB   
162/350 KB   20/118 KB   
162/350 KB   24/118 KB   
166/350 KB   24/118 KB   
166/350 KB   28/118 KB   
170/350 KB   28/118 KB   
170/350 KB   32/118 KB   
174/350 KB   32/118 KB   
174/350 KB   36/118 KB   
174/350 KB   36/118 KB   
174/350 KB   40/118 KB   
174/350 KB   44/118 KB   
174/350 KB   48/118 KB   
174/350 KB   52/118 KB   
174/350 KB   56/118 KB   
174/350 KB   58/118 KB   
178/350 KB   58/118 KB   
182/350 KB   58/118 KB   
186/350 KB   58/118 KB   
190/350 KB   58/118 KB   
194/350 KB   58/118 KB   
198/350 KB   58/118 KB   
202/350 KB   58/118 KB   
206/350 KB   58/118 KB   
210/350 KB   58/118 KB   
214/350 KB   58/118 KB   
218/350 KB   58/118 KB   
222/350 KB   58/118 KB   
226/350 KB   58/118 KB   
230/350 KB   58/118 KB   
234/350 KB   58/118 KB   
237/350 KB   58/118 KB   
241/350 KB   58/118 KB   
245/350 KB   58/118 KB   
249/350 KB   58/118 KB   
253/350 KB   58/118 KB   
257/350 KB   58/118 KB   
261/350 KB   58/118 KB   
261/350 KB   62/118 KB   
265/350 KB   62/118 KB   
265/350 KB   66/118 KB   
269/350 KB   66/118 KB   
269/350 KB   70/118 KB   
273/350 KB   70/118 KB   
273/350 KB   71/118 KB   
273/350 KB   75/118 KB   
277/350 KB   75/118 KB   
277/350 KB   79/118 KB   
281/350 KB   79/118 KB   
281/350 KB   83/118 KB   
285/350 KB   83/118 KB   
285/350 KB   87/118 KB   
289/350 KB   87/118 KB   
289/350 KB   91/118 KB   
293/350 KB   91/118 KB   
293/350 KB   95/118 KB   
297/350 KB   95/118 KB   
297/350 KB   99/118 KB   
300/350 KB   99/118 KB   
300/350 KB   103/118 KB   
300/350 KB   107/118 KB   
300/350 KB   111/118 KB   
300/350 KB   115/118 KB   
300/350 KB   118/118 KB   
304/350 KB   118/118 KB   
308/350 KB   118/118 KB   
312/350 KB   118/118 KB   
316/350 KB   118/118 KB   
320/350 KB   118/118 KB   
324/350 KB   118/118 KB   
328/350 KB   118/118 KB   
332/350 KB   118/118 KB   
336/350 KB   118/118 KB   
340/350 KB   118/118 KB   
344/350 KB   118/118 KB   
348/350 KB   118/118 KB   
350/350 KB   118/118 KB   
                          
Downloaded: http://repo.maven.apache.org/maven2/log4j/log4j/1.2.12/log4j-1.2.12.jar (350 KB
at 6598.0 KB/sec)
                          
Downloaded: http://repo.maven.apache.org/maven2/junit/junit/3.8.2/junit-3.8.2.jar (118 KB
at 2404.3 KB/sec)
[INFO] ------------------------------------------------------------------------
[INFO] BUILD FAILURE
[INFO] ------------------------------------------------------------------------
[INFO] Total time: 45.567 s
[INFO] Finished at: 2015-12-01T06:29:01+00:00
[INFO] Final Memory: 25M/121M
[INFO] ------------------------------------------------------------------------
[ERROR] Failed to execute goal org.apache.maven.plugins:maven-compiler-plugin:3.1:compile
(default-compile) on project chukwa: Execution default-compile of goal org.apache.maven.plugins:maven-compiler-plugin:3.1:compile
failed: Plugin org.apache.maven.plugins:maven-compiler-plugin:3.1 or one of its dependencies
could not be resolved: Could not find artifact commons-logging:commons-logging-api:jar:1.1
-> [Help 1]
[ERROR] 
[ERROR] To see the full stack trace of the errors, re-run Maven with the -e switch.
[ERROR] Re-run Maven using the -X switch to enable full debug logging.
[ERROR] 
[ERROR] For more information about the errors and possible solutions, please read the following
articles:
[ERROR] [Help 1] http://cwiki.apache.org/confluence/display/MAVEN/PluginResolutionException
Build step 'Invoke top-level Maven targets' marked build as failure
Archiving artifacts
Recording test results
ERROR: Publisher 'Publish JUnit test result report' failed: No test report files were found.
Configuration error?
Updating CHUKWA-790

Mime
View raw message