chukwa-dev mailing list archives

Site index · List index
Message view « Date » · « Thread »
Top « Date » · « Thread »
From Apache Jenkins Server <jenk...@builds.apache.org>
Subject Build failed in Jenkins: Chukwa-master #547
Date Mon, 21 Dec 2015 19:25:51 GMT
See <https://builds.apache.org/job/Chukwa-master/547/changes>

Changes:

[eyang] CHUKWA-795. Release Chukwa 0.7.0.  (Eric Yang)

[eyang] CHUKWA-795. Release Chukwa 0.7.0.  (Eric Yang)

[eyang] CHUKWA-795.  Release Chukwa 0.7.0 and update master to 0.8.0.  (Eric

------------------------------------------
[...truncated 3797 lines...]
[WARNING] <https://builds.apache.org/job/Chukwa-master/ws/src/main/java/org/apache/hadoop/chukwa/extraction/engine/ChukwaRecordKey.java>:
Recompile with -Xlint:deprecation for details.
[WARNING] <https://builds.apache.org/job/Chukwa-master/ws/src/main/java/org/apache/hadoop/chukwa/extraction/engine/ChukwaRecordJT.java>:
Some input files use unchecked or unsafe operations.
[WARNING] <https://builds.apache.org/job/Chukwa-master/ws/src/main/java/org/apache/hadoop/chukwa/extraction/engine/ChukwaRecordJT.java>:
Recompile with -Xlint:unchecked for details.
[INFO] 
[INFO] >>> maven-javadoc-plugin:2.10.1:javadoc (agent-public-api) @ chukwa >>>
[INFO] 
[INFO] --- maven-antrun-plugin:1.6:run (setup) @ chukwa ---
[INFO] Executing tasks

main:
[INFO] Executed tasks
[INFO] 
[INFO] <<< maven-javadoc-plugin:2.10.1:javadoc (agent-public-api) @ chukwa <<<
[INFO] 
[INFO] --- maven-javadoc-plugin:2.10.1:javadoc (agent-public-api) @ chukwa ---
[INFO] 
Loading source files for package org.apache.hadoop.chukwa.datacollection.agent.rest...
Constructing Javadoc information...
[WARNING] Javadoc Warnings
[WARNING] Dec 21, 2015 7:07:54 PM com.sun.jersey.wadl.resourcedoc.ResourceDocletJSON start
[WARNING] INFO: Wrote <https://builds.apache.org/job/Chukwa-master/ws/target/classes/agent-rest.xml>
[INFO] 
[INFO] --- maven-wadl-plugin:1.8:generate (generate) @ chukwa ---
[INFO] Loading wadlGenerator com.sun.jersey.server.wadl.generators.WadlGeneratorApplicationDoc
[INFO] Loading wadlGenerator com.sun.jersey.server.wadl.generators.WadlGeneratorGrammarsSupport
[INFO] Loading wadlGenerator com.sun.jersey.server.wadl.generators.resourcedoc.WadlGeneratorResourceDocSupport
Dec 21, 2015 7:07:55 PM com.sun.jersey.api.core.PackagesResourceConfig init
INFO: Scanning for root resource and provider classes in the packages:
  org.apache.hadoop.chukwa.datacollection.agent.rest
Dec 21, 2015 7:07:55 PM com.sun.jersey.api.core.ScanningResourceConfig logClasses
INFO: Root resource classes found:
  class org.apache.hadoop.chukwa.datacollection.agent.rest.AdaptorController
Dec 21, 2015 7:07:55 PM com.sun.jersey.api.core.ScanningResourceConfig logClasses
INFO: Provider classes found:
  class org.apache.hadoop.chukwa.datacollection.agent.rest.ContextProvider
[INFO] Wrote <https://builds.apache.org/job/Chukwa-master/ws/target/classes/application.wadl>
[INFO] 
[INFO] --- maven-antrun-plugin:1.6:run (test-setup) @ chukwa ---
[INFO] Executing tasks

main:
    [mkdir] Created dir: <https://builds.apache.org/job/Chukwa-master/ws/target/test/conf>
    [mkdir] Created dir: <https://builds.apache.org/job/Chukwa-master/ws/target/test/var>
    [mkdir] Created dir: <https://builds.apache.org/job/Chukwa-master/ws/target/test/var/log>
    [mkdir] Created dir: <https://builds.apache.org/job/Chukwa-master/ws/target/test/var/run>
     [copy] Copying 3 files to <https://builds.apache.org/job/Chukwa-master/ws/target/test/var/log>
     [copy] Copying 1 file to <https://builds.apache.org/job/Chukwa-master/ws/target/test/conf>
     [copy] Copying 1 file to <https://builds.apache.org/job/Chukwa-master/ws/target/test/conf>
     [copy] Copying 1 file to <https://builds.apache.org/job/Chukwa-master/ws/target/test/conf>
     [copy] Copying 1 file to <https://builds.apache.org/job/Chukwa-master/ws/target/test/conf>
     [copy] Copying 1 file to <https://builds.apache.org/job/Chukwa-master/ws/target/test/conf>
     [copy] Copying 1 file to <https://builds.apache.org/job/Chukwa-master/ws/target/test/conf>
     [copy] Copying 1 file to <https://builds.apache.org/job/Chukwa-master/ws/target/test/conf>
[INFO] Executed tasks
[INFO] 
[INFO] --- maven-resources-plugin:2.6:testResources (default-testResources) @ chukwa ---
[INFO] Using 'UTF-8' encoding to copy filtered resources.
[INFO] Copying 0 resource
[INFO] Copying 6 resources
[INFO] 
[INFO] --- maven-compiler-plugin:3.1:testCompile (default-testCompile) @ chukwa ---
[INFO] Changes detected - recompiling the module!
[INFO] Compiling 100 source files to <https://builds.apache.org/job/Chukwa-master/ws/target/test-classes>
[WARNING] <https://builds.apache.org/job/Chukwa-master/ws/src/test/java/org/apache/hadoop/chukwa/datacollection/collector/TestBackpressure.java>:
Some input files use or override a deprecated API.
[WARNING] <https://builds.apache.org/job/Chukwa-master/ws/src/test/java/org/apache/hadoop/chukwa/datacollection/collector/TestBackpressure.java>:
Recompile with -Xlint:deprecation for details.
[WARNING] <https://builds.apache.org/job/Chukwa-master/ws/src/test/java/org/apache/hadoop/chukwa/database/TestDatabaseWebJson.java>:
Some input files use unchecked or unsafe operations.
[WARNING] <https://builds.apache.org/job/Chukwa-master/ws/src/test/java/org/apache/hadoop/chukwa/database/TestDatabaseWebJson.java>:
Recompile with -Xlint:unchecked for details.
[INFO] 
[INFO] --- maven-surefire-plugin:2.18.1:test (default-test) @ chukwa ---
[WARNING] The parameter forkMode is deprecated since version 2.14. Use forkCount and reuseForks
instead.
[INFO] Surefire report directory: <https://builds.apache.org/job/Chukwa-master/ws/target/test-reports>

-------------------------------------------------------
 T E S T S
-------------------------------------------------------
Running org.apache.hadoop.chukwa.dataloader.TestSocketDataLoader
Tests run: 1, Failures: 0, Errors: 0, Skipped: 0, Time elapsed: 120.746 sec - in org.apache.hadoop.chukwa.dataloader.TestSocketDataLoader
Running org.apache.hadoop.chukwa.tools.backfilling.TestBackfillingLoader
Tests run: 4, Failures: 0, Errors: 0, Skipped: 0, Time elapsed: 73.212 sec - in org.apache.hadoop.chukwa.tools.backfilling.TestBackfillingLoader
Running org.apache.hadoop.chukwa.inputtools.TestInputFormat
Tests run: 1, Failures: 0, Errors: 0, Skipped: 0, Time elapsed: 1.203 sec - in org.apache.hadoop.chukwa.inputtools.TestInputFormat
Running org.apache.hadoop.chukwa.inputtools.log4j.TestTaskLogAppender
Tests run: 1, Failures: 0, Errors: 0, Skipped: 0, Time elapsed: 2.162 sec - in org.apache.hadoop.chukwa.inputtools.log4j.TestTaskLogAppender
Running org.apache.hadoop.chukwa.inputtools.log4j.TestChukwaDailyRollingFileAppender
Tests run: 1, Failures: 0, Errors: 0, Skipped: 0, Time elapsed: 2.115 sec - in org.apache.hadoop.chukwa.inputtools.log4j.TestChukwaDailyRollingFileAppender
Running org.apache.hadoop.chukwa.extraction.demux.processor.mapper.TestAbtractProcessor
Tests run: 1, Failures: 0, Errors: 0, Skipped: 0, Time elapsed: 0.132 sec - in org.apache.hadoop.chukwa.extraction.demux.processor.mapper.TestAbtractProcessor
Running org.apache.hadoop.chukwa.extraction.demux.processor.mapper.TestLog4JMetricsContextChukwaRecord
Tests run: 1, Failures: 0, Errors: 0, Skipped: 0, Time elapsed: 0.145 sec - in org.apache.hadoop.chukwa.extraction.demux.processor.mapper.TestLog4JMetricsContextChukwaRecord
Running org.apache.hadoop.chukwa.extraction.demux.processor.mapper.TestTsProcessor
Tests run: 8, Failures: 0, Errors: 0, Skipped: 0, Time elapsed: 0.918 sec - in org.apache.hadoop.chukwa.extraction.demux.processor.mapper.TestTsProcessor
Running org.apache.hadoop.chukwa.extraction.demux.processor.mapper.TestHadoopLogProcessor
Tests run: 1, Failures: 0, Errors: 0, Skipped: 0, Time elapsed: 1.392 sec - in org.apache.hadoop.chukwa.extraction.demux.processor.mapper.TestHadoopLogProcessor
Running org.apache.hadoop.chukwa.extraction.demux.processor.mapper.TestJsonProcessors
Tests run: 7, Failures: 0, Errors: 0, Skipped: 0, Time elapsed: 0.164 sec - in org.apache.hadoop.chukwa.extraction.demux.processor.mapper.TestJsonProcessors
Running org.apache.hadoop.chukwa.extraction.demux.TestDemuxReducerConfigs
Tests run: 2, Failures: 0, Errors: 0, Skipped: 0, Time elapsed: 0.627 sec - in org.apache.hadoop.chukwa.extraction.demux.TestDemuxReducerConfigs
Running org.apache.hadoop.chukwa.extraction.demux.TestPostDemuxTrigger
Tests run: 2, Failures: 0, Errors: 0, Skipped: 0, Time elapsed: 1.053 sec - in org.apache.hadoop.chukwa.extraction.demux.TestPostDemuxTrigger
Running org.apache.hadoop.chukwa.extraction.demux.TestDemuxMapperConfigs
Tests run: 2, Failures: 0, Errors: 0, Skipped: 0, Time elapsed: 0.634 sec - in org.apache.hadoop.chukwa.extraction.demux.TestDemuxMapperConfigs
Running org.apache.hadoop.chukwa.extraction.demux.TestDemux
Tests run: 1, Failures: 0, Errors: 0, Skipped: 0, Time elapsed: 24.137 sec - in org.apache.hadoop.chukwa.extraction.demux.TestDemux
Running org.apache.hadoop.chukwa.TestChunkBuilder
Tests run: 1, Failures: 0, Errors: 0, Skipped: 0, Time elapsed: 0.089 sec - in org.apache.hadoop.chukwa.TestChunkBuilder
Running org.apache.hadoop.chukwa.datacollection.writer.TestHBaseWriter
Tests run: 1, Failures: 0, Errors: 0, Skipped: 0, Time elapsed: 11.48 sec - in org.apache.hadoop.chukwa.datacollection.writer.TestHBaseWriter
Running org.apache.hadoop.chukwa.datacollection.writer.solr.TestSolrWriter
Tests run: 1, Failures: 0, Errors: 0, Skipped: 0, Time elapsed: 1.75 sec - in org.apache.hadoop.chukwa.datacollection.writer.solr.TestSolrWriter
Running org.apache.hadoop.chukwa.datacollection.writer.TestChukwaParquetWriter
Tests run: 2, Failures: 0, Errors: 0, Skipped: 0, Time elapsed: 7.932 sec - in org.apache.hadoop.chukwa.datacollection.writer.TestChukwaParquetWriter
Running org.apache.hadoop.chukwa.datacollection.writer.TestChukwaWriters
Tests run: 2, Failures: 0, Errors: 0, Skipped: 0, Time elapsed: 12.015 sec - in org.apache.hadoop.chukwa.datacollection.writer.TestChukwaWriters
Running org.apache.hadoop.chukwa.datacollection.writer.TestClientAck
Tests run: 1, Failures: 0, Errors: 0, Skipped: 0, Time elapsed: 18.086 sec - in org.apache.hadoop.chukwa.datacollection.writer.TestClientAck
Running org.apache.hadoop.chukwa.datacollection.writer.TestSocketTee
Tests run: 1, Failures: 0, Errors: 0, Skipped: 0, Time elapsed: 0.406 sec - in org.apache.hadoop.chukwa.datacollection.writer.TestSocketTee
Running org.apache.hadoop.chukwa.datacollection.TestOffsetStatsManager
Tests run: 3, Failures: 0, Errors: 0, Skipped: 0, Time elapsed: 13.091 sec - in org.apache.hadoop.chukwa.datacollection.TestOffsetStatsManager
Running org.apache.hadoop.chukwa.datacollection.connector.TestFailedCollector
Tests run: 1, Failures: 0, Errors: 0, Skipped: 0, Time elapsed: 0.508 sec - in org.apache.hadoop.chukwa.datacollection.connector.TestFailedCollector
Running org.apache.hadoop.chukwa.datacollection.agent.TestAgentConfig
Tests run: 2, Failures: 0, Errors: 0, Skipped: 0, Time elapsed: 13.249 sec - in org.apache.hadoop.chukwa.datacollection.agent.TestAgentConfig
Running org.apache.hadoop.chukwa.datacollection.agent.TestChukwaSsl
Tests run: 1, Failures: 0, Errors: 0, Skipped: 0, Time elapsed: 3.112 sec - in org.apache.hadoop.chukwa.datacollection.agent.TestChukwaSsl
Running org.apache.hadoop.chukwa.datacollection.agent.rest.TestAdaptorController
Tests run: 5, Failures: 0, Errors: 0, Skipped: 0, Time elapsed: 4.031 sec - in org.apache.hadoop.chukwa.datacollection.agent.rest.TestAdaptorController
Running org.apache.hadoop.chukwa.datacollection.agent.TestCmd
Tests run: 4, Failures: 0, Errors: 0, Skipped: 0, Time elapsed: 7.097 sec - in org.apache.hadoop.chukwa.datacollection.agent.TestCmd
Running org.apache.hadoop.chukwa.datacollection.agent.TestChunkQueue
Tests run: 2, Failures: 0, Errors: 0, Skipped: 0, Time elapsed: 9.795 sec - in org.apache.hadoop.chukwa.datacollection.agent.TestChunkQueue
Running org.apache.hadoop.chukwa.datacollection.agent.TestAgent
Tests run: 3, Failures: 0, Errors: 0, Skipped: 0, Time elapsed: 163.038 sec - in org.apache.hadoop.chukwa.datacollection.agent.TestAgent
Running org.apache.hadoop.chukwa.datacollection.sender.TestRetryListOfCollectors
Tests run: 2, Failures: 0, Errors: 0, Skipped: 0, Time elapsed: 0.422 sec - in org.apache.hadoop.chukwa.datacollection.sender.TestRetryListOfCollectors
Running org.apache.hadoop.chukwa.datacollection.sender.TestAcksOnFailure
Tests run: 1, Failures: 0, Errors: 0, Skipped: 0, Time elapsed: 3.612 sec - in org.apache.hadoop.chukwa.datacollection.sender.TestAcksOnFailure
Running org.apache.hadoop.chukwa.datacollection.controller.TestAgentClient
Tests run: 1, Failures: 0, Errors: 0, Skipped: 0, Time elapsed: 0.618 sec - in org.apache.hadoop.chukwa.datacollection.controller.TestAgentClient
Running org.apache.hadoop.chukwa.datacollection.collector.TestDelayedAcks
Tests run: 3, Failures: 0, Errors: 0, Skipped: 0, Time elapsed: 45.315 sec - in org.apache.hadoop.chukwa.datacollection.collector.TestDelayedAcks
Running org.apache.hadoop.chukwa.datacollection.collector.TestFailedCollectorAck
Tests run: 1, Failures: 0, Errors: 0, Skipped: 0, Time elapsed: 27.666 sec - in org.apache.hadoop.chukwa.datacollection.collector.TestFailedCollectorAck
Running org.apache.hadoop.chukwa.datacollection.collector.TestAdaptorTimeout
Tests run: 1, Failures: 0, Errors: 0, Skipped: 0, Time elapsed: 37.477 sec - in org.apache.hadoop.chukwa.datacollection.collector.TestAdaptorTimeout
Running org.apache.hadoop.chukwa.datacollection.collector.TestBackpressure
Tests run: 1, Failures: 0, Errors: 0, Skipped: 0, Time elapsed: 41.649 sec - in org.apache.hadoop.chukwa.datacollection.collector.TestBackpressure
Running org.apache.hadoop.chukwa.datacollection.adaptor.TestDirTailingAdaptor
Tests run: 2, Failures: 0, Errors: 0, Skipped: 0, Time elapsed: 23.544 sec - in org.apache.hadoop.chukwa.datacollection.adaptor.TestDirTailingAdaptor
Running org.apache.hadoop.chukwa.datacollection.adaptor.TestFileAdaptor
Tests run: 2, Failures: 0, Errors: 0, Skipped: 0, Time elapsed: 2.531 sec - in org.apache.hadoop.chukwa.datacollection.adaptor.TestFileAdaptor
Running org.apache.hadoop.chukwa.datacollection.adaptor.TestRestAdaptor
Tests run: 1, Failures: 0, Errors: 0, Skipped: 0, Time elapsed: 2.781 sec - in org.apache.hadoop.chukwa.datacollection.adaptor.TestRestAdaptor
Running org.apache.hadoop.chukwa.datacollection.adaptor.TestAddAdaptor
Tests run: 1, Failures: 0, Errors: 0, Skipped: 0, Time elapsed: 3.631 sec - in org.apache.hadoop.chukwa.datacollection.adaptor.TestAddAdaptor
Running org.apache.hadoop.chukwa.datacollection.adaptor.TestUDPAdaptor
Tests run: 1, Failures: 0, Errors: 0, Skipped: 0, Time elapsed: 0.097 sec - in org.apache.hadoop.chukwa.datacollection.adaptor.TestUDPAdaptor
Running org.apache.hadoop.chukwa.datacollection.adaptor.filetailer.TestFileExpirationPolicy
Tests run: 2, Failures: 0, Errors: 0, Skipped: 0, Time elapsed: 101.921 sec - in org.apache.hadoop.chukwa.datacollection.adaptor.filetailer.TestFileExpirationPolicy
Running org.apache.hadoop.chukwa.datacollection.adaptor.filetailer.TestLogRotate
Tests run: 1, Failures: 0, Errors: 0, Skipped: 0, Time elapsed: 9.663 sec - in org.apache.hadoop.chukwa.datacollection.adaptor.filetailer.TestLogRotate
Running org.apache.hadoop.chukwa.datacollection.adaptor.filetailer.TestStartAtOffset
Tests run: 1, Failures: 0, Errors: 0, Skipped: 0, Time elapsed: 0.529 sec - in org.apache.hadoop.chukwa.datacollection.adaptor.filetailer.TestStartAtOffset
Running org.apache.hadoop.chukwa.datacollection.adaptor.filetailer.TestRCheckAdaptor
Tests run: 2, Failures: 0, Errors: 0, Skipped: 0, Time elapsed: 50.602 sec - in org.apache.hadoop.chukwa.datacollection.adaptor.filetailer.TestRCheckAdaptor
Running org.apache.hadoop.chukwa.datacollection.adaptor.filetailer.TestFileTailer
Tests run: 1, Failures: 1, Errors: 0, Skipped: 0, Time elapsed: 2.552 sec <<< FAILURE!
- in org.apache.hadoop.chukwa.datacollection.adaptor.filetailer.TestFileTailer
testDontSleepIfHasMoreData(org.apache.hadoop.chukwa.datacollection.adaptor.filetailer.TestFileTailer)
 Time elapsed: 2.547 sec  <<< FAILURE!
java.lang.AssertionError: null
	at org.junit.Assert.fail(Assert.java:92)
	at org.junit.Assert.assertTrue(Assert.java:43)
	at org.junit.Assert.assertTrue(Assert.java:54)
	at org.apache.hadoop.chukwa.datacollection.adaptor.filetailer.TestFileTailer.testDontSleepIfHasMoreData(TestFileTailer.java:69)

Running org.apache.hadoop.chukwa.datacollection.adaptor.filetailer.TestFileTailingAdaptorBigRecord
Tests run: 1, Failures: 0, Errors: 0, Skipped: 0, Time elapsed: 9.56 sec - in org.apache.hadoop.chukwa.datacollection.adaptor.filetailer.TestFileTailingAdaptorBigRecord
Running org.apache.hadoop.chukwa.datacollection.adaptor.filetailer.TestFileTailingAdaptors
Tests run: 4, Failures: 0, Errors: 0, Skipped: 0, Time elapsed: 15.293 sec - in org.apache.hadoop.chukwa.datacollection.adaptor.filetailer.TestFileTailingAdaptors
Running org.apache.hadoop.chukwa.datacollection.adaptor.filetailer.TestCharFileTailingAdaptorUTF8
Tests run: 1, Failures: 0, Errors: 0, Skipped: 0, Time elapsed: 2.54 sec - in org.apache.hadoop.chukwa.datacollection.adaptor.filetailer.TestCharFileTailingAdaptorUTF8
Running org.apache.hadoop.chukwa.datacollection.adaptor.filetailer.TestRawAdaptor
Tests run: 3, Failures: 0, Errors: 0, Skipped: 0, Time elapsed: 3.927 sec - in org.apache.hadoop.chukwa.datacollection.adaptor.filetailer.TestRawAdaptor
Running org.apache.hadoop.chukwa.datacollection.adaptor.filetailer.TestFileTailingAdaptorPreserveLines
Tests run: 3, Failures: 0, Errors: 0, Skipped: 0, Time elapsed: 4.674 sec - in org.apache.hadoop.chukwa.datacollection.adaptor.filetailer.TestFileTailingAdaptorPreserveLines
Running org.apache.hadoop.chukwa.datacollection.adaptor.TestSyslogAdaptor
Tests run: 1, Failures: 0, Errors: 0, Skipped: 0, Time elapsed: 0.425 sec - in org.apache.hadoop.chukwa.datacollection.adaptor.TestSyslogAdaptor
Running org.apache.hadoop.chukwa.datacollection.adaptor.TestSocketAdaptor
Tests run: 1, Failures: 0, Errors: 0, Skipped: 0, Time elapsed: 14.091 sec - in org.apache.hadoop.chukwa.datacollection.adaptor.TestSocketAdaptor
Running org.apache.hadoop.chukwa.datacollection.adaptor.JMX.TestJMXAdaptor
Tests run: 1, Failures: 0, Errors: 0, Skipped: 0, Time elapsed: 0.757 sec - in org.apache.hadoop.chukwa.datacollection.adaptor.JMX.TestJMXAdaptor
Running org.apache.hadoop.chukwa.datacollection.adaptor.TestExecAdaptor
Tests run: 2, Failures: 0, Errors: 0, Skipped: 0, Time elapsed: 5.933 sec - in org.apache.hadoop.chukwa.datacollection.adaptor.TestExecAdaptor
Running org.apache.hadoop.chukwa.datacollection.adaptor.jms.TestJMSAdaptor
Tests run: 4, Failures: 0, Errors: 0, Skipped: 0, Time elapsed: 4.974 sec - in org.apache.hadoop.chukwa.datacollection.adaptor.jms.TestJMSAdaptor
Running org.apache.hadoop.chukwa.datacollection.adaptor.jms.TestJMSMessagePropertyTransformer
Tests run: 9, Failures: 0, Errors: 0, Skipped: 0, Time elapsed: 10.367 sec - in org.apache.hadoop.chukwa.datacollection.adaptor.jms.TestJMSMessagePropertyTransformer
Running org.apache.hadoop.chukwa.datacollection.adaptor.TestBufferingWrappers
Tests run: 2, Failures: 0, Errors: 0, Skipped: 0, Time elapsed: 8.487 sec - in org.apache.hadoop.chukwa.datacollection.adaptor.TestBufferingWrappers
Running org.apache.hadoop.chukwa.datacollection.adaptor.TestOozieAdaptor
Tests run: 1, Failures: 0, Errors: 0, Skipped: 0, Time elapsed: 1.43 sec - in org.apache.hadoop.chukwa.datacollection.adaptor.TestOozieAdaptor
Running org.apache.hadoop.chukwa.datacollection.adaptor.TestHeartbeatAdaptor
Tests run: 1, Failures: 0, Errors: 0, Skipped: 0, Time elapsed: 10.702 sec - in org.apache.hadoop.chukwa.datacollection.adaptor.TestHeartbeatAdaptor
Running org.apache.hadoop.chukwa.database.TestMacro
Tests run: 2, Failures: 0, Errors: 0, Skipped: 0, Time elapsed: 0.14 sec - in org.apache.hadoop.chukwa.database.TestMacro
Running org.apache.hadoop.chukwa.hicc.TestChart
Tests run: 3, Failures: 0, Errors: 0, Skipped: 0, Time elapsed: 0.006 sec - in org.apache.hadoop.chukwa.hicc.TestChart
Running org.apache.hadoop.chukwa.util.TestDumpChunks
Tests run: 2, Failures: 0, Errors: 0, Skipped: 0, Time elapsed: 1.117 sec - in org.apache.hadoop.chukwa.util.TestDumpChunks
Running org.apache.hadoop.chukwa.util.TestCopySequenceFile
Tests run: 1, Failures: 0, Errors: 0, Skipped: 0, Time elapsed: 1.03 sec - in org.apache.hadoop.chukwa.util.TestCopySequenceFile
Running org.apache.hadoop.chukwa.util.TestXSSFilter
Tests run: 1, Failures: 0, Errors: 0, Skipped: 0, Time elapsed: 0.28 sec - in org.apache.hadoop.chukwa.util.TestXSSFilter
Running org.apache.hadoop.chukwa.util.TestFilter
Tests run: 3, Failures: 0, Errors: 0, Skipped: 0, Time elapsed: 0.099 sec - in org.apache.hadoop.chukwa.util.TestFilter
Running org.apache.hadoop.chukwa.util.TestRecordConsts
Tests run: 2, Failures: 0, Errors: 0, Skipped: 0, Time elapsed: 0.007 sec - in org.apache.hadoop.chukwa.util.TestRecordConsts
Running org.apache.hadoop.chukwa.util.TestCRValidator
Tests run: 3, Failures: 0, Errors: 0, Skipped: 0, Time elapsed: 1.071 sec - in org.apache.hadoop.chukwa.util.TestCRValidator
Running org.apache.hadoop.chukwa.util.TestCreateRecordFile
Tests run: 1, Failures: 0, Errors: 0, Skipped: 0, Time elapsed: 1.34 sec - in org.apache.hadoop.chukwa.util.TestCreateRecordFile

Results :

Failed tests: 
  TestFileTailer.testDontSleepIfHasMoreData:69 null

Tests run: 139, Failures: 1, Errors: 0, Skipped: 0

[INFO] ------------------------------------------------------------------------
[INFO] BUILD FAILURE
[INFO] ------------------------------------------------------------------------
[INFO] Total time: 18:22 min
[INFO] Finished at: 2015-12-21T19:25:50+00:00
[INFO] Final Memory: 59M/633M
[INFO] ------------------------------------------------------------------------
[ERROR] Failed to execute goal org.apache.maven.plugins:maven-surefire-plugin:2.18.1:test
(default-test) on project chukwa: There are test failures.
[ERROR] 
[ERROR] Please refer to <https://builds.apache.org/job/Chukwa-master/ws/target/test-reports>
for the individual test results.
[ERROR] -> [Help 1]
[ERROR] 
[ERROR] To see the full stack trace of the errors, re-run Maven with the -e switch.
[ERROR] Re-run Maven using the -X switch to enable full debug logging.
[ERROR] 
[ERROR] For more information about the errors and possible solutions, please read the following
articles:
[ERROR] [Help 1] http://cwiki.apache.org/confluence/display/MAVEN/MojoFailureException
Build step 'Invoke top-level Maven targets' marked build as failure
Archiving artifacts
Recording test results
Updating CHUKWA-795

Mime
View raw message