chukwa-dev mailing list archives

Site index · List index
Message view « Date » · « Thread »
Top « Date » · « Thread »
From Apache Jenkins Server <jenk...@builds.apache.org>
Subject Build failed in Jenkins: Chukwa-master #534
Date Sun, 11 Oct 2015 20:39:59 GMT
See <https://builds.apache.org/job/Chukwa-master/534/changes>

Changes:

[eyang] CHUKWA-784. Improve CharFileTailingAdaptorUTF8NewLineEscaped and

------------------------------------------
[...truncated 191 lines...]
Tests run: 1, Failures: 0, Errors: 0, Skipped: 0, Time elapsed: 1.417 sec - in org.apache.hadoop.chukwa.datacollection.adaptor.TestOozieAdaptor
Running org.apache.hadoop.chukwa.datacollection.adaptor.jms.TestJMSAdaptor
Tests run: 4, Failures: 0, Errors: 0, Skipped: 0, Time elapsed: 4.87 sec - in org.apache.hadoop.chukwa.datacollection.adaptor.jms.TestJMSAdaptor
Running org.apache.hadoop.chukwa.datacollection.adaptor.jms.TestJMSMessagePropertyTransformer
Tests run: 9, Failures: 0, Errors: 0, Skipped: 0, Time elapsed: 10.318 sec - in org.apache.hadoop.chukwa.datacollection.adaptor.jms.TestJMSMessagePropertyTransformer
Running org.apache.hadoop.chukwa.datacollection.connector.TestFailedCollector
Tests run: 1, Failures: 0, Errors: 0, Skipped: 0, Time elapsed: 0.522 sec - in org.apache.hadoop.chukwa.datacollection.connector.TestFailedCollector
Running org.apache.hadoop.chukwa.datacollection.collector.TestBackpressure
Tests run: 1, Failures: 0, Errors: 0, Skipped: 0, Time elapsed: 41.656 sec - in org.apache.hadoop.chukwa.datacollection.collector.TestBackpressure
Running org.apache.hadoop.chukwa.datacollection.collector.TestAdaptorTimeout
Tests run: 1, Failures: 0, Errors: 0, Skipped: 0, Time elapsed: 37.461 sec - in org.apache.hadoop.chukwa.datacollection.collector.TestAdaptorTimeout
Running org.apache.hadoop.chukwa.datacollection.collector.TestDelayedAcks
Tests run: 3, Failures: 0, Errors: 0, Skipped: 0, Time elapsed: 45.132 sec - in org.apache.hadoop.chukwa.datacollection.collector.TestDelayedAcks
Running org.apache.hadoop.chukwa.datacollection.collector.TestFailedCollectorAck
Tests run: 1, Failures: 0, Errors: 0, Skipped: 0, Time elapsed: 27.605 sec - in org.apache.hadoop.chukwa.datacollection.collector.TestFailedCollectorAck
Running org.apache.hadoop.chukwa.datacollection.controller.TestAgentClient
Tests run: 1, Failures: 0, Errors: 0, Skipped: 0, Time elapsed: 0.55 sec - in org.apache.hadoop.chukwa.datacollection.controller.TestAgentClient
Running org.apache.hadoop.chukwa.datacollection.agent.TestChunkQueue
Tests run: 2, Failures: 0, Errors: 0, Skipped: 0, Time elapsed: 9.774 sec - in org.apache.hadoop.chukwa.datacollection.agent.TestChunkQueue
Running org.apache.hadoop.chukwa.datacollection.agent.TestChukwaSsl
Tests run: 1, Failures: 0, Errors: 0, Skipped: 0, Time elapsed: 2.972 sec - in org.apache.hadoop.chukwa.datacollection.agent.TestChukwaSsl
Running org.apache.hadoop.chukwa.datacollection.agent.TestAgent
Tests run: 3, Failures: 0, Errors: 0, Skipped: 0, Time elapsed: 163.115 sec - in org.apache.hadoop.chukwa.datacollection.agent.TestAgent
Running org.apache.hadoop.chukwa.datacollection.agent.TestCmd
Tests run: 4, Failures: 0, Errors: 0, Skipped: 0, Time elapsed: 7.136 sec - in org.apache.hadoop.chukwa.datacollection.agent.TestCmd
Running org.apache.hadoop.chukwa.datacollection.agent.rest.TestAdaptorController
Tests run: 5, Failures: 0, Errors: 0, Skipped: 0, Time elapsed: 4.027 sec - in org.apache.hadoop.chukwa.datacollection.agent.rest.TestAdaptorController
Running org.apache.hadoop.chukwa.datacollection.agent.TestAgentConfig
Tests run: 2, Failures: 0, Errors: 0, Skipped: 0, Time elapsed: 13.268 sec - in org.apache.hadoop.chukwa.datacollection.agent.TestAgentConfig
Running org.apache.hadoop.chukwa.database.TestMacro
Tests run: 2, Failures: 0, Errors: 0, Skipped: 0, Time elapsed: 0.142 sec - in org.apache.hadoop.chukwa.database.TestMacro
Running org.apache.hadoop.chukwa.util.TestCopySequenceFile
Tests run: 1, Failures: 0, Errors: 0, Skipped: 0, Time elapsed: 1.091 sec - in org.apache.hadoop.chukwa.util.TestCopySequenceFile
Running org.apache.hadoop.chukwa.util.TestCreateRecordFile
Tests run: 1, Failures: 0, Errors: 0, Skipped: 0, Time elapsed: 1.176 sec - in org.apache.hadoop.chukwa.util.TestCreateRecordFile
Running org.apache.hadoop.chukwa.util.TestDumpChunks
Tests run: 2, Failures: 0, Errors: 0, Skipped: 0, Time elapsed: 1.006 sec - in org.apache.hadoop.chukwa.util.TestDumpChunks
Running org.apache.hadoop.chukwa.util.TestRecordConsts
Tests run: 2, Failures: 0, Errors: 0, Skipped: 0, Time elapsed: 0.007 sec - in org.apache.hadoop.chukwa.util.TestRecordConsts
Running org.apache.hadoop.chukwa.util.TestFilter
Tests run: 3, Failures: 0, Errors: 0, Skipped: 0, Time elapsed: 0.098 sec - in org.apache.hadoop.chukwa.util.TestFilter
Running org.apache.hadoop.chukwa.util.TestCRValidator
Tests run: 3, Failures: 0, Errors: 0, Skipped: 0, Time elapsed: 1.021 sec - in org.apache.hadoop.chukwa.util.TestCRValidator
Running org.apache.hadoop.chukwa.util.TestXSSFilter
Tests run: 1, Failures: 0, Errors: 0, Skipped: 0, Time elapsed: 0.259 sec - in org.apache.hadoop.chukwa.util.TestXSSFilter
Running org.apache.hadoop.chukwa.tools.backfilling.TestBackfillingLoader
Tests run: 4, Failures: 0, Errors: 0, Skipped: 0, Time elapsed: 72.79 sec - in org.apache.hadoop.chukwa.tools.backfilling.TestBackfillingLoader
Running org.apache.hadoop.chukwa.extraction.demux.TestDemux
Tests run: 1, Failures: 0, Errors: 0, Skipped: 0, Time elapsed: 23.783 sec - in org.apache.hadoop.chukwa.extraction.demux.TestDemux
Running org.apache.hadoop.chukwa.extraction.demux.TestDemuxReducerConfigs
Tests run: 2, Failures: 0, Errors: 0, Skipped: 0, Time elapsed: 0.627 sec - in org.apache.hadoop.chukwa.extraction.demux.TestDemuxReducerConfigs
Running org.apache.hadoop.chukwa.extraction.demux.processor.mapper.TestTsProcessor
Tests run: 8, Failures: 0, Errors: 0, Skipped: 0, Time elapsed: 0.907 sec - in org.apache.hadoop.chukwa.extraction.demux.processor.mapper.TestTsProcessor
Running org.apache.hadoop.chukwa.extraction.demux.processor.mapper.TestHadoopLogProcessor
Tests run: 1, Failures: 0, Errors: 0, Skipped: 0, Time elapsed: 1.388 sec - in org.apache.hadoop.chukwa.extraction.demux.processor.mapper.TestHadoopLogProcessor
Running org.apache.hadoop.chukwa.extraction.demux.processor.mapper.TestLog4JMetricsContextChukwaRecord
Tests run: 1, Failures: 0, Errors: 0, Skipped: 0, Time elapsed: 0.147 sec - in org.apache.hadoop.chukwa.extraction.demux.processor.mapper.TestLog4JMetricsContextChukwaRecord
Running org.apache.hadoop.chukwa.extraction.demux.processor.mapper.TestAbtractProcessor
Tests run: 1, Failures: 0, Errors: 0, Skipped: 0, Time elapsed: 0.132 sec - in org.apache.hadoop.chukwa.extraction.demux.processor.mapper.TestAbtractProcessor
Running org.apache.hadoop.chukwa.extraction.demux.processor.mapper.TestJsonProcessors
Tests run: 7, Failures: 0, Errors: 0, Skipped: 0, Time elapsed: 0.164 sec - in org.apache.hadoop.chukwa.extraction.demux.processor.mapper.TestJsonProcessors
Running org.apache.hadoop.chukwa.extraction.demux.TestPostDemuxTrigger
Tests run: 2, Failures: 0, Errors: 0, Skipped: 0, Time elapsed: 1 sec - in org.apache.hadoop.chukwa.extraction.demux.TestPostDemuxTrigger
Running org.apache.hadoop.chukwa.extraction.demux.TestDemuxMapperConfigs
Tests run: 2, Failures: 0, Errors: 0, Skipped: 0, Time elapsed: 0.62 sec - in org.apache.hadoop.chukwa.extraction.demux.TestDemuxMapperConfigs
Running org.apache.hadoop.chukwa.TestChunkBuilder
Tests run: 1, Failures: 0, Errors: 0, Skipped: 0, Time elapsed: 0.09 sec - in org.apache.hadoop.chukwa.TestChunkBuilder
Running org.apache.hadoop.chukwa.dataloader.TestSocketDataLoader
Tests run: 1, Failures: 0, Errors: 0, Skipped: 0, Time elapsed: 120.58 sec - in org.apache.hadoop.chukwa.dataloader.TestSocketDataLoader
Running org.apache.hadoop.chukwa.inputtools.log4j.TestTaskLogAppender
Tests run: 1, Failures: 0, Errors: 0, Skipped: 0, Time elapsed: 2.154 sec - in org.apache.hadoop.chukwa.inputtools.log4j.TestTaskLogAppender
Running org.apache.hadoop.chukwa.inputtools.log4j.TestChukwaDailyRollingFileAppender
Tests run: 1, Failures: 0, Errors: 0, Skipped: 0, Time elapsed: 2.116 sec - in org.apache.hadoop.chukwa.inputtools.log4j.TestChukwaDailyRollingFileAppender
Running org.apache.hadoop.chukwa.inputtools.TestInputFormat
Tests run: 1, Failures: 0, Errors: 0, Skipped: 0, Time elapsed: 1.118 sec - in org.apache.hadoop.chukwa.inputtools.TestInputFormat
Running org.apache.hadoop.chukwa.hicc.TestChart
Tests run: 3, Failures: 0, Errors: 0, Skipped: 0, Time elapsed: 0.007 sec - in org.apache.hadoop.chukwa.hicc.TestChart

Results :

Tests run: 139, Failures: 0, Errors: 0, Skipped: 0

[INFO] 
[INFO] --- maven-jar-plugin:2.3.1:jar (core) @ chukwa ---
[INFO] Building jar: <https://builds.apache.org/job/Chukwa-master/ws/target/chukwa-0.7.0-SNAPSHOT.jar>
[INFO] 
[INFO] --- maven-source-plugin:2.1.1:jar-no-fork (default) @ chukwa ---
[INFO] Building jar: <https://builds.apache.org/job/Chukwa-master/ws/target/chukwa-0.7.0-SNAPSHOT-sources.jar>
[INFO] 
[INFO] --- maven-jar-plugin:2.3.1:jar (default-jar) @ chukwa ---
[INFO] 
[INFO] --- maven-jar-plugin:2.3.1:test-jar (test) @ chukwa ---
[INFO] Building jar: <https://builds.apache.org/job/Chukwa-master/ws/target/chukwa-0.7.0-SNAPSHOT-tests.jar>
[INFO] 
[INFO] --- maven-jar-plugin:2.3.1:jar (client) @ chukwa ---
[INFO] Building jar: <https://builds.apache.org/job/Chukwa-master/ws/target/chukwa-0.7.0-SNAPSHOT-client.jar>
[INFO] 
[INFO] --- maven-war-plugin:2.1.1:war (build-hicc) @ chukwa ---
[INFO] Packaging webapp
[INFO] Assembling webapp [chukwa] in [<https://builds.apache.org/job/Chukwa-master/ws/target/hicc]>
[INFO] Processing war project
[INFO] Copying webapp resources [<https://builds.apache.org/job/Chukwa-master/ws/src/main/web/hicc]>
[INFO] Webapp assembled in [1881 msecs]
[INFO] Building war: <https://builds.apache.org/job/Chukwa-master/ws/target/hicc.war>
[INFO] WEB-INF/web.xml already added, skipping
[INFO] 
[INFO] --- maven-assembly-plugin:2.2-beta-5:single (build-tarball) @ chukwa ---
[INFO] Reading assembly descriptor: src/packages/tarball/all.xml
[INFO] Building tar : <https://builds.apache.org/job/Chukwa-master/ws/target/chukwa-0.7.0.tar.gz>
[INFO] 
[INFO] --- exec-maven-plugin:1.1:exec (exec-xsltproc: target/application.html) @ chukwa ---
[INFO] compilation error: file src/main/webapps/wadl.xsl line 25 element stylesheet
[INFO] xsl:version: only 1.0 features are supported
[INFO] 
[INFO] --- maven-surefire-plugin:2.18.1:test (default) @ chukwa ---
[WARNING] The parameter forkMode is deprecated since version 2.14. Use forkCount and reuseForks
instead.
[INFO] 
[INFO] --- apache-rat-plugin:0.11:check (default) @ chukwa ---
[INFO] 51 implicit excludes (use -debug for more details).
[INFO] Exclude: CHANGES.txt
[INFO] Exclude: README.md
[INFO] Exclude: bin/VERSION
[INFO] Exclude: **/target/**
[INFO] Exclude: **/.classpath
[INFO] Exclude: **/.project
[INFO] Exclude: **/.settings/**
[INFO] Exclude: conf/agents
[INFO] Exclude: conf/alert
[INFO] Exclude: conf/auth.conf
[INFO] Exclude: conf/collectors
[INFO] Exclude: conf/hbase.schema
[INFO] Exclude: conf/initial_adaptors
[INFO] Exclude: conf/jmxremote.access
[INFO] Exclude: conf/jmxremote.password
[INFO] Exclude: contrib/solr/logs/conf/_schema_analysis_stopwords_english.json
[INFO] Exclude: contrib/solr/logs/conf/_schema_analysis_synonyms_english.json
[INFO] Exclude: src/main/web/hicc/descriptors/**
[INFO] Exclude: src/main/web/hicc/views/**
[INFO] Exclude: src/test/resources/Hadoop18JobHistoryLog.txt
[INFO] Exclude: src/test/resources/TestJobLog.txt
[INFO] Exclude: test/samples/ClientTrace.log
[INFO] Exclude: test/samples/Iostat.log
[INFO] Exclude: test/samples/JobHistory.log
[INFO] Exclude: contrib/solr/logs/conf/lang/stopwords_da.txt
[INFO] Exclude: contrib/solr/logs/conf/lang/stopwords_de.txt
[INFO] Exclude: contrib/solr/logs/conf/lang/stopwords_es.txt
[INFO] Exclude: contrib/solr/logs/conf/lang/stopwords_fa.txt
[INFO] Exclude: contrib/solr/logs/conf/lang/stopwords_fi.txt
[INFO] Exclude: contrib/solr/logs/conf/lang/stopwords_fr.txt
[INFO] Exclude: contrib/solr/logs/conf/lang/stopwords_hi.txt
[INFO] Exclude: contrib/solr/logs/conf/lang/stopwords_hu.txt
[INFO] Exclude: contrib/solr/logs/conf/lang/stopwords_it.txt
[INFO] Exclude: contrib/solr/logs/conf/lang/stopwords_nl.txt
[INFO] Exclude: contrib/solr/logs/conf/lang/stopwords_no.txt
[INFO] Exclude: contrib/solr/logs/conf/lang/stopwords_pt.txt
[INFO] Exclude: contrib/solr/logs/conf/lang/stopwords_ru.txt
[INFO] Exclude: contrib/solr/logs/conf/lang/stopwords_sv.txt
[INFO] Exclude: src/main/web/hicc/js/jquery*
[INFO] Exclude: src/main/web/hicc/home/js/jquery.js
[INFO] Exclude: src/main/web/hicc/css/jquery.circliful.css
[INFO] Exclude: src/main/web/hicc/css/iui.css
[INFO] Exclude: src/main/web/hicc/js/behaviour.js
[INFO] Exclude: src/main/web/hicc/js/heatmap.js
[INFO] Exclude: src/main/web/hicc/js/iui.js
[INFO] Exclude: src/main/web/hicc/js/yahoo-dom-event.js
[INFO] Exclude: src/main/web/hicc/js/treeview-min.js
[INFO] Exclude: src/main/resources/ESAPI.properties
[INFO] Exclude: contrib/solr/logs/conf/velocity/jquery.autocomplete.js
[INFO] Exclude: src/main/web/hicc/css/flexigrid/flexigrid.css
[INFO] Exclude: src/main/web/hicc/css/timeline.css
[INFO] Exclude: src/main/web/hicc/lib/timeline/**
[INFO] Exclude: lib/agent.dict
[INFO] Exclude: lib/collector.dict
[INFO] Exclude: lib/confspellcheck-README
[INFO] Exclude: lib/json-README.txt
[INFO] Exclude: src/main/web/hicc/js/ajaxtree.js
[INFO] Exclude: src/main/web/hicc/js/flexigrid.js
[INFO] Exclude: src/main/web/hicc/js/flexigrid.pack.js
[INFO] Exclude: src/main/web/hicc/js/workspace/builder.js
[INFO] Exclude: src/main/web/hicc/js/workspace/controls.js
[INFO] Exclude: src/main/web/hicc/js/workspace/dragdrop.js
[INFO] Exclude: src/main/web/hicc/js/workspace/effects.js
[INFO] Exclude: src/main/web/hicc/js/workspace/scriptaculous.js
[INFO] Exclude: src/main/web/hicc/js/workspace/slider.js
[INFO] Exclude: src/main/web/hicc/js/workspace/sound.js
[INFO] Exclude: src/main/web/hicc/js/org/tool-man/*
[INFO] Exclude: src/main/web/hicc/js/timeframe.js
[INFO] Exclude: src/main/web/hicc/js/workspace/prototype.js
[INFO] Exclude: src/main/web/hicc/js/jquery.flot.pack.js
[INFO] Exclude: src/main/web/hicc/js/gsv.js
[INFO] Exclude: src/main/web/hicc/js/bootstrap.min.js
[INFO] Exclude: src/main/web/hicc/js/js-cookie.js
[INFO] Exclude: src/main/web/hicc/css/bootstrap-theme.css.map
[INFO] Exclude: src/main/web/hicc/css/bootstrap-theme.min.css
[INFO] Exclude: src/main/web/hicc/css/bootstrap.min.css
[INFO] Exclude: src/main/web/hicc/fonts/glyphicons-halflings-regular.svg
[INFO] Exclude: src/main/web/hicc/home/js/jquery.gridster.min.js
[INFO] Exclude: src/main/web/hicc/home/js/jquery.gridster.with-extras.min.js
[INFO] Exclude: src/main/web/hicc/home/css/jquery.gridster.css
[INFO] Exclude: src/main/web/hicc/home/css/jquery.gridster.min.css
[INFO] Exclude: src/main/web/hicc/home/js/typeahead.bundle.js
[INFO] Exclude: src/main/web/hicc/home/js/classie.js
[INFO] Exclude: src/main/web/hicc/home/js/gnmenu.js
[INFO] Exclude: src/main/web/hicc/home/js/modernizr.custom.js
[INFO] Exclude: src/main/web/hicc/ajax-solr/chukwa/css/jquery-ui.min.css
[INFO] Exclude: src/main/web/hicc/ajax-solr/chukwa/css/jquery-ui.structure.min.css
[INFO] Exclude: src/main/web/hicc/ajax-solr/chukwa/css/jquery-ui.theme.min.css
[INFO] Exclude: src/main/web/hicc/ajax-solr/chukwa/js/jquery-ui.min.js
[INFO] Exclude: src/main/web/hicc/ajax-solr/chukwa/js/require.min.js
[INFO] Exclude: src/main/web/hicc/home/css/select2.min.css
[INFO] Exclude: src/main/web/hicc/home/js/select2.min.js
[INFO] Exclude: src/main/web/hicc/css/font-awesome.min.css
[INFO] Exclude: src/main/web/hicc/js/autoHeight.js
[INFO] Exclude: src/main/web/hicc/js/base64.js
[INFO] Exclude: src/main/web/hicc/js/canvas2image.js
[INFO] Exclude: src/main/web/hicc/js/json.js
[INFO] Exclude: src/main/web/hicc/home/fonts/codropsicons/*
[INFO] Exclude: src/main/web/hicc/home/fonts/ecoicons/*
[INFO] Exclude: src/main/web/hicc/css/chartist.css
[INFO] Exclude: src/main/web/hicc/css/chartist.css.map
[INFO] Exclude: src/main/web/hicc/js/chartist.min.js
[INFO] Exclude: src/main/web/hicc/js/chartist.min.js.map
[INFO] 866 resources included (use -debug for more details)
Warning:  org.apache.xerces.jaxp.SAXParserImpl$JAXPSAXParser: Property 'http://www.oracle.com/xml/jaxp/properties/entityExpansionLimit'
is not recognized.
Compiler warnings:
  WARNING:  'org.apache.xerces.jaxp.SAXParserImpl: Property 'http://javax.xml.XMLConstants/property/accessExternalDTD'
is not recognized.'
Warning:  org.apache.xerces.parsers.SAXParser: Feature 'http://javax.xml.XMLConstants/feature/secure-processing'
is not recognized.
Warning:  org.apache.xerces.parsers.SAXParser: Property 'http://javax.xml.XMLConstants/property/accessExternalDTD'
is not recognized.
Warning:  org.apache.xerces.parsers.SAXParser: Property 'http://www.oracle.com/xml/jaxp/properties/entityExpansionLimit'
is not recognized.
[INFO] Rat check: Summary of files. Unapproved: 1 unknown: 1 generated: 0 approved: 726 licence.
[INFO] ------------------------------------------------------------------------
[INFO] BUILD FAILURE
[INFO] ------------------------------------------------------------------------
[INFO] Total time: 18:38 min
[INFO] Finished at: 2015-10-11T20:40:39+00:00
[INFO] Final Memory: 72M/1128M
[INFO] ------------------------------------------------------------------------
[ERROR] Failed to execute goal org.apache.rat:apache-rat-plugin:0.11:check (default) on project
chukwa: Too many files with unapproved license: 1 See RAT report in: <https://builds.apache.org/job/Chukwa-master/ws/target/rat.txt>
-> [Help 1]
[ERROR] 
[ERROR] To see the full stack trace of the errors, re-run Maven with the -e switch.
[ERROR] Re-run Maven using the -X switch to enable full debug logging.
[ERROR] 
[ERROR] For more information about the errors and possible solutions, please read the following
articles:
[ERROR] [Help 1] http://cwiki.apache.org/confluence/display/MAVEN/MojoFailureException
Build step 'Invoke top-level Maven targets' marked build as failure
Archiving artifacts
Recording test results
ERROR: Publisher 'Publish JUnit test result report' failed: No test report files were found.
Configuration error?
Updating CHUKWA-784

Mime
View raw message