chukwa-dev mailing list archives

Site index · List index
Message view « Date » · « Thread »
Top « Date » · « Thread »
From Apache Jenkins Server <jenk...@builds.apache.org>
Subject Build failed in Jenkins: Chukwa-master #531
Date Sat, 26 Sep 2015 23:25:37 GMT
See <https://builds.apache.org/job/Chukwa-master/531/changes>

Changes:

[eyang] CHUKWA-783 Update documentation within the Quickstart to ease publication

------------------------------------------
[...truncated 54 lines...]
[WARNING] <https://builds.apache.org/job/Chukwa-master/ws/src/main/java/org/apache/hadoop/chukwa/extraction/engine/ChukwaRecordJT.java>:
Recompile with -Xlint:unchecked for details.
[INFO] 
[INFO] >>> maven-javadoc-plugin:2.10.1:javadoc (agent-public-api) @ chukwa >>>
[INFO] 
[INFO] --- maven-antrun-plugin:1.6:run (setup) @ chukwa ---
[INFO] Executing tasks

main:
[INFO] Executed tasks
[INFO] 
[INFO] <<< maven-javadoc-plugin:2.10.1:javadoc (agent-public-api) @ chukwa <<<
[INFO] 
[INFO] --- maven-javadoc-plugin:2.10.1:javadoc (agent-public-api) @ chukwa ---
[INFO] 
Loading source files for package org.apache.hadoop.chukwa.datacollection.agent.rest...
Constructing Javadoc information...
[WARNING] Javadoc Warnings
[WARNING] Sep 26, 2015 11:07:58 PM com.sun.jersey.wadl.resourcedoc.ResourceDocletJSON start
[WARNING] INFO: Wrote <https://builds.apache.org/job/Chukwa-master/ws/target/classes/agent-rest.xml>
[INFO] 
[INFO] --- maven-wadl-plugin:1.8:generate (generate) @ chukwa ---
[INFO] Loading wadlGenerator com.sun.jersey.server.wadl.generators.WadlGeneratorApplicationDoc
[INFO] Loading wadlGenerator com.sun.jersey.server.wadl.generators.WadlGeneratorGrammarsSupport
[INFO] Loading wadlGenerator com.sun.jersey.server.wadl.generators.resourcedoc.WadlGeneratorResourceDocSupport
Finding class org.apache.xerces.jaxp.datatype.DatatypeFactoryImpl
Finding class org.apache.xerces.jaxp.datatype.XMLGregorianCalendarImpl
Finding class org.apache.xerces.jaxp.datatype.DurationImpl
Sep 26, 2015 11:07:59 PM com.sun.jersey.api.core.PackagesResourceConfig init
INFO: Scanning for root resource and provider classes in the packages:
  org.apache.hadoop.chukwa.datacollection.agent.rest
Sep 26, 2015 11:07:59 PM com.sun.jersey.api.core.ScanningResourceConfig logClasses
INFO: Root resource classes found:
  class org.apache.hadoop.chukwa.datacollection.agent.rest.AdaptorController
Sep 26, 2015 11:07:59 PM com.sun.jersey.api.core.ScanningResourceConfig logClasses
INFO: Provider classes found:
  class org.apache.hadoop.chukwa.datacollection.agent.rest.ContextProvider
[INFO] Wrote <https://builds.apache.org/job/Chukwa-master/ws/target/classes/application.wadl>
[INFO] 
[INFO] --- maven-antrun-plugin:1.6:run (test-setup) @ chukwa ---
[INFO] Executing tasks

main:
    [mkdir] Created dir: <https://builds.apache.org/job/Chukwa-master/ws/target/test/conf>
    [mkdir] Created dir: <https://builds.apache.org/job/Chukwa-master/ws/target/test/var>
    [mkdir] Created dir: <https://builds.apache.org/job/Chukwa-master/ws/target/test/var/log>
    [mkdir] Created dir: <https://builds.apache.org/job/Chukwa-master/ws/target/test/var/run>
     [copy] Copying 3 files to <https://builds.apache.org/job/Chukwa-master/ws/target/test/var/log>
     [copy] Copying 1 file to <https://builds.apache.org/job/Chukwa-master/ws/target/test/conf>
     [copy] Copying 1 file to <https://builds.apache.org/job/Chukwa-master/ws/target/test/conf>
     [copy] Copying 1 file to <https://builds.apache.org/job/Chukwa-master/ws/target/test/conf>
     [copy] Copying 1 file to <https://builds.apache.org/job/Chukwa-master/ws/target/test/conf>
     [copy] Copying 1 file to <https://builds.apache.org/job/Chukwa-master/ws/target/test/conf>
     [copy] Copying 1 file to <https://builds.apache.org/job/Chukwa-master/ws/target/test/conf>
     [copy] Copying 1 file to <https://builds.apache.org/job/Chukwa-master/ws/target/test/conf>
[INFO] Executed tasks
[INFO] 
[INFO] --- maven-resources-plugin:2.6:testResources (default-testResources) @ chukwa ---
[INFO] Using 'UTF-8' encoding to copy filtered resources.
[INFO] Copying 0 resource
[INFO] Copying 6 resources
[INFO] 
[INFO] --- maven-compiler-plugin:3.1:testCompile (default-testCompile) @ chukwa ---
[INFO] Changes detected - recompiling the module!
[INFO] Compiling 100 source files to <https://builds.apache.org/job/Chukwa-master/ws/target/test-classes>
[WARNING] <https://builds.apache.org/job/Chukwa-master/ws/src/test/java/org/apache/hadoop/chukwa/datacollection/collector/TestBackpressure.java>:
Some input files use or override a deprecated API.
[WARNING] <https://builds.apache.org/job/Chukwa-master/ws/src/test/java/org/apache/hadoop/chukwa/datacollection/collector/TestBackpressure.java>:
Recompile with -Xlint:deprecation for details.
[WARNING] <https://builds.apache.org/job/Chukwa-master/ws/src/test/java/org/apache/hadoop/chukwa/database/TestDatabaseWebJson.java>:
Some input files use unchecked or unsafe operations.
[WARNING] <https://builds.apache.org/job/Chukwa-master/ws/src/test/java/org/apache/hadoop/chukwa/database/TestDatabaseWebJson.java>:
Recompile with -Xlint:unchecked for details.
[INFO] 
[INFO] --- maven-surefire-plugin:2.18.1:test (default-test) @ chukwa ---
[WARNING] The parameter forkMode is deprecated since version 2.14. Use forkCount and reuseForks
instead.
[INFO] Surefire report directory: <https://builds.apache.org/job/Chukwa-master/ws/target/test-reports>

-------------------------------------------------------
 T E S T S
-------------------------------------------------------
Running org.apache.hadoop.chukwa.datacollection.sender.TestAcksOnFailure
Tests run: 1, Failures: 0, Errors: 0, Skipped: 0, Time elapsed: 3.701 sec - in org.apache.hadoop.chukwa.datacollection.sender.TestAcksOnFailure
Running org.apache.hadoop.chukwa.datacollection.sender.TestRetryListOfCollectors
Tests run: 2, Failures: 0, Errors: 0, Skipped: 0, Time elapsed: 0.42 sec - in org.apache.hadoop.chukwa.datacollection.sender.TestRetryListOfCollectors
Running org.apache.hadoop.chukwa.datacollection.writer.TestClientAck
Tests run: 1, Failures: 0, Errors: 0, Skipped: 0, Time elapsed: 18.086 sec - in org.apache.hadoop.chukwa.datacollection.writer.TestClientAck
Running org.apache.hadoop.chukwa.datacollection.writer.solr.TestSolrWriter
Tests run: 1, Failures: 0, Errors: 0, Skipped: 0, Time elapsed: 1.979 sec - in org.apache.hadoop.chukwa.datacollection.writer.solr.TestSolrWriter
Running org.apache.hadoop.chukwa.datacollection.writer.TestSocketTee
Tests run: 1, Failures: 0, Errors: 0, Skipped: 0, Time elapsed: 0.404 sec - in org.apache.hadoop.chukwa.datacollection.writer.TestSocketTee
Running org.apache.hadoop.chukwa.datacollection.writer.TestChukwaParquetWriter
Tests run: 2, Failures: 0, Errors: 0, Skipped: 0, Time elapsed: 8.067 sec - in org.apache.hadoop.chukwa.datacollection.writer.TestChukwaParquetWriter
Running org.apache.hadoop.chukwa.datacollection.writer.TestHBaseWriter
Tests run: 1, Failures: 0, Errors: 0, Skipped: 0, Time elapsed: 11.682 sec - in org.apache.hadoop.chukwa.datacollection.writer.TestHBaseWriter
Running org.apache.hadoop.chukwa.datacollection.writer.TestChukwaWriters
Tests run: 3, Failures: 0, Errors: 0, Skipped: 0, Time elapsed: 24.182 sec - in org.apache.hadoop.chukwa.datacollection.writer.TestChukwaWriters
Running org.apache.hadoop.chukwa.datacollection.TestOffsetStatsManager
Tests run: 3, Failures: 0, Errors: 0, Skipped: 0, Time elapsed: 13.09 sec - in org.apache.hadoop.chukwa.datacollection.TestOffsetStatsManager
Running org.apache.hadoop.chukwa.datacollection.adaptor.TestRestAdaptor
Tests run: 1, Failures: 0, Errors: 0, Skipped: 0, Time elapsed: 2.963 sec - in org.apache.hadoop.chukwa.datacollection.adaptor.TestRestAdaptor
Running org.apache.hadoop.chukwa.datacollection.adaptor.TestFileAdaptor
Tests run: 2, Failures: 0, Errors: 0, Skipped: 0, Time elapsed: 3.433 sec - in org.apache.hadoop.chukwa.datacollection.adaptor.TestFileAdaptor
Running org.apache.hadoop.chukwa.datacollection.adaptor.JMX.TestJMXAdaptor
Tests run: 1, Failures: 0, Errors: 0, Skipped: 0, Time elapsed: 0.736 sec - in org.apache.hadoop.chukwa.datacollection.adaptor.JMX.TestJMXAdaptor
Running org.apache.hadoop.chukwa.datacollection.adaptor.TestAddAdaptor
Tests run: 1, Failures: 0, Errors: 0, Skipped: 0, Time elapsed: 3.647 sec - in org.apache.hadoop.chukwa.datacollection.adaptor.TestAddAdaptor
Running org.apache.hadoop.chukwa.datacollection.adaptor.TestExecAdaptor
Tests run: 2, Failures: 0, Errors: 0, Skipped: 0, Time elapsed: 5.863 sec - in org.apache.hadoop.chukwa.datacollection.adaptor.TestExecAdaptor
Running org.apache.hadoop.chukwa.datacollection.adaptor.filetailer.TestFileTailingAdaptorBigRecord
Tests run: 1, Failures: 0, Errors: 0, Skipped: 0, Time elapsed: 8.696 sec - in org.apache.hadoop.chukwa.datacollection.adaptor.filetailer.TestFileTailingAdaptorBigRecord
Running org.apache.hadoop.chukwa.datacollection.adaptor.filetailer.TestFileExpirationPolicy
Tests run: 2, Failures: 0, Errors: 0, Skipped: 0, Time elapsed: 101.949 sec - in org.apache.hadoop.chukwa.datacollection.adaptor.filetailer.TestFileExpirationPolicy
Running org.apache.hadoop.chukwa.datacollection.adaptor.filetailer.TestFileTailingAdaptorPreserveLines
Tests run: 3, Failures: 0, Errors: 0, Skipped: 0, Time elapsed: 4.692 sec - in org.apache.hadoop.chukwa.datacollection.adaptor.filetailer.TestFileTailingAdaptorPreserveLines
Running org.apache.hadoop.chukwa.datacollection.adaptor.filetailer.TestFileTailingAdaptors
Tests run: 4, Failures: 0, Errors: 0, Skipped: 0, Time elapsed: 15.282 sec - in org.apache.hadoop.chukwa.datacollection.adaptor.filetailer.TestFileTailingAdaptors
Running org.apache.hadoop.chukwa.datacollection.adaptor.filetailer.TestLogRotate
Tests run: 1, Failures: 0, Errors: 0, Skipped: 0, Time elapsed: 9.629 sec - in org.apache.hadoop.chukwa.datacollection.adaptor.filetailer.TestLogRotate
Running org.apache.hadoop.chukwa.datacollection.adaptor.filetailer.TestRawAdaptor
Tests run: 3, Failures: 0, Errors: 0, Skipped: 0, Time elapsed: 3.95 sec - in org.apache.hadoop.chukwa.datacollection.adaptor.filetailer.TestRawAdaptor
Running org.apache.hadoop.chukwa.datacollection.adaptor.filetailer.TestFileTailer
Tests run: 1, Failures: 0, Errors: 0, Skipped: 0, Time elapsed: 0.687 sec - in org.apache.hadoop.chukwa.datacollection.adaptor.filetailer.TestFileTailer
Running org.apache.hadoop.chukwa.datacollection.adaptor.filetailer.TestRCheckAdaptor
Tests run: 2, Failures: 0, Errors: 0, Skipped: 0, Time elapsed: 49.834 sec - in org.apache.hadoop.chukwa.datacollection.adaptor.filetailer.TestRCheckAdaptor
Running org.apache.hadoop.chukwa.datacollection.adaptor.filetailer.TestCharFileTailingAdaptorUTF8
Tests run: 1, Failures: 0, Errors: 0, Skipped: 0, Time elapsed: 2.533 sec - in org.apache.hadoop.chukwa.datacollection.adaptor.filetailer.TestCharFileTailingAdaptorUTF8
Running org.apache.hadoop.chukwa.datacollection.adaptor.filetailer.TestStartAtOffset
Tests run: 1, Failures: 0, Errors: 0, Skipped: 0, Time elapsed: 0.529 sec - in org.apache.hadoop.chukwa.datacollection.adaptor.filetailer.TestStartAtOffset
Running org.apache.hadoop.chukwa.datacollection.adaptor.TestBufferingWrappers
Tests run: 2, Failures: 0, Errors: 0, Skipped: 0, Time elapsed: 8.481 sec - in org.apache.hadoop.chukwa.datacollection.adaptor.TestBufferingWrappers
Running org.apache.hadoop.chukwa.datacollection.adaptor.TestUDPAdaptor
Tests run: 1, Failures: 0, Errors: 0, Skipped: 0, Time elapsed: 0.096 sec - in org.apache.hadoop.chukwa.datacollection.adaptor.TestUDPAdaptor
Running org.apache.hadoop.chukwa.datacollection.adaptor.TestSocketAdaptor
Tests run: 1, Failures: 0, Errors: 0, Skipped: 0, Time elapsed: 14.09 sec - in org.apache.hadoop.chukwa.datacollection.adaptor.TestSocketAdaptor
Running org.apache.hadoop.chukwa.datacollection.adaptor.TestHeartbeatAdaptor
Tests run: 1, Failures: 0, Errors: 0, Skipped: 0, Time elapsed: 10.689 sec - in org.apache.hadoop.chukwa.datacollection.adaptor.TestHeartbeatAdaptor
Running org.apache.hadoop.chukwa.datacollection.adaptor.TestDirTailingAdaptor
Tests run: 2, Failures: 0, Errors: 0, Skipped: 0, Time elapsed: 23.548 sec - in org.apache.hadoop.chukwa.datacollection.adaptor.TestDirTailingAdaptor
Running org.apache.hadoop.chukwa.datacollection.adaptor.TestSyslogAdaptor
Tests run: 1, Failures: 0, Errors: 0, Skipped: 0, Time elapsed: 0.418 sec - in org.apache.hadoop.chukwa.datacollection.adaptor.TestSyslogAdaptor
Running org.apache.hadoop.chukwa.datacollection.adaptor.TestOozieAdaptor
Tests run: 1, Failures: 0, Errors: 0, Skipped: 0, Time elapsed: 1.402 sec - in org.apache.hadoop.chukwa.datacollection.adaptor.TestOozieAdaptor
Running org.apache.hadoop.chukwa.datacollection.adaptor.jms.TestJMSAdaptor
Tests run: 4, Failures: 0, Errors: 0, Skipped: 0, Time elapsed: 5.152 sec - in org.apache.hadoop.chukwa.datacollection.adaptor.jms.TestJMSAdaptor
Running org.apache.hadoop.chukwa.datacollection.adaptor.jms.TestJMSMessagePropertyTransformer
Tests run: 9, Failures: 0, Errors: 0, Skipped: 0, Time elapsed: 10.353 sec - in org.apache.hadoop.chukwa.datacollection.adaptor.jms.TestJMSMessagePropertyTransformer
Running org.apache.hadoop.chukwa.datacollection.connector.TestFailedCollector
Tests run: 1, Failures: 0, Errors: 0, Skipped: 0, Time elapsed: 0.509 sec - in org.apache.hadoop.chukwa.datacollection.connector.TestFailedCollector
Running org.apache.hadoop.chukwa.datacollection.collector.TestBackpressure
Tests run: 1, Failures: 0, Errors: 0, Skipped: 0, Time elapsed: 41.665 sec - in org.apache.hadoop.chukwa.datacollection.collector.TestBackpressure
Running org.apache.hadoop.chukwa.datacollection.collector.TestAdaptorTimeout
Tests run: 1, Failures: 0, Errors: 0, Skipped: 0, Time elapsed: 37.419 sec - in org.apache.hadoop.chukwa.datacollection.collector.TestAdaptorTimeout
Running org.apache.hadoop.chukwa.datacollection.collector.TestDelayedAcks
Tests run: 3, Failures: 0, Errors: 0, Skipped: 0, Time elapsed: 45.027 sec - in org.apache.hadoop.chukwa.datacollection.collector.TestDelayedAcks
Running org.apache.hadoop.chukwa.datacollection.collector.TestFailedCollectorAck
Tests run: 1, Failures: 0, Errors: 0, Skipped: 0, Time elapsed: 27.466 sec - in org.apache.hadoop.chukwa.datacollection.collector.TestFailedCollectorAck
Running org.apache.hadoop.chukwa.datacollection.controller.TestAgentClient
Tests run: 1, Failures: 0, Errors: 0, Skipped: 0, Time elapsed: 0.558 sec - in org.apache.hadoop.chukwa.datacollection.controller.TestAgentClient
Running org.apache.hadoop.chukwa.datacollection.agent.TestChunkQueue
Tests run: 2, Failures: 0, Errors: 0, Skipped: 0, Time elapsed: 9.857 sec - in org.apache.hadoop.chukwa.datacollection.agent.TestChunkQueue
Running org.apache.hadoop.chukwa.datacollection.agent.TestChukwaSsl
Tests run: 1, Failures: 0, Errors: 0, Skipped: 0, Time elapsed: 3.008 sec - in org.apache.hadoop.chukwa.datacollection.agent.TestChukwaSsl
Running org.apache.hadoop.chukwa.datacollection.agent.TestAgent
Tests run: 3, Failures: 0, Errors: 0, Skipped: 0, Time elapsed: 163.096 sec - in org.apache.hadoop.chukwa.datacollection.agent.TestAgent
Running org.apache.hadoop.chukwa.datacollection.agent.TestCmd
Tests run: 4, Failures: 0, Errors: 0, Skipped: 0, Time elapsed: 7.115 sec - in org.apache.hadoop.chukwa.datacollection.agent.TestCmd
Running org.apache.hadoop.chukwa.datacollection.agent.rest.TestAdaptorController
Tests run: 5, Failures: 0, Errors: 0, Skipped: 0, Time elapsed: 3.899 sec - in org.apache.hadoop.chukwa.datacollection.agent.rest.TestAdaptorController
Running org.apache.hadoop.chukwa.datacollection.agent.TestAgentConfig
Tests run: 2, Failures: 0, Errors: 0, Skipped: 0, Time elapsed: 13.245 sec - in org.apache.hadoop.chukwa.datacollection.agent.TestAgentConfig
Running org.apache.hadoop.chukwa.database.TestMacro
Tests run: 2, Failures: 0, Errors: 0, Skipped: 0, Time elapsed: 0.14 sec - in org.apache.hadoop.chukwa.database.TestMacro
Running org.apache.hadoop.chukwa.util.TestCopySequenceFile
Tests run: 1, Failures: 0, Errors: 0, Skipped: 0, Time elapsed: 0.999 sec - in org.apache.hadoop.chukwa.util.TestCopySequenceFile
Running org.apache.hadoop.chukwa.util.TestCreateRecordFile
Tests run: 1, Failures: 0, Errors: 0, Skipped: 0, Time elapsed: 1.127 sec - in org.apache.hadoop.chukwa.util.TestCreateRecordFile
Running org.apache.hadoop.chukwa.util.TestDumpChunks
Tests run: 2, Failures: 0, Errors: 0, Skipped: 0, Time elapsed: 1.007 sec - in org.apache.hadoop.chukwa.util.TestDumpChunks
Running org.apache.hadoop.chukwa.util.TestRecordConsts
Tests run: 2, Failures: 0, Errors: 0, Skipped: 0, Time elapsed: 0.007 sec - in org.apache.hadoop.chukwa.util.TestRecordConsts
Running org.apache.hadoop.chukwa.util.TestFilter
Tests run: 3, Failures: 0, Errors: 0, Skipped: 0, Time elapsed: 0.098 sec - in org.apache.hadoop.chukwa.util.TestFilter
Running org.apache.hadoop.chukwa.util.TestCRValidator
Tests run: 3, Failures: 0, Errors: 0, Skipped: 0, Time elapsed: 0.986 sec - in org.apache.hadoop.chukwa.util.TestCRValidator
Running org.apache.hadoop.chukwa.util.TestXSSFilter
Tests run: 1, Failures: 0, Errors: 0, Skipped: 0, Time elapsed: 0.423 sec - in org.apache.hadoop.chukwa.util.TestXSSFilter
Running org.apache.hadoop.chukwa.tools.backfilling.TestBackfillingLoader
Tests run: 4, Failures: 1, Errors: 0, Skipped: 0, Time elapsed: 70.818 sec <<< FAILURE!
- in org.apache.hadoop.chukwa.tools.backfilling.TestBackfillingLoader
testBackfillingLoaderWithCharFileTailingAdaptorUTF8NewLineEscapedBigFile(org.apache.hadoop.chukwa.tools.backfilling.TestBackfillingLoader)
 Time elapsed: 2.464 sec  <<< FAILURE!
junit.framework.AssertionFailedError: null
	at junit.framework.Assert.fail(Assert.java:48)
	at junit.framework.Assert.fail(Assert.java:56)
	at org.apache.hadoop.chukwa.tools.backfilling.TestBackfillingLoader.testBackfillingLoaderWithCharFileTailingAdaptorUTF8NewLineEscapedBigFile(TestBackfillingLoader.java:217)

Running org.apache.hadoop.chukwa.extraction.demux.TestDemux
Tests run: 1, Failures: 0, Errors: 0, Skipped: 0, Time elapsed: 24.334 sec - in org.apache.hadoop.chukwa.extraction.demux.TestDemux
Running org.apache.hadoop.chukwa.extraction.demux.TestDemuxReducerConfigs
Tests run: 2, Failures: 0, Errors: 0, Skipped: 0, Time elapsed: 0.631 sec - in org.apache.hadoop.chukwa.extraction.demux.TestDemuxReducerConfigs
Running org.apache.hadoop.chukwa.extraction.demux.processor.mapper.TestTsProcessor
Tests run: 8, Failures: 0, Errors: 0, Skipped: 0, Time elapsed: 0.904 sec - in org.apache.hadoop.chukwa.extraction.demux.processor.mapper.TestTsProcessor
Running org.apache.hadoop.chukwa.extraction.demux.processor.mapper.TestHadoopLogProcessor
Tests run: 1, Failures: 0, Errors: 0, Skipped: 0, Time elapsed: 1.377 sec - in org.apache.hadoop.chukwa.extraction.demux.processor.mapper.TestHadoopLogProcessor
Running org.apache.hadoop.chukwa.extraction.demux.processor.mapper.TestLog4JMetricsContextChukwaRecord
Tests run: 1, Failures: 0, Errors: 0, Skipped: 0, Time elapsed: 0.155 sec - in org.apache.hadoop.chukwa.extraction.demux.processor.mapper.TestLog4JMetricsContextChukwaRecord
Running org.apache.hadoop.chukwa.extraction.demux.processor.mapper.TestAbtractProcessor
Tests run: 1, Failures: 0, Errors: 0, Skipped: 0, Time elapsed: 0.131 sec - in org.apache.hadoop.chukwa.extraction.demux.processor.mapper.TestAbtractProcessor
Running org.apache.hadoop.chukwa.extraction.demux.processor.mapper.TestJsonProcessors
Tests run: 7, Failures: 0, Errors: 0, Skipped: 0, Time elapsed: 0.174 sec - in org.apache.hadoop.chukwa.extraction.demux.processor.mapper.TestJsonProcessors
Running org.apache.hadoop.chukwa.extraction.demux.TestPostDemuxTrigger
Tests run: 2, Failures: 0, Errors: 0, Skipped: 0, Time elapsed: 1.014 sec - in org.apache.hadoop.chukwa.extraction.demux.TestPostDemuxTrigger
Running org.apache.hadoop.chukwa.extraction.demux.TestDemuxMapperConfigs
Tests run: 2, Failures: 0, Errors: 0, Skipped: 0, Time elapsed: 0.618 sec - in org.apache.hadoop.chukwa.extraction.demux.TestDemuxMapperConfigs
Running org.apache.hadoop.chukwa.TestChunkBuilder
Tests run: 1, Failures: 0, Errors: 0, Skipped: 0, Time elapsed: 0.089 sec - in org.apache.hadoop.chukwa.TestChunkBuilder
Running org.apache.hadoop.chukwa.dataloader.TestSocketDataLoader
Tests run: 1, Failures: 0, Errors: 0, Skipped: 0, Time elapsed: 120.575 sec - in org.apache.hadoop.chukwa.dataloader.TestSocketDataLoader
Running org.apache.hadoop.chukwa.inputtools.log4j.TestTaskLogAppender
Tests run: 1, Failures: 0, Errors: 0, Skipped: 0, Time elapsed: 2.154 sec - in org.apache.hadoop.chukwa.inputtools.log4j.TestTaskLogAppender
Running org.apache.hadoop.chukwa.inputtools.log4j.TestChukwaDailyRollingFileAppender
Tests run: 1, Failures: 0, Errors: 0, Skipped: 0, Time elapsed: 2.117 sec - in org.apache.hadoop.chukwa.inputtools.log4j.TestChukwaDailyRollingFileAppender
Running org.apache.hadoop.chukwa.inputtools.TestInputFormat
Tests run: 1, Failures: 0, Errors: 0, Skipped: 0, Time elapsed: 1.14 sec - in org.apache.hadoop.chukwa.inputtools.TestInputFormat
Running org.apache.hadoop.chukwa.hicc.TestChart
Tests run: 3, Failures: 0, Errors: 0, Skipped: 0, Time elapsed: 0.007 sec - in org.apache.hadoop.chukwa.hicc.TestChart

Results :

Failed tests: 
  TestBackfillingLoader.testBackfillingLoaderWithCharFileTailingAdaptorUTF8NewLineEscapedBigFile:217
null

Tests run: 140, Failures: 1, Errors: 0, Skipped: 0

[INFO] ------------------------------------------------------------------------
[INFO] BUILD FAILURE
[INFO] ------------------------------------------------------------------------
[INFO] Total time: 18:22 min
[INFO] Finished at: 2015-09-26T23:25:59+00:00
[INFO] Final Memory: 52M/646M
[INFO] ------------------------------------------------------------------------
[ERROR] Failed to execute goal org.apache.maven.plugins:maven-surefire-plugin:2.18.1:test
(default-test) on project chukwa: There are test failures.
[ERROR] 
[ERROR] Please refer to <https://builds.apache.org/job/Chukwa-master/ws/target/test-reports>
for the individual test results.
[ERROR] -> [Help 1]
[ERROR] 
[ERROR] To see the full stack trace of the errors, re-run Maven with the -e switch.
[ERROR] Re-run Maven using the -X switch to enable full debug logging.
[ERROR] 
[ERROR] For more information about the errors and possible solutions, please read the following
articles:
[ERROR] [Help 1] http://cwiki.apache.org/confluence/display/MAVEN/MojoFailureException
Build step 'Invoke top-level Maven targets' marked build as failure
Archiving artifacts
Recording test results
Updating CHUKWA-783

Mime
View raw message