chukwa-dev mailing list archives

Site index · List index
Message view « Date » · « Thread »
Top « Date » · « Thread »
From Apache Jenkins Server <jenk...@builds.apache.org>
Subject Build failed in Jenkins: Chukwa-trunk #470
Date Sun, 18 Aug 2013 03:51:17 GMT
See <https://builds.apache.org/job/Chukwa-trunk/470/changes>

Changes:

[eyang] CHUKWA-581. Added support for custom reducer package name. (Ivy Tang via Eric Yang)

------------------------------------------
[...truncated 1136 lines...]
[INFO] --- maven-antrun-plugin:1.4:run (chmod-jmx-file) @ chukwa ---
project.artifactId
[INFO] Executing tasks
[INFO] Executed tasks
[INFO] 
[INFO] --- maven-compiler-plugin:2.3.2:compile (default-compile) @ chukwa ---
[INFO] Compiling 308 source files to <https://builds.apache.org/job/Chukwa-trunk/ws/trunk/target/classes>
[INFO] 
[INFO] --- maven-antrun-plugin:1.4:run (test-setup) @ chukwa ---
project.artifactId
[INFO] Executing tasks
    [mkdir] Created dir: <https://builds.apache.org/job/Chukwa-trunk/ws/trunk/target/test/var>
    [mkdir] Created dir: <https://builds.apache.org/job/Chukwa-trunk/ws/trunk/target/test/var/log>
    [mkdir] Created dir: <https://builds.apache.org/job/Chukwa-trunk/ws/trunk/target/test/var/run>
     [copy] Copying 3 files to <https://builds.apache.org/job/Chukwa-trunk/ws/trunk/target/test/var/log>
     [copy] Copying 1 file to <https://builds.apache.org/job/Chukwa-trunk/ws/trunk/target/test/conf>
     [copy] Copying 1 file to <https://builds.apache.org/job/Chukwa-trunk/ws/trunk/target/test/conf>
     [copy] Copying 1 file to <https://builds.apache.org/job/Chukwa-trunk/ws/trunk/target/test/conf>
     [copy] Copying 1 file to <https://builds.apache.org/job/Chukwa-trunk/ws/trunk/target/test/conf>
     [copy] Copying 1 file to <https://builds.apache.org/job/Chukwa-trunk/ws/trunk/target/test/conf>
     [copy] Copying 1 file to <https://builds.apache.org/job/Chukwa-trunk/ws/trunk/target/test/classes>
     [copy] Copying 1 file to <https://builds.apache.org/job/Chukwa-trunk/ws/trunk/target/test/conf>
     [copy] Copying 1 file to <https://builds.apache.org/job/Chukwa-trunk/ws/trunk/target/test/conf>
[INFO] Executed tasks
[INFO] 
[INFO] --- maven-resources-plugin:2.4.3:testResources (default-testResources) @ chukwa ---
[INFO] Using 'UTF-8' encoding to copy filtered resources.
[INFO] Copying 6 resources
[INFO] 
[INFO] --- maven-compiler-plugin:2.3.2:testCompile (default-testCompile) @ chukwa ---
[INFO] Compiling 101 source files to <https://builds.apache.org/job/Chukwa-trunk/ws/trunk/target/test-classes>
[INFO] 
[INFO] --- maven-surefire-plugin:2.10:test (default-test) @ chukwa ---
[INFO] Surefire report directory: <https://builds.apache.org/job/Chukwa-trunk/ws/trunk/target/test-reports>

-------------------------------------------------------
 T E S T S
-------------------------------------------------------

-------------------------------------------------------
 T E S T S
-------------------------------------------------------
Running org.apache.hadoop.chukwa.tools.backfilling.TestBackfillingLoader
Tests run: 4, Failures: 0, Errors: 0, Skipped: 0, Time elapsed: 73.515 sec
Running org.apache.hadoop.chukwa.inputtools.TestInputFormat
Tests run: 2, Failures: 0, Errors: 0, Skipped: 0, Time elapsed: 0.594 sec
Running org.apache.hadoop.chukwa.inputtools.log4j.TestChukwaDailyRollingFileAppender
Tests run: 1, Failures: 0, Errors: 0, Skipped: 0, Time elapsed: 2.112 sec
Running org.apache.hadoop.chukwa.inputtools.log4j.TestTaskLogAppender
Tests run: 1, Failures: 0, Errors: 0, Skipped: 0, Time elapsed: 2.131 sec
Running org.apache.hadoop.chukwa.util.TestCopySequenceFile
Tests run: 1, Failures: 0, Errors: 0, Skipped: 0, Time elapsed: 0.544 sec
Running org.apache.hadoop.chukwa.util.TestXSSFilter
Tests run: 1, Failures: 0, Errors: 0, Skipped: 0, Time elapsed: 0.107 sec
Running org.apache.hadoop.chukwa.util.TestFilter
Tests run: 3, Failures: 0, Errors: 0, Skipped: 0, Time elapsed: 0.099 sec
Running org.apache.hadoop.chukwa.util.TestRecordConsts
Tests run: 2, Failures: 0, Errors: 0, Skipped: 0, Time elapsed: 0.026 sec
Running org.apache.hadoop.chukwa.util.TestCRValidator
Tests run: 3, Failures: 0, Errors: 0, Skipped: 0, Time elapsed: 0.542 sec
Running org.apache.hadoop.chukwa.util.TestDumpChunks
Tests run: 2, Failures: 0, Errors: 0, Skipped: 0, Time elapsed: 0.551 sec
Running org.apache.hadoop.chukwa.util.TestCreateRecordFile
Tests run: 1, Failures: 0, Errors: 0, Skipped: 0, Time elapsed: 0.635 sec
Running org.apache.hadoop.chukwa.datacollection.TestOffsetStatsManager
Tests run: 3, Failures: 0, Errors: 0, Skipped: 0, Time elapsed: 13.091 sec
Running org.apache.hadoop.chukwa.datacollection.controller.TestAgentClient
Tests run: 1, Failures: 0, Errors: 0, Skipped: 0, Time elapsed: 0.507 sec
Running org.apache.hadoop.chukwa.datacollection.collector.TestAdaptorTimeout
Tests run: 1, Failures: 0, Errors: 0, Skipped: 0, Time elapsed: 36.931 sec
Running org.apache.hadoop.chukwa.datacollection.collector.TestFailedCollectorAck
Tests run: 1, Failures: 0, Errors: 0, Skipped: 0, Time elapsed: 27.113 sec
Running org.apache.hadoop.chukwa.datacollection.collector.TestDelayedAcks
Tests run: 3, Failures: 0, Errors: 0, Skipped: 0, Time elapsed: 44.547 sec
Running org.apache.hadoop.chukwa.datacollection.collector.TestBackpressure
Tests run: 1, Failures: 0, Errors: 0, Skipped: 0, Time elapsed: 41.59 sec
Running org.apache.hadoop.chukwa.datacollection.collector.TestCollector
Tests run: 1, Failures: 0, Errors: 0, Skipped: 0, Time elapsed: 2.591 sec
Running org.apache.hadoop.chukwa.datacollection.connector.TestFailedCollector
Tests run: 1, Failures: 0, Errors: 0, Skipped: 0, Time elapsed: 3.653 sec
Running org.apache.hadoop.chukwa.datacollection.adaptor.TestAddAdaptor
Tests run: 1, Failures: 0, Errors: 0, Skipped: 0, Time elapsed: 3.427 sec
Running org.apache.hadoop.chukwa.datacollection.adaptor.TestFileAdaptor
Tests run: 2, Failures: 0, Errors: 0, Skipped: 0, Time elapsed: 2.111 sec
Running org.apache.hadoop.chukwa.datacollection.adaptor.TestExecAdaptor
Tests run: 2, Failures: 0, Errors: 0, Skipped: 0, Time elapsed: 5.652 sec
Running org.apache.hadoop.chukwa.datacollection.adaptor.TestDirTailingAdaptor
Tests run: 2, Failures: 0, Errors: 0, Skipped: 0, Time elapsed: 23.41 sec
Running org.apache.hadoop.chukwa.datacollection.adaptor.filetailer.TestFileTailingAdaptors
Tests run: 4, Failures: 0, Errors: 0, Skipped: 0, Time elapsed: 15.516 sec
Running org.apache.hadoop.chukwa.datacollection.adaptor.filetailer.TestRCheckAdaptor
Tests run: 2, Failures: 0, Errors: 0, Skipped: 0, Time elapsed: 33.496 sec
Running org.apache.hadoop.chukwa.datacollection.adaptor.filetailer.TestFileTailingAdaptorPreserveLines
Tests run: 3, Failures: 0, Errors: 0, Skipped: 0, Time elapsed: 4.619 sec
Running org.apache.hadoop.chukwa.datacollection.adaptor.filetailer.TestLogRotate
Tests run: 1, Failures: 0, Errors: 0, Skipped: 0, Time elapsed: 9.64 sec
Running org.apache.hadoop.chukwa.datacollection.adaptor.filetailer.TestStartAtOffset
Tests run: 1, Failures: 0, Errors: 0, Skipped: 0, Time elapsed: 0.568 sec
Running org.apache.hadoop.chukwa.datacollection.adaptor.filetailer.TestCharFileTailingAdaptorUTF8
Tests run: 1, Failures: 0, Errors: 0, Skipped: 0, Time elapsed: 2.565 sec
Running org.apache.hadoop.chukwa.datacollection.adaptor.filetailer.TestFileExpirationPolicy
Tests run: 2, Failures: 0, Errors: 0, Skipped: 0, Time elapsed: 101.748 sec
Running org.apache.hadoop.chukwa.datacollection.adaptor.filetailer.TestFileTailer
Tests run: 1, Failures: 0, Errors: 0, Skipped: 0, Time elapsed: 0.613 sec
Running org.apache.hadoop.chukwa.datacollection.adaptor.filetailer.TestFileTailingAdaptorBigRecord
Tests run: 1, Failures: 0, Errors: 0, Skipped: 0, Time elapsed: 8.603 sec
Running org.apache.hadoop.chukwa.datacollection.adaptor.filetailer.TestRawAdaptor
Tests run: 3, Failures: 0, Errors: 0, Skipped: 0, Time elapsed: 4.001 sec
Running org.apache.hadoop.chukwa.datacollection.adaptor.TestBufferingWrappers
Tests run: 2, Failures: 0, Errors: 0, Skipped: 0, Time elapsed: 8.738 sec
Running org.apache.hadoop.chukwa.datacollection.adaptor.TestUDPAdaptor
Tests run: 1, Failures: 0, Errors: 0, Skipped: 0, Time elapsed: 0.096 sec
Running org.apache.hadoop.chukwa.datacollection.adaptor.JMX.TestJMXAdaptor
Tests run: 1, Failures: 0, Errors: 0, Skipped: 0, Time elapsed: 0.709 sec
Running org.apache.hadoop.chukwa.datacollection.adaptor.jms.TestJMSAdaptor
Tests run: 4, Failures: 0, Errors: 0, Skipped: 0, Time elapsed: 5.053 sec
Running org.apache.hadoop.chukwa.datacollection.adaptor.jms.TestJMSMessagePropertyTransformer
Tests run: 9, Failures: 0, Errors: 0, Skipped: 0, Time elapsed: 10.277 sec
Running org.apache.hadoop.chukwa.datacollection.adaptor.TestSyslogAdaptor
Tests run: 1, Failures: 0, Errors: 0, Skipped: 0, Time elapsed: 0.339 sec
Running org.apache.hadoop.chukwa.datacollection.writer.TestSocketTee
Tests run: 1, Failures: 0, Errors: 0, Skipped: 0, Time elapsed: 0.336 sec
Running org.apache.hadoop.chukwa.datacollection.writer.TestHBaseWriter
Tests run: 1, Failures: 0, Errors: 0, Skipped: 0, Time elapsed: 19.305 sec
Running org.apache.hadoop.chukwa.datacollection.writer.TestClientAck
Tests run: 1, Failures: 0, Errors: 0, Skipped: 0, Time elapsed: 18.087 sec
Running org.apache.hadoop.chukwa.datacollection.writer.TestChukwaWriters
Tests run: 3, Failures: 0, Errors: 0, Skipped: 0, Time elapsed: 23.647 sec
Running org.apache.hadoop.chukwa.datacollection.agent.TestCmd
Tests run: 4, Failures: 0, Errors: 0, Skipped: 0, Time elapsed: 6.956 sec
Running org.apache.hadoop.chukwa.datacollection.agent.TestAgentConfig
Tests run: 2, Failures: 0, Errors: 0, Skipped: 0, Time elapsed: 13.112 sec
Running org.apache.hadoop.chukwa.datacollection.agent.TestAgent
Tests run: 3, Failures: 0, Errors: 0, Skipped: 0, Time elapsed: 162.888 sec
Running org.apache.hadoop.chukwa.datacollection.agent.rest.TestAdaptorController
Tests run: 14, Failures: 0, Errors: 0, Skipped: 0, Time elapsed: 6.566 sec
Running org.apache.hadoop.chukwa.datacollection.sender.TestRetryListOfCollectors
Tests run: 2, Failures: 0, Errors: 0, Skipped: 0, Time elapsed: 0.342 sec
Running org.apache.hadoop.chukwa.datacollection.sender.TestAcksOnFailure
Tests run: 1, Failures: 0, Errors: 0, Skipped: 0, Time elapsed: 3.659 sec
Running org.apache.hadoop.chukwa.extraction.demux.TestDemuxReducerConfigs
Tests run: 2, Failures: 0, Errors: 0, Skipped: 0, Time elapsed: 0.404 sec
Running org.apache.hadoop.chukwa.extraction.demux.TestPostDemuxTrigger
Tests run: 2, Failures: 0, Errors: 0, Skipped: 0, Time elapsed: 1.89 sec
Running org.apache.hadoop.chukwa.extraction.demux.TestDemux
Tests run: 1, Failures: 0, Errors: 0, Skipped: 0, Time elapsed: 10.788 sec
Running org.apache.hadoop.chukwa.extraction.demux.processor.mapper.TestPsOutput
Tests run: 1, Failures: 0, Errors: 0, Skipped: 0, Time elapsed: 0.027 sec
Running org.apache.hadoop.chukwa.extraction.demux.processor.mapper.TestJobLogEntry
Tests run: 1, Failures: 0, Errors: 0, Skipped: 0, Time elapsed: 0.238 sec
Running org.apache.hadoop.chukwa.extraction.demux.processor.mapper.TestTsProcessor
Tests run: 8, Failures: 0, Errors: 0, Skipped: 0, Time elapsed: 0.575 sec
Running org.apache.hadoop.chukwa.extraction.demux.processor.mapper.TestLog4JMetricsContextChukwaRecord
Tests run: 1, Failures: 0, Errors: 0, Skipped: 0, Time elapsed: 0.05 sec
Running org.apache.hadoop.chukwa.extraction.demux.processor.mapper.TestHadoopLogProcessor
Tests run: 1, Failures: 0, Errors: 0, Skipped: 0, Time elapsed: 1.487 sec
Running org.apache.hadoop.chukwa.extraction.demux.processor.mapper.TestJsonProcessors
Tests run: 6, Failures: 0, Errors: 0, Skipped: 0, Time elapsed: 0.135 sec
Running org.apache.hadoop.chukwa.extraction.demux.processor.mapper.TestAbtractProcessor
Tests run: 1, Failures: 0, Errors: 0, Skipped: 0, Time elapsed: 0.103 sec
Running org.apache.hadoop.chukwa.extraction.demux.TestDemuxMapperConfigs
Tests run: 2, Failures: 0, Errors: 0, Skipped: 0, Time elapsed: 0.405 sec
Running org.apache.hadoop.chukwa.extraction.demux.TestDemuxManager
Tests run: 6, Failures: 0, Errors: 0, Skipped: 0, Time elapsed: 5.733 sec
Running org.apache.hadoop.chukwa.rest.resource.TestViewResource
Running org.apache.hadoop.chukwa.rest.resource.TestClientTrace
Running org.apache.hadoop.chukwa.rest.resource.TestUserResource
Running org.apache.hadoop.chukwa.rest.resource.TestWidgetResource
Running org.apache.hadoop.chukwa.TestChunkBuilder
Tests run: 1, Failures: 0, Errors: 0, Skipped: 0, Time elapsed: 0.091 sec
Running org.apache.hadoop.chukwa.database.TestMacro
Tests run: 2, Failures: 0, Errors: 0, Skipped: 0, Time elapsed: 0.125 sec
Running org.apache.hadoop.chukwa.hicc.TestChart
Tests run: 3, Failures: 0, Errors: 0, Skipped: 0, Time elapsed: 0.108 sec
Running org.apache.hadoop.chukwa.dataloader.TestSocketDataLoader
Tests run: 1, Failures: 0, Errors: 0, Skipped: 0, Time elapsed: 0.363 sec

Results :

Tests run: 148, Failures: 0, Errors: 0, Skipped: 0

[INFO] 
[INFO] --- maven-jar-plugin:2.3.1:jar (core) @ chukwa ---
[INFO] Building jar: <https://builds.apache.org/job/Chukwa-trunk/ws/trunk/target/chukwa-0.6.0.jar>
[INFO] 
[INFO] --- maven-source-plugin:2.1.1:jar-no-fork (default) @ chukwa ---
[INFO] Building jar: <https://builds.apache.org/job/Chukwa-trunk/ws/trunk/target/chukwa-0.6.0-sources.jar>
[INFO] 
[INFO] --- maven-jar-plugin:2.3.1:jar (default-jar) @ chukwa ---
[INFO] 
[INFO] --- maven-jar-plugin:2.3.1:test-jar (test) @ chukwa ---
[INFO] Building jar: <https://builds.apache.org/job/Chukwa-trunk/ws/trunk/target/chukwa-0.6.0-tests.jar>
[INFO] 
[INFO] --- maven-jar-plugin:2.3.1:jar (client) @ chukwa ---
[INFO] Building jar: <https://builds.apache.org/job/Chukwa-trunk/ws/trunk/target/chukwa-0.6.0-client.jar>
[INFO] 
[INFO] --- maven-war-plugin:2.1.1:war (build-hicc) @ chukwa ---
[INFO] Packaging webapp
[INFO] Assembling webapp [chukwa] in [<https://builds.apache.org/job/Chukwa-trunk/ws/trunk/target/chukwa-0.6.0]>
[INFO] Processing war project
[INFO] Copying webapp resources [<https://builds.apache.org/job/Chukwa-trunk/ws/trunk/src/main/web/hicc]>
[INFO] Webapp assembled in [2660 msecs]
[INFO] Building war: <https://builds.apache.org/job/Chukwa-trunk/ws/trunk/target/hicc.war>
[INFO] WEB-INF/web.xml already added, skipping
[INFO] 
[INFO] --- maven-assembly-plugin:2.2-beta-5:single (build-tarball) @ chukwa ---
[INFO] Reading assembly descriptor: src/packages/tarball/all.xml
[INFO] Building tar : <https://builds.apache.org/job/Chukwa-trunk/470/artifact/trunk/target/chukwa-incubating-0.6.0.tar.gz>
[INFO] 
[INFO] --- maven-surefire-plugin:2.10:test (default) @ chukwa ---
[INFO] Surefire report directory: <https://builds.apache.org/job/Chukwa-trunk/ws/trunk/target/test-reports>

-------------------------------------------------------
 T E S T S
-------------------------------------------------------

-------------------------------------------------------
 T E S T S
-------------------------------------------------------
Running org.apache.hadoop.chukwa.analysis.salsa.fsm.TestFSMBuilder
Tests run: 2, Failures: 1, Errors: 0, Skipped: 0, Time elapsed: 164.168 sec <<< FAILURE!

Results :

Failed tests:   testFSMBuilder_ClientTrace020(org.apache.hadoop.chukwa.analysis.salsa.fsm.TestFSMBuilder):
Error running FSMBuilder: org.apache.hadoop.mapred.InvalidInputException: Input Pattern hdfs://localhost:36176/demux/output/*/*/ClientTraceDetailed*.evt
matches 0 files

Tests run: 2, Failures: 1, Errors: 0, Skipped: 0

[INFO] ------------------------------------------------------------------------
[INFO] BUILD FAILURE
[INFO] ------------------------------------------------------------------------
[INFO] Total time: 18:32.287s
[INFO] Finished at: Sun Aug 18 03:50:37 UTC 2013
[INFO] Final Memory: 32M/235M
[INFO] ------------------------------------------------------------------------
[ERROR] Failed to execute goal org.apache.maven.plugins:maven-surefire-plugin:2.10:test (default)
on project chukwa: There are test failures.
[ERROR] 
[ERROR] Please refer to <https://builds.apache.org/job/Chukwa-trunk/ws/trunk/target/test-reports>
for the individual test results.
[ERROR] -> [Help 1]
[ERROR] 
[ERROR] To see the full stack trace of the errors, re-run Maven with the -e switch.
[ERROR] Re-run Maven using the -X switch to enable full debug logging.
[ERROR] 
[ERROR] For more information about the errors and possible solutions, please read the following
articles:
[ERROR] [Help 1] http://cwiki.apache.org/confluence/display/MAVEN/MojoFailureException
Build step 'Invoke top-level Maven targets' marked build as failure
Archiving artifacts
Recording test results
Updating CHUKWA-581

Mime
View raw message