chukwa-dev mailing list archives

Site index · List index
Message view « Date » · « Thread »
Top « Date » · « Thread »
From Apache Jenkins Server <jenk...@builds.apache.org>
Subject Build failed in Jenkins: Chukwa-trunk #462
Date Wed, 19 Dec 2012 22:54:43 GMT
See <https://builds.apache.org/job/Chukwa-trunk/462/changes>

Changes:

[eyang] CHUKWA-677. Added pid file check before starting processes. (Sreepathi Prasanna via
Eric Yang)

[eyang] CHUKWA-676. Exclude temporarily data from release audit tools. (Eric Yang)

------------------------------------------
[...truncated 1183 lines...]
Running org.apache.hadoop.chukwa.extraction.demux.processor.mapper.TestAbtractProcessor
Tests run: 1, Failures: 0, Errors: 0, Skipped: 0, Time elapsed: 0.102 sec
Running org.apache.hadoop.chukwa.extraction.demux.processor.mapper.TestJobLogEntry
Tests run: 1, Failures: 0, Errors: 0, Skipped: 0, Time elapsed: 0.267 sec
Running org.apache.hadoop.chukwa.extraction.demux.processor.mapper.TestJsonProcessors
Tests run: 6, Failures: 0, Errors: 0, Skipped: 0, Time elapsed: 0.132 sec
Running org.apache.hadoop.chukwa.extraction.demux.processor.mapper.TestPsOutput
Tests run: 1, Failures: 0, Errors: 0, Skipped: 0, Time elapsed: 0.026 sec
Running org.apache.hadoop.chukwa.extraction.demux.processor.mapper.TestTsProcessor
Tests run: 8, Failures: 0, Errors: 0, Skipped: 0, Time elapsed: 0.573 sec
Running org.apache.hadoop.chukwa.extraction.demux.processor.mapper.TestLog4JMetricsContextChukwaRecord
Tests run: 1, Failures: 0, Errors: 0, Skipped: 0, Time elapsed: 0.067 sec
Running org.apache.hadoop.chukwa.extraction.demux.processor.mapper.TestHadoopLogProcessor
Tests run: 1, Failures: 0, Errors: 0, Skipped: 0, Time elapsed: 1.458 sec
Running org.apache.hadoop.chukwa.extraction.demux.TestDemuxMapperConfigs
Tests run: 1, Failures: 0, Errors: 0, Skipped: 0, Time elapsed: 0.37 sec
Running org.apache.hadoop.chukwa.extraction.demux.TestDemuxManager
Tests run: 6, Failures: 0, Errors: 0, Skipped: 0, Time elapsed: 5.693 sec
Running org.apache.hadoop.chukwa.extraction.demux.TestDemuxReducerConfigs
Tests run: 1, Failures: 0, Errors: 0, Skipped: 0, Time elapsed: 0.414 sec
Running org.apache.hadoop.chukwa.util.TestCreateRecordFile
Tests run: 1, Failures: 0, Errors: 0, Skipped: 0, Time elapsed: 0.619 sec
Running org.apache.hadoop.chukwa.util.TestXSSFilter
Tests run: 1, Failures: 0, Errors: 0, Skipped: 0, Time elapsed: 0.106 sec
Running org.apache.hadoop.chukwa.util.TestFilter
Tests run: 3, Failures: 0, Errors: 0, Skipped: 0, Time elapsed: 0.099 sec
Running org.apache.hadoop.chukwa.util.TestCopySequenceFile
Tests run: 1, Failures: 0, Errors: 0, Skipped: 0, Time elapsed: 0.541 sec
Running org.apache.hadoop.chukwa.util.TestDumpChunks
Tests run: 2, Failures: 0, Errors: 0, Skipped: 0, Time elapsed: 0.543 sec
Running org.apache.hadoop.chukwa.util.TestRecordConsts
Tests run: 2, Failures: 0, Errors: 0, Skipped: 0, Time elapsed: 0.027 sec
Running org.apache.hadoop.chukwa.util.TestCRValidator
Tests run: 3, Failures: 0, Errors: 0, Skipped: 0, Time elapsed: 0.534 sec
Running org.apache.hadoop.chukwa.TestChunkBuilder
Tests run: 1, Failures: 0, Errors: 0, Skipped: 0, Time elapsed: 0.091 sec
Running org.apache.hadoop.chukwa.rest.resource.TestUserResource
Running org.apache.hadoop.chukwa.rest.resource.TestClientTrace
Running org.apache.hadoop.chukwa.rest.resource.TestWidgetResource
Running org.apache.hadoop.chukwa.rest.resource.TestViewResource
Running org.apache.hadoop.chukwa.tools.backfilling.TestBackfillingLoader
Tests run: 4, Failures: 0, Errors: 0, Skipped: 0, Time elapsed: 73.384 sec
Running org.apache.hadoop.chukwa.inputtools.log4j.TestChukwaDailyRollingFileAppender
Tests run: 1, Failures: 0, Errors: 0, Skipped: 0, Time elapsed: 2.112 sec
Running org.apache.hadoop.chukwa.inputtools.log4j.TestTaskLogAppender
Tests run: 1, Failures: 0, Errors: 0, Skipped: 0, Time elapsed: 2.13 sec
Running org.apache.hadoop.chukwa.inputtools.TestInputFormat
Tests run: 2, Failures: 0, Errors: 0, Skipped: 0, Time elapsed: 0.556 sec
Running org.apache.hadoop.chukwa.hicc.TestChart
Tests run: 3, Failures: 0, Errors: 0, Skipped: 0, Time elapsed: 0.107 sec
Running org.apache.hadoop.chukwa.database.TestMacro
Tests run: 2, Failures: 0, Errors: 0, Skipped: 0, Time elapsed: 0.147 sec
Running org.apache.hadoop.chukwa.datacollection.collector.TestBackpressure
Tests run: 1, Failures: 0, Errors: 0, Skipped: 0, Time elapsed: 41.584 sec
Running org.apache.hadoop.chukwa.datacollection.collector.TestDelayedAcks
Tests run: 3, Failures: 0, Errors: 0, Skipped: 0, Time elapsed: 44.923 sec
Running org.apache.hadoop.chukwa.datacollection.collector.TestAdaptorTimeout
Tests run: 1, Failures: 0, Errors: 0, Skipped: 0, Time elapsed: 36.967 sec
Running org.apache.hadoop.chukwa.datacollection.collector.TestFailedCollectorAck
Tests run: 1, Failures: 0, Errors: 0, Skipped: 0, Time elapsed: 27.457 sec
Running org.apache.hadoop.chukwa.datacollection.collector.TestCollector
Tests run: 1, Failures: 0, Errors: 0, Skipped: 0, Time elapsed: 3.644 sec
Running org.apache.hadoop.chukwa.datacollection.agent.rest.TestAdaptorController
Tests run: 14, Failures: 0, Errors: 0, Skipped: 0, Time elapsed: 8.209 sec
Running org.apache.hadoop.chukwa.datacollection.agent.TestAgent
Tests run: 3, Failures: 0, Errors: 0, Skipped: 0, Time elapsed: 163.225 sec
Running org.apache.hadoop.chukwa.datacollection.agent.TestCmd
Tests run: 4, Failures: 0, Errors: 0, Skipped: 0, Time elapsed: 6.925 sec
Running org.apache.hadoop.chukwa.datacollection.agent.TestAgentConfig
Tests run: 2, Failures: 0, Errors: 0, Skipped: 0, Time elapsed: 13.245 sec
Running org.apache.hadoop.chukwa.datacollection.TestOffsetStatsManager
Tests run: 3, Failures: 0, Errors: 0, Skipped: 0, Time elapsed: 13.093 sec
Running org.apache.hadoop.chukwa.datacollection.adaptor.jms.TestJMSAdaptor
Tests run: 4, Failures: 0, Errors: 0, Skipped: 0, Time elapsed: 5.684 sec
Running org.apache.hadoop.chukwa.datacollection.adaptor.jms.TestJMSMessagePropertyTransformer
Tests run: 9, Failures: 0, Errors: 0, Skipped: 0, Time elapsed: 10.755 sec
Running org.apache.hadoop.chukwa.datacollection.adaptor.TestAddAdaptor
Tests run: 1, Failures: 0, Errors: 0, Skipped: 0, Time elapsed: 3.342 sec
Running org.apache.hadoop.chukwa.datacollection.adaptor.TestFileAdaptor
Tests run: 2, Failures: 0, Errors: 0, Skipped: 0, Time elapsed: 2.205 sec
Running org.apache.hadoop.chukwa.datacollection.adaptor.TestSyslogAdaptor
Tests run: 1, Failures: 0, Errors: 0, Skipped: 0, Time elapsed: 0.328 sec
Running org.apache.hadoop.chukwa.datacollection.adaptor.TestDirTailingAdaptor
Tests run: 2, Failures: 0, Errors: 0, Skipped: 0, Time elapsed: 23.442 sec
Running org.apache.hadoop.chukwa.datacollection.adaptor.TestExecAdaptor
Tests run: 2, Failures: 0, Errors: 0, Skipped: 0, Time elapsed: 6.408 sec
Running org.apache.hadoop.chukwa.datacollection.adaptor.TestBufferingWrappers
Tests run: 2, Failures: 0, Errors: 0, Skipped: 0, Time elapsed: 8.883 sec
Running org.apache.hadoop.chukwa.datacollection.adaptor.TestUDPAdaptor
Tests run: 1, Failures: 0, Errors: 0, Skipped: 0, Time elapsed: 0.11 sec
Running org.apache.hadoop.chukwa.datacollection.adaptor.JMX.TestJMXAdaptor
Tests run: 1, Failures: 0, Errors: 0, Skipped: 0, Time elapsed: 0.826 sec
Running org.apache.hadoop.chukwa.datacollection.adaptor.filetailer.TestFileTailer
Tests run: 1, Failures: 0, Errors: 0, Skipped: 0, Time elapsed: 0.606 sec
Running org.apache.hadoop.chukwa.datacollection.adaptor.filetailer.TestFileTailingAdaptorBigRecord
Tests run: 1, Failures: 0, Errors: 0, Skipped: 0, Time elapsed: 8.497 sec
Running org.apache.hadoop.chukwa.datacollection.adaptor.filetailer.TestLogRotate
Tests run: 1, Failures: 0, Errors: 0, Skipped: 0, Time elapsed: 9.662 sec
Running org.apache.hadoop.chukwa.datacollection.adaptor.filetailer.TestRCheckAdaptor
Tests run: 2, Failures: 0, Errors: 0, Skipped: 0, Time elapsed: 33.873 sec
Running org.apache.hadoop.chukwa.datacollection.adaptor.filetailer.TestFileExpirationPolicy
Tests run: 2, Failures: 0, Errors: 0, Skipped: 0, Time elapsed: 101.615 sec
Running org.apache.hadoop.chukwa.datacollection.adaptor.filetailer.TestFileTailingAdaptors
Tests run: 4, Failures: 0, Errors: 0, Skipped: 0, Time elapsed: 15.464 sec
Running org.apache.hadoop.chukwa.datacollection.adaptor.filetailer.TestRawAdaptor
Tests run: 3, Failures: 0, Errors: 0, Skipped: 0, Time elapsed: 4.023 sec
Running org.apache.hadoop.chukwa.datacollection.adaptor.filetailer.TestStartAtOffset
Tests run: 1, Failures: 0, Errors: 0, Skipped: 0, Time elapsed: 0.575 sec
Running org.apache.hadoop.chukwa.datacollection.adaptor.filetailer.TestCharFileTailingAdaptorUTF8
Tests run: 1, Failures: 0, Errors: 0, Skipped: 0, Time elapsed: 2.623 sec
Running org.apache.hadoop.chukwa.datacollection.sender.TestAcksOnFailure
Tests run: 1, Failures: 0, Errors: 0, Skipped: 0, Time elapsed: 3.402 sec
Running org.apache.hadoop.chukwa.datacollection.sender.TestRetryListOfCollectors
Tests run: 2, Failures: 0, Errors: 0, Skipped: 0, Time elapsed: 0.34 sec
Running org.apache.hadoop.chukwa.datacollection.writer.TestChukwaWriters
Tests run: 3, Failures: 0, Errors: 0, Skipped: 0, Time elapsed: 23.656 sec
Running org.apache.hadoop.chukwa.datacollection.writer.TestHBaseWriter
Tests run: 1, Failures: 0, Errors: 0, Skipped: 0, Time elapsed: 19.776 sec
Running org.apache.hadoop.chukwa.datacollection.writer.TestSocketTee
Tests run: 1, Failures: 0, Errors: 0, Skipped: 0, Time elapsed: 0.372 sec
Running org.apache.hadoop.chukwa.datacollection.writer.TestClientAck
Tests run: 1, Failures: 0, Errors: 0, Skipped: 0, Time elapsed: 18.091 sec
Running org.apache.hadoop.chukwa.datacollection.connector.TestFailedCollector
Tests run: 1, Failures: 0, Errors: 0, Skipped: 0, Time elapsed: 3.642 sec
Running org.apache.hadoop.chukwa.datacollection.controller.TestAgentClient
Tests run: 1, Failures: 0, Errors: 0, Skipped: 0, Time elapsed: 0.474 sec

Results :

Tests run: 143, Failures: 0, Errors: 0, Skipped: 0

[INFO] 
[INFO] --- maven-jar-plugin:2.3.1:jar (core) @ chukwa ---
[INFO] Building jar: <https://builds.apache.org/job/Chukwa-trunk/ws/trunk/target/chukwa-0.6.0.jar>
[INFO] 
[INFO] --- maven-source-plugin:2.1.1:jar-no-fork (default) @ chukwa ---
[INFO] Building jar: <https://builds.apache.org/job/Chukwa-trunk/ws/trunk/target/chukwa-0.6.0-sources.jar>
[INFO] 
[INFO] --- maven-jar-plugin:2.3.1:jar (default-jar) @ chukwa ---
[INFO] 
[INFO] --- maven-jar-plugin:2.3.1:test-jar (test) @ chukwa ---
[INFO] Building jar: <https://builds.apache.org/job/Chukwa-trunk/ws/trunk/target/chukwa-0.6.0-tests.jar>
[INFO] 
[INFO] --- maven-jar-plugin:2.3.1:jar (client) @ chukwa ---
[INFO] Building jar: <https://builds.apache.org/job/Chukwa-trunk/ws/trunk/target/chukwa-0.6.0-client.jar>
[INFO] 
[INFO] --- maven-war-plugin:2.1.1:war (build-hicc) @ chukwa ---
[INFO] Packaging webapp
[INFO] Assembling webapp [chukwa] in [<https://builds.apache.org/job/Chukwa-trunk/ws/trunk/target/chukwa-0.6.0]>
[INFO] Processing war project
[INFO] Copying webapp resources [<https://builds.apache.org/job/Chukwa-trunk/ws/trunk/src/main/web/hicc]>
[INFO] Webapp assembled in [2520 msecs]
[INFO] Building war: <https://builds.apache.org/job/Chukwa-trunk/ws/trunk/target/hicc.war>
[INFO] WEB-INF/web.xml already added, skipping
[INFO] 
[INFO] --- maven-assembly-plugin:2.2-beta-5:single (build-tarball) @ chukwa ---
[INFO] Reading assembly descriptor: src/packages/tarball/all.xml
[INFO] Building tar : <https://builds.apache.org/job/Chukwa-trunk/462/artifact/trunk/target/chukwa-incubating-0.6.0.tar.gz>
[INFO] 
[INFO] --- maven-surefire-plugin:2.10:test (default) @ chukwa ---
[INFO] Surefire report directory: <https://builds.apache.org/job/Chukwa-trunk/ws/trunk/target/test-reports>

-------------------------------------------------------
 T E S T S
-------------------------------------------------------

-------------------------------------------------------
 T E S T S
-------------------------------------------------------
Running org.apache.hadoop.chukwa.analysis.salsa.fsm.TestFSMBuilder
Tests run: 2, Failures: 0, Errors: 0, Skipped: 0, Time elapsed: 167.109 sec

Results :

Tests run: 2, Failures: 0, Errors: 0, Skipped: 0

[INFO] 
[INFO] --- apache-rat-plugin:0.7:check (default) @ chukwa ---
[INFO] Exclude: CHANGES.txt
[INFO] Exclude: bin/VERSION
[INFO] Exclude: **/target/**
[INFO] Exclude: **/.classpath
[INFO] Exclude: **/.project
[INFO] Exclude: **/.settings/**
[INFO] Exclude: conf/agents
[INFO] Exclude: conf/alert
[INFO] Exclude: conf/auth.conf
[INFO] Exclude: conf/collectors
[INFO] Exclude: conf/hbase.schema
[INFO] Exclude: conf/initial_adaptors
[INFO] Exclude: src/main/web/hicc/descriptors/**
[INFO] Exclude: src/main/web/hicc/views/**
[INFO] Exclude: contrib/chukwa-pig/src/java/org/apache/hadoop/chukwa/ChukwaStorage.java
[INFO] Exclude: src/test/resources/Hadoop18JobHistoryLog.txt
[INFO] Exclude: src/test/resources/TestJobLog.txt
[INFO] Exclude: test/samples/ClientTrace.log
[INFO] Exclude: test/samples/Iostat.log
[INFO] Exclude: test/samples/JobHistory.log
[INFO] Exclude: src/main/web/hicc/js/jquery-*
[INFO] Exclude: src/main/web/hicc/css/iui.css
[INFO] Exclude: src/main/web/hicc/js/behaviour.js
[INFO] Exclude: src/main/web/hicc/js/iui.js
[INFO] Exclude: src/main/web/hicc/js/yahoo-dom-event.js
[INFO] Exclude: src/main/web/hicc/js/treeview-min.js
[INFO] Exclude: src/main/web/hicc/css/flexigrid/flexigrid.css
[INFO] Exclude: src/main/web/hicc/css/timeline.css
[INFO] Exclude: src/main/web/hicc/lib/timeline/**
[INFO] Exclude: lib/agent.dict
[INFO] Exclude: lib/collector.dict
[INFO] Exclude: lib/confspellcheck-README
[INFO] Exclude: lib/json-README.txt
[INFO] Exclude: src/main/web/hicc/js/ajaxtree.js
[INFO] Exclude: src/main/web/hicc/js/flexigrid.js
[INFO] Exclude: src/main/web/hicc/js/flexigrid.pack.js
[INFO] Exclude: src/main/web/hicc/js/workspace/builder.js
[INFO] Exclude: src/main/web/hicc/js/workspace/controls.js
[INFO] Exclude: src/main/web/hicc/js/workspace/dragdrop.js
[INFO] Exclude: src/main/web/hicc/js/workspace/effects.js
[INFO] Exclude: src/main/web/hicc/js/workspace/scriptaculous.js
[INFO] Exclude: src/main/web/hicc/js/workspace/slider.js
[INFO] Exclude: src/main/web/hicc/js/workspace/sound.js
[INFO] Exclude: src/main/web/hicc/js/org/tool-man/*
[INFO] Exclude: src/main/web/hicc/js/timeframe.js
[INFO] Exclude: src/main/web/hicc/js/workspace/prototype.js
[INFO] Exclude: src/main/web/hicc/js/jquery.flot.pack.js
[INFO] Exclude: src/main/web/hicc/js/gsv.js
[INFO] Exclude: src/main/web/hicc/js/autoHeight.js
[INFO] Exclude: src/main/web/hicc/js/base64.js
[INFO] Exclude: src/main/web/hicc/js/canvas2image.js
[INFO] Exclude: src/main/web/hicc/js/json.js
[INFO] ------------------------------------------------------------------------
[INFO] BUILD FAILURE
[INFO] ------------------------------------------------------------------------
[INFO] Total time: 18:39.828s
[INFO] Finished at: Wed Dec 19 22:53:54 UTC 2012
[INFO] Final Memory: 35M/228M
[INFO] ------------------------------------------------------------------------
[ERROR] Failed to execute goal org.apache.rat:apache-rat-plugin:0.7:check (default) on project
chukwa: Too many unapproved licenses: 3 -> [Help 1]
[ERROR] 
[ERROR] To see the full stack trace of the errors, re-run Maven with the -e switch.
[ERROR] Re-run Maven using the -X switch to enable full debug logging.
[ERROR] 
[ERROR] For more information about the errors and possible solutions, please read the following
articles:
[ERROR] [Help 1] http://cwiki.apache.org/confluence/display/MAVEN/MojoFailureException
Build step 'Invoke top-level Maven targets' marked build as failure
Archiving artifacts
Recording test results
Updating CHUKWA-676
Updating CHUKWA-677

Mime
View raw message