chukwa-dev mailing list archives

Site index · List index
Message view « Date » · « Thread »
Top « Date » · « Thread »
From Apache Jenkins Server <jenk...@builds.apache.org>
Subject Build failed in Jenkins: Chukwa-trunk #441
Date Sat, 31 Mar 2012 05:31:44 GMT
See <https://builds.apache.org/job/Chukwa-trunk/441/changes>

Changes:

[eyang] CHUKWA-300. Updated adaptor list in document. (Eric Yang)

------------------------------------------
[...truncated 1067 lines...]
AU        bin/stop-data-processors.sh
AU        bin/stop-collectors.sh
AU        bin/slaves.sh
A         bin/downSampling.sh
AU        bin/start-data-processors.sh
AU        bin/stop-agents.sh
AU        bin/start-collectors.sh
AU        bin/stop-chukwa.sh
A         README.txt
 U        .
At revision 1307708
[trunk] $ /home/jenkins/jenkins-slave/tools/maven-3.0.4/bin/mvn clean package
[INFO] Scanning for projects...
[WARNING] 
[WARNING] Some problems were encountered while building the effective model for org.apache.incubator:chukwa:jar:0.6.0
[WARNING] 'dependencies.dependency.systemPath' for com.josephoconnell.html:html-filter:jar
should not point at files within the project directory, ${basedir}/lib/html-filter-1.0.jar
will be unresolvable by dependent projects @ line 99, column 25
[WARNING] 'dependencies.dependency.systemPath' for edu.berkeley.confspell:confspellcheck:jar
should not point at files within the project directory, ${basedir}/lib/confspellcheck.jar
will be unresolvable by dependent projects @ line 106, column 25
[WARNING] 'dependencies.dependency.systemPath' for com.mdimension:jchronic:jar should not
point at files within the project directory, ${basedir}/lib/jchronic-0.2.3.jar will be unresolvable
by dependent projects @ line 113, column 25
[WARNING] 'dependencies.dependency.systemPath' for org.apache.log4j:NagiosAppender:jar should
not point at files within the project directory, ${basedir}/lib/NagiosAppender-1.5.0.jar will
be unresolvable by dependent projects @ line 120, column 25
[WARNING] 'dependencies.dependency.systemPath' for org.hyperic:sigar:jar should not point
at files within the project directory, ${basedir}/lib/sigar.jar will be unresolvable by dependent
projects @ line 127, column 25
[WARNING] 
[WARNING] It is highly recommended to fix these problems because they threaten the stability
of your build.
[WARNING] 
[WARNING] For this reason, future Maven versions might no longer support building such malformed
projects.
[WARNING] 
[INFO]                                                                         
[INFO] ------------------------------------------------------------------------
[INFO] Building Apache Chukwa 0.6.0
[INFO] ------------------------------------------------------------------------
[INFO] 
[INFO] --- maven-clean-plugin:2.4.1:clean (default-clean) @ chukwa ---
[INFO] 
[INFO] --- maven-antrun-plugin:1.4:run (setup) @ chukwa ---
project.artifactId
[INFO] Executing tasks
    [mkdir] Created dir: /x1/jenkins/jenkins-slave/workspace/Chukwa-trunk/trunk/target
    [mkdir] Created dir: /x1/jenkins/jenkins-slave/workspace/Chukwa-trunk/trunk/target/clover
[INFO] Executed tasks
[INFO] 
[INFO] --- maven-resources-plugin:2.4.3:copy-resources (copy-configuration) @ chukwa ---
[INFO] Using 'UTF-8' encoding to copy filtered resources.
[INFO] Copying 22 resources
[INFO] 
[INFO] --- maven-resources-plugin:2.4.3:resources (default-resources) @ chukwa ---
[INFO] Using 'UTF-8' encoding to copy filtered resources.
[INFO] skip non existing resourceDirectory /x1/jenkins/jenkins-slave/workspace/Chukwa-trunk/trunk/src/main/resources
[INFO] 
[INFO] --- maven-compiler-plugin:2.3.2:compile (default-compile) @ chukwa ---
[INFO] Compiling 298 source files to /x1/jenkins/jenkins-slave/workspace/Chukwa-trunk/trunk/target/classes
[INFO] 
[INFO] --- maven-antrun-plugin:1.4:run (test-setup) @ chukwa ---
project.artifactId
[INFO] Executing tasks
    [mkdir] Created dir: /x1/jenkins/jenkins-slave/workspace/Chukwa-trunk/trunk/target/test/var
    [mkdir] Created dir: /x1/jenkins/jenkins-slave/workspace/Chukwa-trunk/trunk/target/test/var/log
    [mkdir] Created dir: /x1/jenkins/jenkins-slave/workspace/Chukwa-trunk/trunk/target/test/var/run
     [copy] Copying 3 files to /x1/jenkins/jenkins-slave/workspace/Chukwa-trunk/trunk/target/test/var/log
     [copy] Copying 1 file to /x1/jenkins/jenkins-slave/workspace/Chukwa-trunk/trunk/target/test/conf
     [copy] Copying 1 file to /x1/jenkins/jenkins-slave/workspace/Chukwa-trunk/trunk/target/test/conf
     [copy] Copying 1 file to /x1/jenkins/jenkins-slave/workspace/Chukwa-trunk/trunk/target/test/conf
     [copy] Copying 1 file to /x1/jenkins/jenkins-slave/workspace/Chukwa-trunk/trunk/target/test/classes
     [copy] Copying 1 file to /x1/jenkins/jenkins-slave/workspace/Chukwa-trunk/trunk/target/test/conf
     [copy] Copying 1 file to /x1/jenkins/jenkins-slave/workspace/Chukwa-trunk/trunk/target/test/conf
[INFO] Executed tasks
[INFO] 
[INFO] --- maven-resources-plugin:2.4.3:testResources (default-testResources) @ chukwa ---
[INFO] Using 'UTF-8' encoding to copy filtered resources.
[INFO] Copying 6 resources
[INFO] 
[INFO] --- maven-compiler-plugin:2.3.2:testCompile (default-testCompile) @ chukwa ---
[INFO] Compiling 92 source files to /x1/jenkins/jenkins-slave/workspace/Chukwa-trunk/trunk/target/test-classes
[INFO] 
[INFO] --- maven-surefire-plugin:2.10:test (default-test) @ chukwa ---
[INFO] Surefire report directory: /x1/jenkins/jenkins-slave/workspace/Chukwa-trunk/trunk/target/test-reports

-------------------------------------------------------
 T E S T S
-------------------------------------------------------

-------------------------------------------------------
 T E S T S
-------------------------------------------------------
Java HotSpot(TM) Server VM warning: Insufficient space for shared memory file:
   /tmp/hsperfdata_jenkins/9421
Try using the -Djava.io.tmpdir= option to select an alternate temp location.
Running org.apache.hadoop.chukwa.TestChunkBuilder
Tests run: 1, Failures: 0, Errors: 0, Skipped: 0, Time elapsed: 0.106 sec
Java HotSpot(TM) Server VM warning: Insufficient space for shared memory file:
   /tmp/hsperfdata_jenkins/9457
Try using the -Djava.io.tmpdir= option to select an alternate temp location.
Running org.apache.hadoop.chukwa.dataloader.TestSocketDataLoader
Tests run: 1, Failures: 0, Errors: 0, Skipped: 0, Time elapsed: 0.571 sec
Java HotSpot(TM) Server VM warning: Insufficient space for shared memory file:
   /tmp/hsperfdata_jenkins/9494
Try using the -Djava.io.tmpdir= option to select an alternate temp location.
Running org.apache.hadoop.chukwa.rest.resource.TestWidgetResource
Java HotSpot(TM) Server VM warning: Insufficient space for shared memory file:
   /tmp/hsperfdata_jenkins/9528
Try using the -Djava.io.tmpdir= option to select an alternate temp location.
Running org.apache.hadoop.chukwa.rest.resource.TestClientTrace
Java HotSpot(TM) Server VM warning: Insufficient space for shared memory file:
   /tmp/hsperfdata_jenkins/9562
Try using the -Djava.io.tmpdir= option to select an alternate temp location.
Running org.apache.hadoop.chukwa.rest.resource.TestUserResource
Java HotSpot(TM) Server VM warning: Insufficient space for shared memory file:
   /tmp/hsperfdata_jenkins/9596
Try using the -Djava.io.tmpdir= option to select an alternate temp location.
Running org.apache.hadoop.chukwa.rest.resource.TestViewResource
Java HotSpot(TM) Server VM warning: Insufficient space for shared memory file:
   /tmp/hsperfdata_jenkins/9630
Try using the -Djava.io.tmpdir= option to select an alternate temp location.
Running org.apache.hadoop.chukwa.hicc.TestChart
Tests run: 3, Failures: 0, Errors: 0, Skipped: 0, Time elapsed: 0.102 sec
Java HotSpot(TM) Server VM warning: Insufficient space for shared memory file:
   /tmp/hsperfdata_jenkins/9664
Try using the -Djava.io.tmpdir= option to select an alternate temp location.
Running org.apache.hadoop.chukwa.extraction.demux.TestDemuxManager
Java HotSpot(TM) Server VM warning: Insufficient space for shared memory file:
   /tmp/hsperfdata_jenkins/9717
Try using the -Djava.io.tmpdir= option to select an alternate temp location.
Running org.apache.hadoop.chukwa.extraction.demux.TestPostDemuxTrigger
Tests run: 2, Failures: 0, Errors: 0, Skipped: 0, Time elapsed: 0.493 sec
Java HotSpot(TM) Server VM warning: Insufficient space for shared memory file:
   /tmp/hsperfdata_jenkins/9786
Try using the -Djava.io.tmpdir= option to select an alternate temp location.
Running org.apache.hadoop.chukwa.extraction.demux.processor.mapper.TestAbtractProcessor
Tests run: 1, Failures: 0, Errors: 0, Skipped: 0, Time elapsed: 0.09 sec
Java HotSpot(TM) Server VM warning: Insufficient space for shared memory file:
   /tmp/hsperfdata_jenkins/9820
Try using the -Djava.io.tmpdir= option to select an alternate temp location.
Running org.apache.hadoop.chukwa.extraction.demux.processor.mapper.TestHadoopLogProcessor
Tests run: 1, Failures: 0, Errors: 0, Skipped: 0, Time elapsed: 1.064 sec
Java HotSpot(TM) Server VM warning: Insufficient space for shared memory file:
   /tmp/hsperfdata_jenkins/9854
Try using the -Djava.io.tmpdir= option to select an alternate temp location.
Running org.apache.hadoop.chukwa.extraction.demux.processor.mapper.TestLog4JMetricsContextChukwaRecord
Tests run: 1, Failures: 0, Errors: 0, Skipped: 0, Time elapsed: 0.045 sec
Java HotSpot(TM) Server VM warning: Insufficient space for shared memory file:
   /tmp/hsperfdata_jenkins/9887
Try using the -Djava.io.tmpdir= option to select an alternate temp location.
Running org.apache.hadoop.chukwa.extraction.demux.processor.mapper.TestJobLogEntry
Tests run: 1, Failures: 0, Errors: 0, Skipped: 0, Time elapsed: 0.209 sec
Java HotSpot(TM) Server VM warning: Insufficient space for shared memory file:
   /tmp/hsperfdata_jenkins/9921
Try using the -Djava.io.tmpdir= option to select an alternate temp location.
Running org.apache.hadoop.chukwa.extraction.demux.processor.mapper.TestTsProcessor
Tests run: 7, Failures: 0, Errors: 0, Skipped: 0, Time elapsed: 0.43 sec
Java HotSpot(TM) Server VM warning: Insufficient space for shared memory file:
   /tmp/hsperfdata_jenkins/9955
Try using the -Djava.io.tmpdir= option to select an alternate temp location.
Running org.apache.hadoop.chukwa.extraction.demux.processor.mapper.TestPsOutput
Tests run: 1, Failures: 0, Errors: 0, Skipped: 0, Time elapsed: 0.022 sec
Java HotSpot(TM) Server VM warning: Insufficient space for shared memory file:
   /tmp/hsperfdata_jenkins/9988
Try using the -Djava.io.tmpdir= option to select an alternate temp location.
Running org.apache.hadoop.chukwa.extraction.demux.TestDemuxReducerConfigs
Tests run: 1, Failures: 0, Errors: 0, Skipped: 0, Time elapsed: 0.276 sec
Java HotSpot(TM) Server VM warning: Insufficient space for shared memory file:
   /tmp/hsperfdata_jenkins/10022
Try using the -Djava.io.tmpdir= option to select an alternate temp location.
Running org.apache.hadoop.chukwa.extraction.demux.TestDemuxMapperConfigs
Tests run: 1, Failures: 0, Errors: 0, Skipped: 0, Time elapsed: 0.282 sec
Java HotSpot(TM) Server VM warning: Insufficient space for shared memory file:
   /tmp/hsperfdata_jenkins/10056
Try using the -Djava.io.tmpdir= option to select an alternate temp location.
Running org.apache.hadoop.chukwa.extraction.demux.TestDemux
Tests run: 1, Failures: 0, Errors: 0, Skipped: 0, Time elapsed: 22.188 sec
Java HotSpot(TM) Server VM warning: Insufficient space for shared memory file:
   /tmp/hsperfdata_jenkins/10189
Try using the -Djava.io.tmpdir= option to select an alternate temp location.
Running org.apache.hadoop.chukwa.util.TestCreateRecordFile
Tests run: 1, Failures: 0, Errors: 1, Skipped: 0, Time elapsed: 0.484 sec <<< FAILURE!
Java HotSpot(TM) Server VM warning: Insufficient space for shared memory file:
   /tmp/hsperfdata_jenkins/10224
Try using the -Djava.io.tmpdir= option to select an alternate temp location.
Running org.apache.hadoop.chukwa.util.TestRecordConsts
Tests run: 2, Failures: 0, Errors: 0, Skipped: 0, Time elapsed: 0.021 sec
Java HotSpot(TM) Server VM warning: Insufficient space for shared memory file:
   /tmp/hsperfdata_jenkins/10257
Try using the -Djava.io.tmpdir= option to select an alternate temp location.
Running org.apache.hadoop.chukwa.util.TestFilter
Tests run: 2, Failures: 0, Errors: 0, Skipped: 0, Time elapsed: 0.086 sec
Java HotSpot(TM) Server VM warning: Insufficient space for shared memory file:
   /tmp/hsperfdata_jenkins/10291
Try using the -Djava.io.tmpdir= option to select an alternate temp location.
Running org.apache.hadoop.chukwa.util.TestXSSFilter
Tests run: 1, Failures: 0, Errors: 0, Skipped: 0, Time elapsed: 0.088 sec
Java HotSpot(TM) Server VM warning: Insufficient space for shared memory file:
   /tmp/hsperfdata_jenkins/10325
Try using the -Djava.io.tmpdir= option to select an alternate temp location.
Running org.apache.hadoop.chukwa.util.TestCopySequenceFile
Tests run: 1, Failures: 0, Errors: 1, Skipped: 0, Time elapsed: 0.427 sec <<< FAILURE!
Java HotSpot(TM) Server VM warning: Insufficient space for shared memory file:
   /tmp/hsperfdata_jenkins/10360
Try using the -Djava.io.tmpdir= option to select an alternate temp location.
Running org.apache.hadoop.chukwa.util.TestDumpChunks
Tests run: 1, Failures: 0, Errors: 1, Skipped: 0, Time elapsed: 0.418 sec <<< FAILURE!
Java HotSpot(TM) Server VM warning: Insufficient space for shared memory file:
   /tmp/hsperfdata_jenkins/10395
Try using the -Djava.io.tmpdir= option to select an alternate temp location.
Running org.apache.hadoop.chukwa.util.TestCRValidator
Tests run: 3, Failures: 0, Errors: 1, Skipped: 0, Time elapsed: 0.421 sec <<< FAILURE!
Java HotSpot(TM) Server VM warning: Insufficient space for shared memory file:
   /tmp/hsperfdata_jenkins/10430
Try using the -Djava.io.tmpdir= option to select an alternate temp location.
Running org.apache.hadoop.chukwa.tools.backfilling.TestBackfillingLoader
Tests run: 4, Failures: 4, Errors: 0, Skipped: 0, Time elapsed: 0.507 sec <<< FAILURE!
Java HotSpot(TM) Server VM warning: Insufficient space for shared memory file:
   /tmp/hsperfdata_jenkins/10465
Try using the -Djava.io.tmpdir= option to select an alternate temp location.
Running org.apache.hadoop.chukwa.datacollection.agent.TestAgentConfig
Tests run: 2, Failures: 2, Errors: 0, Skipped: 0, Time elapsed: 0.411 sec <<< FAILURE!
Java HotSpot(TM) Server VM warning: Insufficient space for shared memory file:
   /tmp/hsperfdata_jenkins/10510
Try using the -Djava.io.tmpdir= option to select an alternate temp location.
Running org.apache.hadoop.chukwa.datacollection.agent.TestCmd
Tests run: 4, Failures: 0, Errors: 0, Skipped: 0, Time elapsed: 6.876 sec
Java HotSpot(TM) Server VM warning: Insufficient space for shared memory file:
   /tmp/hsperfdata_jenkins/10566
Try using the -Djava.io.tmpdir= option to select an alternate temp location.
Running org.apache.hadoop.chukwa.datacollection.agent.rest.TestAdaptorController
Tests run: 14, Failures: 0, Errors: 0, Skipped: 0, Time elapsed: 6.957 sec
Java HotSpot(TM) Server VM warning: Insufficient space for shared memory file:
   /tmp/hsperfdata_jenkins/10701
Try using the -Djava.io.tmpdir= option to select an alternate temp location.
Running org.apache.hadoop.chukwa.datacollection.agent.TestAgent
Tests run: 3, Failures: 0, Errors: 0, Skipped: 0, Time elapsed: 162.746 sec
Java HotSpot(TM) Server VM warning: Insufficient space for shared memory file:
   /tmp/hsperfdata_jenkins/10977
Try using the -Djava.io.tmpdir= option to select an alternate temp location.
Running org.apache.hadoop.chukwa.datacollection.connector.TestFailedCollector
Tests run: 1, Failures: 0, Errors: 0, Skipped: 0, Time elapsed: 0.442 sec
Java HotSpot(TM) Server VM warning: Insufficient space for shared memory file:
   /tmp/hsperfdata_jenkins/11019
Try using the -Djava.io.tmpdir= option to select an alternate temp location.
Running org.apache.hadoop.chukwa.datacollection.controller.TestAgentClient
Tests run: 1, Failures: 0, Errors: 0, Skipped: 0, Time elapsed: 0.403 sec
Java HotSpot(TM) Server VM warning: Insufficient space for shared memory file:
   /tmp/hsperfdata_jenkins/11063
Try using the -Djava.io.tmpdir= option to select an alternate temp location.
Running org.apache.hadoop.chukwa.datacollection.collector.TestFailedCollectorAck
Java HotSpot(TM) Server VM warning: Insufficient space for shared memory file:
   /tmp/hsperfdata_jenkins/11125
Try using the -Djava.io.tmpdir= option to select an alternate temp location.
Running org.apache.hadoop.chukwa.datacollection.collector.TestDelayedAcks
Build timed out (after 120 minutes). Marking the build as failed.
Archiving artifacts
Recording test results
Updating CHUKWA-300

Mime
View raw message