chukwa-dev mailing list archives

Site index · List index
Message view « Date » · « Thread »
Top « Date » · « Thread »
From Apache Jenkins Server <jenk...@builds.apache.org>
Subject Build failed in Jenkins: Chukwa-trunk #437
Date Sun, 25 Mar 2012 11:37:12 GMT
See <https://builds.apache.org/job/Chukwa-trunk/437/changes>

Changes:

[eyang] CHUKWA-638. Fixed timezone offset in test case. (Eric Yang)

------------------------------------------
[...truncated 13805 lines...]
1430 KB   1321 KB   
1432 KB   1321 KB   
1435 KB   1321 KB   
1437 KB   1321 KB   
1440 KB   1321 KB   
1442 KB   1321 KB   
1445 KB   1321 KB   
1447 KB   1321 KB   
1449 KB   1321 KB   
1451 KB   1321 KB   
1453 KB   1321 KB   
1456 KB   1321 KB   
1456 KB   1324 KB   
1456 KB   1327 KB   
1456 KB   1329 KB   
1456 KB   1331 KB   
1456 KB   1334 KB   
1456 KB   1336 KB   
1456 KB   1339 KB   
1456 KB   1341 KB   
1456 KB   1344 KB   
1456 KB   1346 KB   
1456 KB   1349 KB   
1456 KB   1352 KB   
1456 KB   1355 KB   
1456 KB   1358 KB   
1456 KB   1361 KB   
1456 KB   1363 KB   
1456 KB   1366 KB   
1456 KB   1368 KB   
1456 KB   1370 KB   
1456 KB   1372 KB   
1456 KB   1375 KB   
1456 KB   1377 KB   
1456 KB   1378 KB   
1456 KB   1380 KB   
1456 KB   1383 KB   
1456 KB   1385 KB   
1456 KB   1387 KB   
1456 KB   1388 KB   
                    
Downloaded: http://repo.maven.apache.org/maven2/org/apache/hbase/hbase/0.92.1/hbase-0.92.1-tests.jar
(1456 KB at 752.8 KB/sec)
                    
Downloaded: http://repo.maven.apache.org/maven2/com/sun/jersey/jersey-bundle/1.10/jersey-bundle-1.10.jar
(1388 KB at 639.3 KB/sec)
[INFO] 
[INFO] --- maven-clean-plugin:2.4.1:clean (default-clean) @ chukwa ---
[INFO] 
[INFO] --- maven-antrun-plugin:1.4:run (setup) @ chukwa ---
project.artifactId
[INFO] Executing tasks
    [mkdir] Created dir: <https://builds.apache.org/job/Chukwa-trunk/ws/trunk/target>
    [mkdir] Created dir: <https://builds.apache.org/job/Chukwa-trunk/ws/trunk/target/clover>
[INFO] Executed tasks
[INFO] 
[INFO] --- maven-resources-plugin:2.4.3:copy-resources (copy-configuration) @ chukwa ---
[INFO] Using 'UTF-8' encoding to copy filtered resources.
[INFO] Copying 22 resources
[INFO] 
[INFO] --- maven-resources-plugin:2.4.3:resources (default-resources) @ chukwa ---
[INFO] Using 'UTF-8' encoding to copy filtered resources.
[INFO] skip non existing resourceDirectory <https://builds.apache.org/job/Chukwa-trunk/ws/trunk/src/main/resources>
[INFO] 
[INFO] --- maven-compiler-plugin:2.3.2:compile (default-compile) @ chukwa ---
[INFO] Compiling 298 source files to <https://builds.apache.org/job/Chukwa-trunk/ws/trunk/target/classes>
[INFO] 
[INFO] --- maven-antrun-plugin:1.4:run (test-setup) @ chukwa ---
project.artifactId
[INFO] Executing tasks
    [mkdir] Created dir: <https://builds.apache.org/job/Chukwa-trunk/ws/trunk/target/test/var>
    [mkdir] Created dir: <https://builds.apache.org/job/Chukwa-trunk/ws/trunk/target/test/var/log>
    [mkdir] Created dir: <https://builds.apache.org/job/Chukwa-trunk/ws/trunk/target/test/var/run>
     [copy] Copying 3 files to <https://builds.apache.org/job/Chukwa-trunk/ws/trunk/target/test/var/log>
     [copy] Copying 1 file to <https://builds.apache.org/job/Chukwa-trunk/ws/trunk/target/test/conf>
     [copy] Copying 1 file to <https://builds.apache.org/job/Chukwa-trunk/ws/trunk/target/test/conf>
     [copy] Copying 1 file to <https://builds.apache.org/job/Chukwa-trunk/ws/trunk/target/test/conf>
     [copy] Copying 1 file to <https://builds.apache.org/job/Chukwa-trunk/ws/trunk/target/test/classes>
     [copy] Copying 1 file to <https://builds.apache.org/job/Chukwa-trunk/ws/trunk/target/test/conf>
     [copy] Copying 1 file to <https://builds.apache.org/job/Chukwa-trunk/ws/trunk/target/test/conf>
[INFO] Executed tasks
[INFO] 
[INFO] --- maven-resources-plugin:2.4.3:testResources (default-testResources) @ chukwa ---
[INFO] Using 'UTF-8' encoding to copy filtered resources.
[INFO] Copying 6 resources
[INFO] 
[INFO] --- maven-compiler-plugin:2.3.2:testCompile (default-testCompile) @ chukwa ---
[INFO] Compiling 92 source files to <https://builds.apache.org/job/Chukwa-trunk/ws/trunk/target/test-classes>
[INFO] 
[INFO] --- maven-surefire-plugin:2.10:test (default-test) @ chukwa ---
[INFO] Surefire report directory: <https://builds.apache.org/job/Chukwa-trunk/ws/trunk/target/test-reports>

-------------------------------------------------------
 T E S T S
-------------------------------------------------------

-------------------------------------------------------
 T E S T S
-------------------------------------------------------
Running org.apache.hadoop.chukwa.rest.resource.TestViewResource
Running org.apache.hadoop.chukwa.rest.resource.TestWidgetResource
Running org.apache.hadoop.chukwa.rest.resource.TestUserResource
Running org.apache.hadoop.chukwa.rest.resource.TestClientTrace
Running org.apache.hadoop.chukwa.TestChunkBuilder
Tests run: 1, Failures: 0, Errors: 0, Skipped: 0, Time elapsed: 0.108 sec
Running org.apache.hadoop.chukwa.dataloader.TestSocketDataLoader
Tests run: 1, Failures: 0, Errors: 0, Skipped: 0, Time elapsed: 0.516 sec
Running org.apache.hadoop.chukwa.hicc.TestChart
Tests run: 3, Failures: 0, Errors: 0, Skipped: 0, Time elapsed: 0.118 sec
Running org.apache.hadoop.chukwa.util.TestRecordConsts
Tests run: 2, Failures: 0, Errors: 0, Skipped: 0, Time elapsed: 0.04 sec
Running org.apache.hadoop.chukwa.util.TestCRValidator
Tests run: 3, Failures: 0, Errors: 0, Skipped: 0, Time elapsed: 0.735 sec
Running org.apache.hadoop.chukwa.util.TestCopySequenceFile
Tests run: 1, Failures: 0, Errors: 0, Skipped: 0, Time elapsed: 0.57 sec
Running org.apache.hadoop.chukwa.util.TestFilter
Tests run: 2, Failures: 0, Errors: 0, Skipped: 0, Time elapsed: 0.112 sec
Running org.apache.hadoop.chukwa.util.TestDumpChunks
Tests run: 1, Failures: 0, Errors: 0, Skipped: 0, Time elapsed: 0.614 sec
Running org.apache.hadoop.chukwa.util.TestXSSFilter
Tests run: 1, Failures: 0, Errors: 0, Skipped: 0, Time elapsed: 0.117 sec
Running org.apache.hadoop.chukwa.util.TestCreateRecordFile
Tests run: 1, Failures: 0, Errors: 0, Skipped: 0, Time elapsed: 0.667 sec
Running org.apache.hadoop.chukwa.inputtools.log4j.TestTaskLogAppender
Tests run: 1, Failures: 0, Errors: 0, Skipped: 0, Time elapsed: 2.174 sec
Running org.apache.hadoop.chukwa.inputtools.log4j.TestChukwaDailyRollingFileAppender
Tests run: 1, Failures: 0, Errors: 0, Skipped: 0, Time elapsed: 2.136 sec
Running org.apache.hadoop.chukwa.inputtools.TestInputFormat
Tests run: 1, Failures: 0, Errors: 0, Skipped: 0, Time elapsed: 0.596 sec
Running org.apache.hadoop.chukwa.tools.backfilling.TestBackfillingLoader
Tests run: 4, Failures: 0, Errors: 0, Skipped: 0, Time elapsed: 76.255 sec
Running org.apache.hadoop.chukwa.database.TestMacro
Tests run: 2, Failures: 0, Errors: 0, Skipped: 0, Time elapsed: 0.144 sec
Running org.apache.hadoop.chukwa.datacollection.sender.TestRetryListOfCollectors
Tests run: 2, Failures: 0, Errors: 0, Skipped: 0, Time elapsed: 0.33 sec
Running org.apache.hadoop.chukwa.datacollection.sender.TestAcksOnFailure
Tests run: 1, Failures: 0, Errors: 0, Skipped: 0, Time elapsed: 3.48 sec
Running org.apache.hadoop.chukwa.datacollection.adaptor.TestDirTailingAdaptor
Tests run: 2, Failures: 0, Errors: 0, Skipped: 0, Time elapsed: 23.571 sec
Running org.apache.hadoop.chukwa.datacollection.adaptor.jms.TestJMSMessagePropertyTransformer
Tests run: 9, Failures: 0, Errors: 0, Skipped: 0, Time elapsed: 10.563 sec
Running org.apache.hadoop.chukwa.datacollection.adaptor.jms.TestJMSAdaptor
Tests run: 4, Failures: 0, Errors: 0, Skipped: 0, Time elapsed: 5.221 sec
Running org.apache.hadoop.chukwa.datacollection.adaptor.TestSyslogAdaptor
Tests run: 1, Failures: 0, Errors: 0, Skipped: 0, Time elapsed: 0.384 sec
Running org.apache.hadoop.chukwa.datacollection.adaptor.TestUDPAdaptor
Tests run: 1, Failures: 0, Errors: 0, Skipped: 0, Time elapsed: 0.11 sec
Running org.apache.hadoop.chukwa.datacollection.adaptor.TestFileAdaptor
Tests run: 2, Failures: 0, Errors: 0, Skipped: 0, Time elapsed: 2.243 sec
Running org.apache.hadoop.chukwa.datacollection.adaptor.TestBufferingWrappers
Tests run: 2, Failures: 0, Errors: 0, Skipped: 0, Time elapsed: 8.772 sec
Running org.apache.hadoop.chukwa.datacollection.adaptor.filetailer.TestStartAtOffset
Tests run: 1, Failures: 0, Errors: 0, Skipped: 0, Time elapsed: 0.626 sec
Running org.apache.hadoop.chukwa.datacollection.adaptor.filetailer.TestLogRotate
Tests run: 1, Failures: 0, Errors: 0, Skipped: 0, Time elapsed: 11.663 sec
Running org.apache.hadoop.chukwa.datacollection.adaptor.filetailer.TestFileTailingAdaptors
Tests run: 3, Failures: 0, Errors: 0, Skipped: 0, Time elapsed: 10.863 sec
Running org.apache.hadoop.chukwa.datacollection.adaptor.filetailer.TestFileTailingAdaptorBigRecord
Tests run: 1, Failures: 0, Errors: 0, Skipped: 0, Time elapsed: 40.657 sec
Running org.apache.hadoop.chukwa.datacollection.adaptor.filetailer.TestRawAdaptor
Tests run: 3, Failures: 0, Errors: 0, Skipped: 0, Time elapsed: 4.038 sec
Running org.apache.hadoop.chukwa.datacollection.adaptor.filetailer.TestRCheckAdaptor
Tests run: 2, Failures: 0, Errors: 0, Skipped: 0, Time elapsed: 33.555 sec
Running org.apache.hadoop.chukwa.datacollection.adaptor.filetailer.TestFileExpirationPolicy
Tests run: 2, Failures: 0, Errors: 0, Skipped: 0, Time elapsed: 101.802 sec
Running org.apache.hadoop.chukwa.datacollection.adaptor.filetailer.TestCharFileTailingAdaptorUTF8
Tests run: 1, Failures: 0, Errors: 0, Skipped: 0, Time elapsed: 2.626 sec
Running org.apache.hadoop.chukwa.datacollection.adaptor.TestExecAdaptor
Tests run: 2, Failures: 0, Errors: 0, Skipped: 0, Time elapsed: 5.735 sec
Running org.apache.hadoop.chukwa.datacollection.collector.TestFailedCollectorAck
Tests run: 1, Failures: 0, Errors: 0, Skipped: 0, Time elapsed: 27.205 sec
Running org.apache.hadoop.chukwa.datacollection.collector.TestAdaptorTimeout
Tests run: 1, Failures: 0, Errors: 0, Skipped: 0, Time elapsed: 37.014 sec
Running org.apache.hadoop.chukwa.datacollection.collector.TestBackpressure
Tests run: 1, Failures: 0, Errors: 0, Skipped: 0, Time elapsed: 41.64 sec
Running org.apache.hadoop.chukwa.datacollection.collector.TestDelayedAcks
Tests run: 3, Failures: 0, Errors: 0, Skipped: 0, Time elapsed: 44.607 sec
Running org.apache.hadoop.chukwa.datacollection.collector.TestCollector
Tests run: 1, Failures: 0, Errors: 0, Skipped: 0, Time elapsed: 2.634 sec
Running org.apache.hadoop.chukwa.datacollection.connector.TestFailedCollector
Tests run: 1, Failures: 0, Errors: 0, Skipped: 0, Time elapsed: 3.672 sec
Running org.apache.hadoop.chukwa.datacollection.agent.rest.TestAdaptorController
Tests run: 14, Failures: 0, Errors: 0, Skipped: 0, Time elapsed: 6.872 sec
Running org.apache.hadoop.chukwa.datacollection.agent.TestAgentConfig
Tests run: 2, Failures: 0, Errors: 0, Skipped: 0, Time elapsed: 13.16 sec
Running org.apache.hadoop.chukwa.datacollection.agent.TestAgent
Tests run: 3, Failures: 0, Errors: 0, Skipped: 0, Time elapsed: 162.953 sec
Running org.apache.hadoop.chukwa.datacollection.agent.TestCmd
Tests run: 4, Failures: 0, Errors: 0, Skipped: 0, Time elapsed: 6.985 sec
Running org.apache.hadoop.chukwa.datacollection.TestOffsetStatsManager
Tests run: 3, Failures: 0, Errors: 0, Skipped: 0, Time elapsed: 13.1 sec
Running org.apache.hadoop.chukwa.datacollection.controller.TestAgentClient
Tests run: 1, Failures: 0, Errors: 0, Skipped: 0, Time elapsed: 0.525 sec
Running org.apache.hadoop.chukwa.datacollection.writer.TestSocketTee
Tests run: 1, Failures: 0, Errors: 0, Skipped: 0, Time elapsed: 0.343 sec
Running org.apache.hadoop.chukwa.datacollection.writer.TestHBaseWriter
Tests run: 1, Failures: 1, Errors: 0, Skipped: 0, Time elapsed: 95.774 sec <<< FAILURE!
Running org.apache.hadoop.chukwa.datacollection.writer.TestChukwaWriters
Tests run: 3, Failures: 0, Errors: 0, Skipped: 0, Time elapsed: 23.688 sec
Running org.apache.hadoop.chukwa.datacollection.writer.TestClientAck
Tests run: 1, Failures: 0, Errors: 0, Skipped: 0, Time elapsed: 18.097 sec
Running org.apache.hadoop.chukwa.extraction.demux.TestDemuxReducerConfigs
Tests run: 1, Failures: 0, Errors: 0, Skipped: 0, Time elapsed: 0.369 sec
Running org.apache.hadoop.chukwa.extraction.demux.TestPostDemuxTrigger
Tests run: 2, Failures: 0, Errors: 0, Skipped: 0, Time elapsed: 0.615 sec
Running org.apache.hadoop.chukwa.extraction.demux.TestDemuxMapperConfigs
Tests run: 1, Failures: 0, Errors: 0, Skipped: 0, Time elapsed: 0.377 sec
Running org.apache.hadoop.chukwa.extraction.demux.TestDemux
Tests run: 1, Failures: 0, Errors: 0, Skipped: 0, Time elapsed: 8.724 sec
Running org.apache.hadoop.chukwa.extraction.demux.processor.mapper.TestJobLogEntry
Tests run: 1, Failures: 0, Errors: 0, Skipped: 0, Time elapsed: 0.242 sec
Running org.apache.hadoop.chukwa.extraction.demux.processor.mapper.TestLog4JMetricsContextChukwaRecord
Tests run: 1, Failures: 0, Errors: 0, Skipped: 0, Time elapsed: 0.059 sec
Running org.apache.hadoop.chukwa.extraction.demux.processor.mapper.TestAbtractProcessor
Tests run: 1, Failures: 0, Errors: 0, Skipped: 0, Time elapsed: 0.118 sec
Running org.apache.hadoop.chukwa.extraction.demux.processor.mapper.TestPsOutput
Tests run: 1, Failures: 0, Errors: 0, Skipped: 0, Time elapsed: 0.028 sec
Running org.apache.hadoop.chukwa.extraction.demux.processor.mapper.TestTsProcessor
Tests run: 7, Failures: 0, Errors: 0, Skipped: 0, Time elapsed: 0.573 sec
Running org.apache.hadoop.chukwa.extraction.demux.processor.mapper.TestHadoopLogProcessor
Tests run: 1, Failures: 0, Errors: 0, Skipped: 0, Time elapsed: 1.526 sec
Running org.apache.hadoop.chukwa.extraction.demux.TestDemuxManager
Tests run: 6, Failures: 0, Errors: 0, Skipped: 0, Time elapsed: 5.747 sec

Results :

Failed tests:   testWriters(org.apache.hadoop.chukwa.datacollection.writer.TestHBaseWriter):
Call to vesta.apache.org/67.195.138.9:55666 failed on local exception: java.io.EOFException

Tests run: 129, Failures: 1, Errors: 0, Skipped: 0

[INFO] ------------------------------------------------------------------------
[INFO] BUILD FAILURE
[INFO] ------------------------------------------------------------------------
[INFO] Total time: 16:26.600s
[INFO] Finished at: Sun Mar 25 11:37:05 UTC 2012
[INFO] Final Memory: 30M/124M
[INFO] ------------------------------------------------------------------------
[ERROR] Failed to execute goal org.apache.maven.plugins:maven-surefire-plugin:2.10:test (default-test)
on project chukwa: There are test failures.
[ERROR] 
[ERROR] Please refer to <https://builds.apache.org/job/Chukwa-trunk/ws/trunk/target/test-reports>
for the individual test results.
[ERROR] -> [Help 1]
[ERROR] 
[ERROR] To see the full stack trace of the errors, re-run Maven with the -e switch.
[ERROR] Re-run Maven using the -X switch to enable full debug logging.
[ERROR] 
[ERROR] For more information about the errors and possible solutions, please read the following
articles:
[ERROR] [Help 1] http://cwiki.apache.org/confluence/display/MAVEN/MojoFailureException
Build step 'Invoke top-level Maven targets' marked build as failure
Archiving artifacts
Recording test results
Updating CHUKWA-638

Mime
View raw message