chemistry-dev mailing list archives

Site index · List index
Message view « Date » · « Thread »
Top « Date » · « Thread »
From Apache Hudson Server <hud...@hudson.apache.org>
Subject Build failed in Hudson: Chemistry - OpenCMIS - install #429
Date Mon, 06 Dec 2010 17:22:47 GMT
See <https://hudson.apache.org/hudson/job/Chemistry%20-%20OpenCMIS%20-%20install/429/changes>

Changes:

[fmui] enabled session parameter auth switches

[fmui] AtomPub client: enabled streaming for createDocument

------------------------------------------
[...truncated 1197 lines...]
[WARNING] JAR will be empty - no content was marked for inclusion!
[INFO] Building jar: <https://hudson.apache.org/hudson/job/Chemistry%20-%20OpenCMIS%20-%20install/ws/trunk/target/chemistry-opencmis-0.2.0-incubating-SNAPSHOT-tests.jar>
[HUDSON] Archiving <https://hudson.apache.org/hudson/job/Chemistry%20-%20OpenCMIS%20-%20install/ws/trunk/pom.xml>
to /home/hudson/hudson/jobs/Chemistry - OpenCMIS - install/modules/org.apache.chemistry.opencmis$chemistry-opencmis/builds/2010-12-06_15-30-13/archive/org.apache.chemistry.opencmis/chemistry-opencmis/0.2.0-incubating-SNAPSHOT/pom.xml
[HUDSON] Archiving /home/hudson/.m2/repository/org/apache/chemistry/opencmis/chemistry-opencmis/0.2.0-incubating-SNAPSHOT/chemistry-opencmis-0.2.0-incubating-SNAPSHOT.pom
to /home/hudson/hudson/jobs/Chemistry - OpenCMIS - install/modules/org.apache.chemistry.opencmis$chemistry-opencmis/builds/2010-12-06_15-30-13/archive/org.apache.chemistry.opencmis/chemistry-opencmis/0.2.0-incubating-20101206.153050-124/chemistry-opencmis-0.2.0-incubating-SNAPSHOT.pom
[HUDSON] Archiving <https://hudson.apache.org/hudson/job/Chemistry%20-%20OpenCMIS%20-%20install/ws/trunk/target/chemistry-opencmis-0.2.0-incubating-SNAPSHOT-tests.jar>
to /home/hudson/hudson/jobs/Chemistry - OpenCMIS - install/modules/org.apache.chemistry.opencmis$chemistry-opencmis/builds/2010-12-06_15-30-13/archive/org.apache.chemistry.opencmis/chemistry-opencmis/0.2.0-incubating-20101206.153050-124/chemistry-opencmis-0.2.0-incubating-SNAPSHOT-tests.jar
[INFO] ------------------------------------------------------------------------
[INFO] Building OpenCMIS Commons API
[INFO]    task-segment: [clean, deploy, jar:test-jar]
[INFO] ------------------------------------------------------------------------
[INFO] [clean:clean {execution: default-clean}]
[INFO] [remote-resources:process {execution: default}]
[INFO] [resources:resources {execution: default-resources}]
[INFO] Using 'UTF-8' encoding to copy filtered resources.
[INFO] skip non existing resourceDirectory <https://hudson.apache.org/hudson/job/Chemistry%20-%20OpenCMIS%20-%20install/ws/trunk/chemistry-opencmis-commons/chemistry-opencmis-commons-api/src/main/resources>
[INFO] Copying 3 resources
[INFO] [compiler:compile {execution: default-compile}]
[INFO] Compiling 108 source files to <https://hudson.apache.org/hudson/job/Chemistry%20-%20OpenCMIS%20-%20install/ws/trunk/chemistry-opencmis-commons/chemistry-opencmis-commons-api/target/classes>
[INFO] [bundle:manifest {execution: bundle-manifest}]
[WARNING] Warning in manifest for org.apache.chemistry.opencmis:chemistry-opencmis-commons-api:jar:0.2.0-incubating-SNAPSHOT
: Did not find matching referal for org.apache.commons.codec.*
[WARNING] Warning in manifest for org.apache.chemistry.opencmis:chemistry-opencmis-commons-api:jar:0.2.0-incubating-SNAPSHOT
: Did not find matching referal for org.apache.commons.logging.*
[INFO] [resources:testResources {execution: default-testResources}]
[INFO] Using 'UTF-8' encoding to copy filtered resources.
[INFO] skip non existing resourceDirectory <https://hudson.apache.org/hudson/job/Chemistry%20-%20OpenCMIS%20-%20install/ws/trunk/chemistry-opencmis-commons/chemistry-opencmis-commons-api/src/test/resources>
[INFO] Copying 3 resources
[INFO] [compiler:testCompile {execution: default-testCompile}]
[INFO] No sources to compile
[INFO] [surefire:test {execution: default-test}]
[INFO] Surefire report directory: <https://hudson.apache.org/hudson/job/Chemistry%20-%20OpenCMIS%20-%20install/ws/trunk/chemistry-opencmis-commons/chemistry-opencmis-commons-api/target/surefire-reports>

-------------------------------------------------------
 T E S T S
-------------------------------------------------------
There are no tests to run.

Results :

Tests run: 0, Failures: 0, Errors: 0, Skipped: 0

[HUDSON] Recording test results
[INFO] [jar:jar {execution: default-jar}]
[INFO] Building jar: <https://hudson.apache.org/hudson/job/Chemistry%20-%20OpenCMIS%20-%20install/ws/trunk/chemistry-opencmis-commons/chemistry-opencmis-commons-api/target/chemistry-opencmis-commons-api-0.2.0-incubating-SNAPSHOT.jar>
[INFO] [source:jar-no-fork {execution: attach-sources}]
[INFO] Building jar: <https://hudson.apache.org/hudson/job/Chemistry%20-%20OpenCMIS%20-%20install/ws/trunk/chemistry-opencmis-commons/chemistry-opencmis-commons-api/target/chemistry-opencmis-commons-api-0.2.0-incubating-SNAPSHOT-sources.jar>
[INFO] [install:install {execution: default-install}]
[INFO] Installing <https://hudson.apache.org/hudson/job/Chemistry%20-%20OpenCMIS%20-%20install/ws/trunk/chemistry-opencmis-commons/chemistry-opencmis-commons-api/target/chemistry-opencmis-commons-api-0.2.0-incubating-SNAPSHOT.jar>
to /home/hudson/.m2/repository/org/apache/chemistry/opencmis/chemistry-opencmis-commons-api/0.2.0-incubating-SNAPSHOT/chemistry-opencmis-commons-api-0.2.0-incubating-SNAPSHOT.jar
[INFO] Installing <https://hudson.apache.org/hudson/job/Chemistry%20-%20OpenCMIS%20-%20install/ws/trunk/chemistry-opencmis-commons/chemistry-opencmis-commons-api/target/chemistry-opencmis-commons-api-0.2.0-incubating-SNAPSHOT-sources.jar>
to /home/hudson/.m2/repository/org/apache/chemistry/opencmis/chemistry-opencmis-commons-api/0.2.0-incubating-SNAPSHOT/chemistry-opencmis-commons-api-0.2.0-incubating-SNAPSHOT-sources.jar
[INFO] [deploy:deploy {execution: default-deploy}]
[INFO] Retrieving previous build number from apache.snapshots.https
Uploading: https://repository.apache.org/content/repositories/snapshots/org/apache/chemistry/opencmis/chemistry-opencmis-commons-api/0.2.0-incubating-SNAPSHOT/chemistry-opencmis-commons-api-0.2.0-incubating-20101206.153050-124.jar
85K uploaded  (chemistry-opencmis-commons-api-0.2.0-incubating-20101206.153050-124.jar)
[INFO] Retrieving previous metadata from apache.snapshots.https
[INFO] Uploading repository metadata for: 'snapshot org.apache.chemistry.opencmis:chemistry-opencmis-commons-api:0.2.0-incubating-SNAPSHOT'
[INFO] Uploading project information for chemistry-opencmis-commons-api 0.2.0-incubating-20101206.153050-124
[INFO] Retrieving previous metadata from apache.snapshots.https
[INFO] Uploading repository metadata for: 'artifact org.apache.chemistry.opencmis:chemistry-opencmis-commons-api'
[INFO] Retrieving previous build number from apache.snapshots.https
Uploading: https://repository.apache.org/content/repositories/snapshots/org/apache/chemistry/opencmis/chemistry-opencmis-commons-api/0.2.0-incubating-SNAPSHOT/chemistry-opencmis-commons-api-0.2.0-incubating-20101206.153050-124-sources.jar
116K uploaded  (chemistry-opencmis-commons-api-0.2.0-incubating-20101206.153050-124-sources.jar)
[INFO] [jar:test-jar {execution: default-cli}]
[INFO] Building jar: <https://hudson.apache.org/hudson/job/Chemistry%20-%20OpenCMIS%20-%20install/ws/trunk/chemistry-opencmis-commons/chemistry-opencmis-commons-api/target/chemistry-opencmis-commons-api-0.2.0-incubating-SNAPSHOT-tests.jar>
[HUDSON] Archiving <https://hudson.apache.org/hudson/job/Chemistry%20-%20OpenCMIS%20-%20install/ws/trunk/chemistry-opencmis-commons/chemistry-opencmis-commons-api/pom.xml>
to /home/hudson/hudson/jobs/Chemistry - OpenCMIS - install/modules/org.apache.chemistry.opencmis$chemistry-opencmis-commons-api/builds/2010-12-06_15-30-13/archive/org.apache.chemistry.opencmis/chemistry-opencmis-commons-api/0.2.0-incubating-SNAPSHOT/pom.xml
[HUDSON] Archiving <https://hudson.apache.org/hudson/job/Chemistry%20-%20OpenCMIS%20-%20install/ws/trunk/chemistry-opencmis-commons/chemistry-opencmis-commons-api/target/chemistry-opencmis-commons-api-0.2.0-incubating-SNAPSHOT.jar>
to /home/hudson/hudson/jobs/Chemistry - OpenCMIS - install/modules/org.apache.chemistry.opencmis$chemistry-opencmis-commons-api/builds/2010-12-06_15-30-13/archive/org.apache.chemistry.opencmis/chemistry-opencmis-commons-api/0.2.0-incubating-20101206.153050-124/chemistry-opencmis-commons-api-0.2.0-incubating-SNAPSHOT.jar
[HUDSON] Archiving <https://hudson.apache.org/hudson/job/Chemistry%20-%20OpenCMIS%20-%20install/ws/trunk/chemistry-opencmis-commons/chemistry-opencmis-commons-api/target/chemistry-opencmis-commons-api-0.2.0-incubating-SNAPSHOT-sources.jar>
to /home/hudson/hudson/jobs/Chemistry - OpenCMIS - install/modules/org.apache.chemistry.opencmis$chemistry-opencmis-commons-api/builds/2010-12-06_15-30-13/archive/org.apache.chemistry.opencmis/chemistry-opencmis-commons-api/0.2.0-incubating-20101206.153050-124/chemistry-opencmis-commons-api-0.2.0-incubating-SNAPSHOT-sources.jar
[HUDSON] Archiving <https://hudson.apache.org/hudson/job/Chemistry%20-%20OpenCMIS%20-%20install/ws/trunk/chemistry-opencmis-commons/chemistry-opencmis-commons-api/target/chemistry-opencmis-commons-api-0.2.0-incubating-SNAPSHOT-tests.jar>
to /home/hudson/hudson/jobs/Chemistry - OpenCMIS - install/modules/org.apache.chemistry.opencmis$chemistry-opencmis-commons-api/builds/2010-12-06_15-30-13/archive/org.apache.chemistry.opencmis/chemistry-opencmis-commons-api/0.2.0-incubating-20101206.153050-124/chemistry-opencmis-commons-api-0.2.0-incubating-SNAPSHOT-tests.jar
[INFO] ------------------------------------------------------------------------
[INFO] Building OpenCMIS Commons Implementation
[INFO]    task-segment: [clean, deploy, jar:test-jar]
[INFO] ------------------------------------------------------------------------
Downloading: http://download.java.net/maven/2//org/codehaus/mojo/jaxws-maven-plugin/1.12/jaxws-maven-plugin-1.12.pom
3K downloaded  (jaxws-maven-plugin-1.12.pom)
Downloading: http://download.java.net/maven/2//org/jvnet/jax-ws-commons/pom/1.2/pom-1.2.pom
2K downloaded  (pom-1.2.pom)
Downloading: http://download.java.net/maven/2//org/codehaus/mojo/jaxws-maven-plugin/1.12/jaxws-maven-plugin-1.12.jar
17K downloaded  (jaxws-maven-plugin-1.12.jar)
[INFO] [clean:clean {execution: default-clean}]
Downloading: http://download.java.net/maven/1//com.sun.xml.ws/poms/jaxws-rt-2.1.7.pom
3K downloaded  (jaxws-rt-2.1.7.pom)
Downloading: http://download.java.net/maven/1//javax.xml.ws/poms/jaxws-api-2.1.pom
770b downloaded  (jaxws-api-2.1.pom)
Downloading: http://download.java.net/maven/1//javax.annotation/poms/jsr250-api-1.0.pom
165b downloaded  (jsr250-api-1.0.pom)
Downloading: http://download.java.net/maven/1//javax.jws/poms/jsr181-api-1.0-MR1.pom
156b downloaded  (jsr181-api-1.0-MR1.pom)
Downloading: http://download.java.net/maven/1//com.sun.xml.bind/poms/jaxb-impl-2.1.11.pom
340b downloaded  (jaxb-impl-2.1.11.pom)
Downloading: http://download.java.net/maven/1//com.sun.xml.messaging.saaj/poms/saaj-impl-1.3.3.pom
350b downloaded  (saaj-impl-1.3.3.pom)
Downloading: http://download.java.net/maven/1//com.sun.xml.stream.buffer/poms/streambuffer-0.9.pom
503b downloaded  (streambuffer-0.9.pom)
[INFO] artifact org.jvnet.staxex:stax-ex: checking for updates from maven-repository.dev.java.net
[INFO] artifact org.jvnet.staxex:stax-ex: checking for updates from maven2-repository.dev.java.net
[INFO] artifact org.jvnet.staxex:stax-ex: checking for updates from central
Downloading: http://download.java.net/maven/2//org/jvnet/staxex/stax-ex/1.4/stax-ex-1.4.pom
5K downloaded  (stax-ex-1.4.pom)
Downloading: http://download.java.net/maven/1//junit/poms/junit-3.8.pom
[INFO] Unable to find resource 'junit:junit:pom:3.8' in repository maven-repository.dev.java.net
(http://download.java.net/maven/1/)
Downloading: http://download.java.net/maven/2//junit/junit/3.8/junit-3.8.pom
[INFO] Unable to find resource 'junit:junit:pom:3.8' in repository maven2-repository.dev.java.net
(http://download.java.net/maven/2/)
Downloading: http://download.java.net/maven/2//junit/junit/3.8/junit-3.8.pom
[INFO] Unable to find resource 'junit:junit:pom:3.8' in repository java.net2 (http://download.java.net/maven/2/)
Downloading: http://download.java.net/maven/1//junit/poms/junit-3.8.pom
[INFO] Unable to find resource 'junit:junit:pom:3.8' in repository java.net1 (http://download.java.net/maven/1/)
Downloading: http://repo1.maven.org/maven2/junit/junit/3.8/junit-3.8.pom

Downloading: http://download.java.net/maven/1//org.codehaus.woodstox/poms/wstx-asl-3.2.3.pom
[INFO] Unable to find resource 'org.codehaus.woodstox:wstx-asl:pom:3.2.3' in repository maven-repository.dev.java.net
(http://download.java.net/maven/1/)
Downloading: http://download.java.net/maven/2//org/codehaus/woodstox/wstx-asl/3.2.3/wstx-asl-3.2.3.pom
[INFO] Unable to find resource 'org.codehaus.woodstox:wstx-asl:pom:3.2.3' in repository maven2-repository.dev.java.net
(http://download.java.net/maven/2/)
Downloading: http://repo1.maven.org/maven2/org/codehaus/woodstox/wstx-asl/3.2.3/wstx-asl-3.2.3.pom

Downloading: http://download.java.net/maven/1//stax/poms/stax-api-1.0.1.pom
[INFO] Unable to find resource 'stax:stax-api:pom:1.0.1' in repository maven-repository.dev.java.net
(http://download.java.net/maven/1/)
Downloading: http://download.java.net/maven/2//stax/stax-api/1.0.1/stax-api-1.0.1.pom
[INFO] Unable to find resource 'stax:stax-api:pom:1.0.1' in repository maven2-repository.dev.java.net
(http://download.java.net/maven/2/)
Downloading: http://repo1.maven.org/maven2/stax/stax-api/1.0.1/stax-api-1.0.1.pom

Downloading: http://download.java.net/maven/1//org.jvnet.staxex/poms/stax-ex-1.2.pom
[INFO] Unable to find resource 'org.jvnet.staxex:stax-ex:pom:1.2' in repository maven-repository.dev.java.net
(http://download.java.net/maven/1/)
Downloading: http://download.java.net/maven/2//org/jvnet/staxex/stax-ex/1.2/stax-ex-1.2.pom
5K downloaded  (stax-ex-1.2.pom)
Downloading: http://download.java.net/maven/1//javax.xml.stream/poms/stax-api-1.0.pom
193b downloaded  (stax-api-1.0.pom)
Downloading: http://download.java.net/maven/1//com.sun.org.apache.xml.internal/poms/resolver-20050927.pom
183b downloaded  (resolver-20050927.pom)
Downloading: http://download.java.net/maven/1//org.jvnet/poms/mimepull-1.3.pom
[INFO] Unable to find resource 'org.jvnet:mimepull:pom:1.3' in repository maven-repository.dev.java.net
(http://download.java.net/maven/1/)
Downloading: http://download.java.net/maven/2//org/jvnet/mimepull/1.3/mimepull-1.3.pom
4K downloaded  (mimepull-1.3.pom)
Downloading: http://download.java.net/maven/1//com.sun.xml.ws/jars/jaxws-rt-2.1.7.jar
Downloading: http://download.java.net/maven/1//javax.jws/jars/jsr181-api-1.0-MR1.jar
Downloading: http://download.java.net/maven/1//org.codehaus.woodstox/jars/wstx-asl-3.2.3.jar
Downloading: http://download.java.net/maven/1//stax/jars/stax-api-1.0.1.jar
Downloading: http://download.java.net/maven/1//javax.annotation/jars/jsr250-api-1.0.jar
[INFO] Unable to find resource 'org.codehaus.woodstox:wstx-asl:jar:3.2.3' in repository maven-repository.dev.java.net
(http://download.java.net/maven/1/)
Downloading: http://download.java.net/maven/2//org/codehaus/woodstox/wstx-asl/3.2.3/wstx-asl-3.2.3.jar
[INFO] Unable to find resource 'stax:stax-api:jar:1.0.1' in repository maven-repository.dev.java.net
(http://download.java.net/maven/1/)
Downloading: http://download.java.net/maven/2//stax/stax-api/1.0.1/stax-api-1.0.1.jar
7K downloaded  (jsr181-api-1.0-MR1.jar)
5K downloaded  (jsr250-api-1.0.jar)
[INFO] Unable to find resource 'stax:stax-api:jar:1.0.1' in repository maven2-repository.dev.java.net
(http://download.java.net/maven/2/)
Downloading: http://repo1.maven.org/maven2/stax/stax-api/1.0.1/stax-api-1.0.1.jar
[INFO] Unable to find resource 'org.codehaus.woodstox:wstx-asl:jar:3.2.3' in repository maven2-repository.dev.java.net
(http://download.java.net/maven/2/)
Downloading: http://repo1.maven.org/maven2/org/codehaus/woodstox/wstx-asl/3.2.3/wstx-asl-3.2.3.jar
Downloading: http://download.java.net/maven/1//com.sun.org.apache.xml.internal/jars/resolver-20050927.jar
Downloading: http://download.java.net/maven/1//com.sun.xml.messaging.saaj/jars/saaj-impl-1.3.3.jar

66K downloaded  (resolver-20050927.jar)
277K downloaded  (saaj-impl-1.3.3.jar)
Downloading: http://download.java.net/maven/1//javax.xml.stream/jars/stax-api-1.0.jar
Downloading: http://download.java.net/maven/1//com.sun.xml.stream.buffer/jars/streambuffer-0.9.jar
25K downloaded  (stax-api-1.0.jar)
Downloading: http://download.java.net/maven/1//com.sun.xml.bind/jars/jaxb-impl-2.1.11.jar
1284K downloaded  (jaxws-rt-2.1.7.jar)
127K downloaded  (streambuffer-0.9.jar)
Downloading: http://download.java.net/maven/1//org.jvnet.staxex/jars/stax-ex-1.2.jar
[INFO] Unable to find resource 'org.jvnet.staxex:stax-ex:jar:1.2' in repository maven-repository.dev.java.net
(http://download.java.net/maven/1/)
Downloading: http://download.java.net/maven/2//org/jvnet/staxex/stax-ex/1.2/stax-ex-1.2.jar
Downloading: http://download.java.net/maven/1//org.jvnet/jars/mimepull-1.3.jar
[INFO] Unable to find resource 'org.jvnet:mimepull:jar:1.3' in repository maven-repository.dev.java.net
(http://download.java.net/maven/1/)
Downloading: http://download.java.net/maven/2//org/jvnet/mimepull/1.3/mimepull-1.3.jar
10K downloaded  (stax-ex-1.2.jar)

Downloading: http://download.java.net/maven/1//javax.xml.ws/jars/jaxws-api-2.1.jar
37K downloaded  (mimepull-1.3.jar)
35K downloaded  (jaxws-api-2.1.jar)
846K downloaded  (jaxb-impl-2.1.11.jar)
Downloading: http://download.java.net/maven/2//com/sun/xml/ws/jaxws-tools/2.1.7/jaxws-tools-2.1.7.pom
[INFO] Unable to find resource 'com.sun.xml.ws:jaxws-tools:pom:2.1.7' in repository maven2-repository.dev.java.net
(http://download.java.net/maven/2/)
Downloading: http://download.java.net/maven/1//com.sun.xml.ws/poms/jaxws-tools-2.1.7.pom
2K downloaded  (jaxws-tools-2.1.7.pom)
Downloading: http://download.java.net/maven/2//com/sun/xml/bind/jaxb-xjc/2.1.11/jaxb-xjc-2.1.11.pom
[INFO] Unable to find resource 'com.sun.xml.bind:jaxb-xjc:pom:2.1.11' in repository maven2-repository.dev.java.net
(http://download.java.net/maven/2/)
Downloading: http://download.java.net/maven/1//com.sun.xml.bind/poms/jaxb-xjc-2.1.11.pom
345b downloaded  (jaxb-xjc-2.1.11.pom)
Downloading: http://download.java.net/maven/2//com/sun/xml/bind/jaxb-xjc/2.1.11/jaxb-xjc-2.1.11.jar
Downloading: http://download.java.net/maven/2//com/sun/xml/ws/jaxws-tools/2.1.7/jaxws-tools-2.1.7.jar
[INFO] Unable to find resource 'com.sun.xml.bind:jaxb-xjc:jar:2.1.11' in repository maven2-repository.dev.java.net
(http://download.java.net/maven/2/)
Downloading: http://download.java.net/maven/1//com.sun.xml.bind/jars/jaxb-xjc-2.1.11.jar
[INFO] Unable to find resource 'com.sun.xml.ws:jaxws-tools:jar:2.1.7' in repository maven2-repository.dev.java.net
(http://download.java.net/maven/2/)
Downloading: http://download.java.net/maven/1//com.sun.xml.ws/jars/jaxws-tools-2.1.7.jar
509K downloaded  (jaxws-tools-2.1.7.jar)
Build timed out. Aborting
[INFO] ------------------------------------------------------------------------
[ERROR] FATAL ERROR
[INFO] ------------------------------------------------------------------------
channel stopped
[INFO] hudson.remoting.RequestAbortedException: hudson.remoting.Channel$OrderlyShutdown
[INFO] ------------------------------------------------------------------------
[INFO] Trace
hudson.remoting.RequestAbortedException: hudson.remoting.RequestAbortedException: hudson.remoting.Channel$OrderlyShutdown
	at hudson.remoting.Request.call(Request.java:137)
	at hudson.remoting.Channel.call(Channel.java:630)
	at hudson.remoting.RemoteInvocationHandler.invoke(RemoteInvocationHandler.java:158)
	at $Proxy2.isArchivingDisabled(Unknown Source)
	at hudson.maven.MavenBuildProxy$Filter.isArchivingDisabled(MavenBuildProxy.java:222)
	at hudson.maven.reporters.MavenArtifact.archive(MavenArtifact.java:192)
	at hudson.maven.reporters.MavenArtifactArchiver.postBuild(MavenArtifactArchiver.java:107)
	at hudson.maven.MavenModuleSetBuild$Builder.postModule(MavenModuleSetBuild.java:800)
	at hudson.maven.MavenBuilder$Adapter.fireLeaveModule(MavenBuilder.java:317)
	at hudson.maven.MavenBuilder$Adapter.postBuild(MavenBuilder.java:275)
	at org.apache.maven.lifecycle.LifecycleExecutorInterceptor.execute(LifecycleExecutorInterceptor.java:68)
	at org.apache.maven.DefaultMaven.doExecute(DefaultMaven.java:328)
	at org.apache.maven.DefaultMaven.execute(DefaultMaven.java:138)
	at org.apache.maven.cli.MavenCli.main(MavenCli.java:362)
	at sun.reflect.NativeMethodAccessorImpl.invoke0(Native Method)
	at sun.reflect.NativeMethodAccessorImpl.invoke(NativeMethodAccessorImpl.java:39)
	at sun.reflect.DelegatingMethodAccessorImpl.invoke(DelegatingMethodAccessorImpl.java:25)
	at java.lang.reflect.Method.invoke(Method.java:597)
	at org.codehaus.classworlds.Launcher.launchEnhanced(Launcher.java:315)
	at org.codehaus.classworlds.Launcher.launch(Launcher.java:255)
	at hudson.maven.agent.Main.launch(Main.java:165)
	at hudson.maven.MavenBuilder.call(MavenBuilder.java:165)
	at hudson.maven.MavenModuleSetBuild$Builder.call(MavenModuleSetBuild.java:750)
	at hudson.maven.MavenModuleSetBuild$Builder.call(MavenModuleSetBuild.java:694)
	at hudson.remoting.UserRequest.perform(UserRequest.java:114)
	at hudson.remoting.UserRequest.perform(UserRequest.java:48)
	at hudson.remoting.Request$2.run(Request.java:270)
	at java.util.concurrent.Executors$RunnableAdapter.call(Executors.java:441)
	at java.util.concurrent.FutureTask$Sync.innerRun(FutureTask.java:303)
	at java.util.concurrent.FutureTask.run(FutureTask.java:138)
	at java.util.concurrent.ThreadPoolExecutor$Worker.runTask(ThreadPoolExecutor.java:886)
	at java.util.concurrent.ThreadPoolExecutor$Worker.run(ThreadPoolExecutor.java:908)
	at java.lang.Thread.run(Thread.java:619)
Caused by: hudson.remoting.RequestAbortedException: hudson.remoting.Channel$OrderlyShutdown
	at hudson.remoting.Request.abort(Request.java:257)
	at hudson.remoting.Channel.terminate(Channel.java:681)
	at hudson.remoting.Channel$CloseCommand.execute(Channel.java:764)
	at hudson.remoting.Channel$ReaderThread.run(Channel.java:963)
Caused by: hudson.remoting.Channel$OrderlyShutdown
	... 2 more
Caused by: Command close created at
	at hudson.remoting.Command.<init>(Command.java:58)
	at hudson.remoting.Command.<init>(Command.java:47)
	at hudson.remoting.Channel$CloseCommand.<init>(Channel.java:760)
	at hudson.remoting.Channel$CloseCommand.<init>(Channel.java:760)
	at hudson.remoting.Channel.close(Channel.java:805)
	at hudson.slaves.Channels$1.close(Channels.java:91)
	at hudson.maven.ProcessCache$MavenProcess.discard(ProcessCache.java:145)
	at hudson.maven.MavenModuleSetBuild$RunnerImpl.doRun(MavenModuleSetBuild.java:541)
	at hudson.model.AbstractBuild$AbstractRunner.run(AbstractBuild.java:416)
	at hudson.model.Run.run(Run.java:1324)
	at hudson.maven.MavenModuleSetBuild.run(MavenModuleSetBuild.java:349)
	at hudson.model.ResourceController.execute(ResourceController.java:88)
	at hudson.model.Executor.run(Executor.java:139)
[INFO] ------------------------------------------------------------------------
[INFO] Total time: 112 minutes 24 seconds
[INFO] Finished at: Mon Dec 06 09:22:46 PST 2010
[INFO] Final Memory: 50M/492M
[INFO] ------------------------------------------------------------------------


Mime
View raw message