chemistry-commits mailing list archives

Site index · List index
Message view « Date » · « Thread »
Top « Date » · « Thread »
From Apache Jenkins Server <jenk...@builds.apache.org>
Subject Build failed in Jenkins: Chemistry - OpenCMIS - install #2392
Date Sat, 30 Nov 2013 05:52:59 GMT
See <https://builds.apache.org/job/Chemistry%20-%20OpenCMIS%20-%20install/2392/>

------------------------------------------
[...truncated 3662 lines...]

Basics Test Group (WEBSERVICES) (3 tests)
  Security Test (WEBSERVICES) (326ms): WARNING
  Repository Info Test (WEBSERVICES) (322ms): WARNING
  Root Folder Test (WEBSERVICES) (1274ms): OK


Types Test Group (WEBSERVICES) (3 tests)
  Types Test (WEBSERVICES) (1083ms): INFO
  Create and Delete Type Test (WEBSERVICES) (300ms): SKIPPED
  Secondary Types Test (WEBSERVICES) (304ms): SKIPPED


CRUD Test Group (WEBSERVICES) (17 tests)
  Create and Delete Folder Test (WEBSERVICES) (6075ms): INFO
  Create and Delete Document Test (WEBSERVICES) (5661ms): INFO
  Create Big Document Test (WEBSERVICES) (2320ms): OK
  Create Document without Content Test (WEBSERVICES) (1517ms): OK
  Create Object With Invalid Type Test (WEBSERVICES) (1333ms): OK
  Name Charset Test (WEBSERVICES) (3521ms): INFO
  Create and Delete Relationship Test (WEBSERVICES) (1874ms): OK
  Create and Delete Item Test (WEBSERVICES) (301ms): SKIPPED
  Update Smoke Test (WEBSERVICES) (1495ms): OK
  Bulk Update Properties Test (WEBSERVICES) (298ms): SKIPPED
  Set, Append, and Delete Content Test (WEBSERVICES) (1416ms): OK
  Change Token Test (WEBSERVICES) (1922ms): OK
  Content Ranges Test (WEBSERVICES) (1405ms): OK
  Copy Test (WEBSERVICES) (1587ms): OK
  Move Test (WEBSERVICES) (1536ms): OK
  Delete Tree Test (WEBSERVICES) (2742ms): OK
  Operation Context (WEBSERVICES) (1378ms): OK


Versioning Test Group (WEBSERVICES) (4 tests)
  Versioning Smoke Test (WEBSERVICES) (1352ms): SKIPPED
  Versioning Delete Test (WEBSERVICES) (1361ms): SKIPPED
  Versioning State Create Test (WEBSERVICES) (1433ms): SKIPPED
  Checked out Test (WEBSERVICES) (1391ms): WARNING


Filing Test Group (WEBSERVICES) (2 tests)
  Multifiling Test (WEBSERVICES) (2485ms): OK
  Unfiling Test (WEBSERVICES) (2095ms): OK


Control Test Group (WEBSERVICES) (1 tests)
  ACL Test (WEBSERVICES) (1700ms): OK


Query Test Group (WEBSERVICES) (6 tests)
  Query Smoke Test (WEBSERVICES) (619ms): INFO
  Query Root Folder Test (WEBSERVICES) (923ms): INFO
  Query For Object Test (WEBSERVICES)2013-11-30 05:35:10.583:INFO::org.mortbay.io.nio.SelectorManager$SelectSet@678641
JVM BUG(s) - injecting delay6 times
2013-11-30 05:35:10.584:INFO::org.mortbay.io.nio.SelectorManager$SelectSet@678641 JVM BUG(s)
- recreating selector 6 times, canceled keys 315 times
 (1835ms): INFO
  Query LIKE Test (WEBSERVICES) (716ms): OK
  Query IN_FOLDER and IN_TREE Test (WEBSERVICES) (6269ms): INFO
  Content Changes Smoke Test (WEBSERVICES) (1468ms): OK

Tests run: 1, Failures: 0, Errors: 0, Skipped: 0, Time elapsed: 63.648 sec
Running org.apache.chemistry.opencmis.fit.tck.AtomPub11VersTckIT

Basics Test Group (ATOMPUB) (3 tests)
  Security Test (ATOMPUB) (2ms): WARNING
  Repository Info Test (ATOMPUB) (4ms): WARNING
  Root Folder Test (ATOMPUB) (11ms): OK


Types Test Group (ATOMPUB) (3 tests)
  Types Test (ATOMPUB) (227ms): INFO
  Create and Delete Type Test (ATOMPUB) (19ms): INFO
  Secondary Types Test (ATOMPUB) (54ms): OK


CRUD Test Group (ATOMPUB) (17 tests)
  Create and Delete Folder Test (ATOMPUB) (1343ms): INFO
  Create and Delete Document Test (ATOMPUB) (2900ms): INFO
  Create Big Document Test (ATOMPUB) (770ms): OK
  Create Document without Content Test (ATOMPUB) (23ms): OK
  Create Object With Invalid Type Test (ATOMPUB) (26ms): WARNING
  Name Charset Test (ATOMPUB) (537ms): INFO
  Create and Delete Relationship Test (ATOMPUB) (55ms): OK
  Create and Delete Item Test (ATOMPUB) (816ms): INFO
  Update Smoke Test (ATOMPUB) (47ms): OK
  Bulk Update Properties Test (ATOMPUB) (1149ms): OK
  Set, Append, and Delete Content Test (ATOMPUB) (41ms): OK
  Change Token Test (ATOMPUB) (85ms): SKIPPED
  Content Ranges Test (ATOMPUB) (31ms): OK
  Copy Test (ATOMPUB) (608ms): OK
  Move Test (ATOMPUB) (57ms): OK
  Delete Tree Test (ATOMPUB) (228ms): OK
  Operation Context (ATOMPUB) (30ms): OK


Versioning Test Group (ATOMPUB) (4 tests)
  Versioning Smoke Test (ATOMPUB) (68ms): OK
  Versioning Delete Test (ATOMPUB) (687ms): OK
  Versioning State Create Test (ATOMPUB) (54ms): OK
  Checked out Test (ATOMPUB) (41ms): INFO


Filing Test Group (ATOMPUB) (2 tests)
  Multifiling Test (ATOMPUB) (242ms): OK
  Unfiling Test (ATOMPUB) (718ms): OK


Control Test Group (ATOMPUB) (1 tests)
  ACL Test (ATOMPUB) (30ms): OK


Query Test Group (ATOMPUB) (6 tests)
  Query Smoke Test (ATOMPUB) (6ms): INFO
  Query Root Folder Test (ATOMPUB) (11ms): INFO
  Query For Object Test (ATOMPUB) (41ms): INFO
  Query LIKE Test (ATOMPUB) (90ms): OK
  Query IN_FOLDER and IN_TREE Test (ATOMPUB) (1927ms): INFO
  Content Changes Smoke Test (ATOMPUB) (34ms): INFO

Tests run: 1, Failures: 0, Errors: 0, Skipped: 0, Time elapsed: 13.022 sec
Running org.apache.chemistry.opencmis.fit.tck.WebServices11VersTckIT

Basics Test Group (WEBSERVICES) (3 tests)
  Security Test (WEBSERVICES) (297ms): WARNING
  Repository Info Test (WEBSERVICES) (300ms): WARNING
  Root Folder Test (WEBSERVICES) (1233ms): OK


Types Test Group (WEBSERVICES) (3 tests)
  Types Test (WEBSERVICES) (1102ms): INFO
  Create and Delete Type Test (WEBSERVICES) (351ms): INFO
  Secondary Types Test (WEBSERVICES) (1528ms): OK


CRUD Test Group (WEBSERVICES) (17 tests)
  Create and Delete Folder Test (WEBSERVICES) (5720ms): INFO
  Create and Delete Document Test (WEBSERVICES) (8804ms): INFO
  Create Big Document Test (WEBSERVICES) (2371ms): OK
  Create Document without Content Test (WEBSERVICES) (1544ms): OK
  Create Object With Invalid Type Test (WEBSERVICES) (1308ms): OK
  Name Charset Test (WEBSERVICES) (3379ms): INFO
  Create and Delete Relationship Test (WEBSERVICES) (1846ms): OK
  Create and Delete Item Test (WEBSERVICES) (2387ms): INFO
  Update Smoke Test (WEBSERVICES) (1459ms): OK
  Bulk Update Properties Test (WEBSERVICES) (4088ms): INFO
  Set, Append, and Delete Content Test (WEBSERVICES)2013-11-30 05:36:10.806:INFO::org.mortbay.io.nio.SelectorManager$SelectSet@678641
JVM BUG(s) - injecting delay14 times
2013-11-30 05:36:10.807:INFO::org.mortbay.io.nio.SelectorManager$SelectSet@678641 JVM BUG(s)
- recreating selector 14 times, canceled keys 522 times
 (1738ms): OK
  Change Token Test (WEBSERVICES) (1812ms): SKIPPED
  Content Ranges Test (WEBSERVICES) (1407ms): OK
  Copy Test (WEBSERVICES) (1550ms): OK
  Move Test (WEBSERVICES) (1521ms): OK
Build timed out (after 83 minutes). Marking the build as failed.
  Delete Tree Test (WEBSERVICES) (2715ms): OK
  Operation Context (WEBSERVICES) (1376ms): OK


Versioning Test Group (WEBSERVICES) (4 tests)
  Versioning Smoke Test (WEBSERVICES) (1935ms): OK
  Versioning Delete Test (WEBSERVICES)
Results :

Tests run: 7, Failures: 0, Errors: 0, Skipped: 0

[INFO] ------------------------------------------------------------------------
[INFO] Reactor Summary:
[INFO] 
[INFO] Apache Chemistry OpenCMIS ......................... SUCCESS [46.352s]
[INFO] OpenCMIS Commons API .............................. SUCCESS [29.010s]
[INFO] OpenCMIS Commons Implementation ................... SUCCESS [59.823s]
[INFO] OpenCMIS Client API ............................... SUCCESS [25.795s]
[INFO] OpenCMIS Client Bindings Implementation ........... SUCCESS [31.206s]
[INFO] OpenCMIS Client Implementation .................... SUCCESS [31.145s]
[INFO] OpenCMIS Server Support ........................... SUCCESS [37.131s]
[INFO] OpenCMIS Server Implementation .................... SUCCESS [29.641s]
[INFO] OpenCMIS Server Implementation WAR packaging ...... SUCCESS [18.310s]
[INFO] OpenCMIS Test Utilities ........................... SUCCESS [29.452s]
[INFO] OpenCMIS InMemory Server WAR packaging ............ SUCCESS [28.657s]
[INFO] OpenCMIS FileShare Server Implementation .......... SUCCESS [30.992s]
[INFO] OpenCMIS JCR Server Implementation ................ SUCCESS [34.643s]
[INFO] OpenCMIS Server Archetype ......................... SUCCESS [41.891s]
[INFO] OpenCMIS Bridge WAR packaging ..................... SUCCESS [30.378s]
[INFO] OpenCMIS Test Compatibility Kit ................... SUCCESS [33.452s]
[INFO] OpenCMIS Full Integration Tests ................... FAILURE [5:09.064s]
[INFO] OpenCMIS Tools .................................... SKIPPED
[INFO] OpenCMIS Browser .................................. SKIPPED
[INFO] OpenCMIS Browser Application ...................... SKIPPED
[INFO] OpenCMIS Workbench ................................ SKIPPED
[INFO] OpenCMIS OSGi Client Wrapper ...................... SKIPPED
[INFO] OpenCMIS Android Client ........................... SKIPPED
[INFO] OpenCMIS Assemblies Distribution .................. SKIPPED
[INFO] ------------------------------------------------------------------------
[INFO] BUILD FAILURE
[INFO] ------------------------------------------------------------------------
[INFO] Total time: 1:22:12.536s
[INFO] Finished at: Sat Nov 30 05:36:24 UTC 2013
[INFO] Final Memory: 106M/281M
[INFO] ------------------------------------------------------------------------
[ERROR] Internal error: java.lang.IllegalStateException: Unable to call isArchivingDisabled.
Invalid object ID 26 -> [Help 1]
org.apache.maven.InternalErrorException: Internal error: java.lang.IllegalStateException:
Unable to call isArchivingDisabled. Invalid object ID 26
	at org.apache.maven.DefaultMaven.execute(DefaultMaven.java:168)
	at org.jvnet.hudson.maven3.launcher.Maven3Launcher.main(Maven3Launcher.java:117)
	at sun.reflect.NativeMethodAccessorImpl.invoke0(Native Method)
	at sun.reflect.NativeMethodAccessorImpl.invoke(NativeMethodAccessorImpl.java:39)
	at sun.reflect.DelegatingMethodAccessorImpl.invoke(DelegatingMethodAccessorImpl.java:25)
	at java.lang.reflect.Method.invoke(Method.java:597)
	at org.codehaus.plexus.classworlds.launcher.Launcher.launchStandard(Launcher.java:329)
	at org.codehaus.plexus.classworlds.launcher.Launcher.launch(Launcher.java:239)
	at org.jvnet.hudson.maven3.agent.Maven3Main.launch(Maven3Main.java:178)
	at sun.reflect.NativeMethodAccessorImpl.invoke0(Native Method)
	at sun.reflect.NativeMethodAccessorImpl.invoke(NativeMethodAccessorImpl.java:39)
	at sun.reflect.DelegatingMethodAccessorImpl.invoke(DelegatingMethodAccessorImpl.java:25)
	at java.lang.reflect.Method.invoke(Method.java:597)
	at hudson.maven.Maven3Builder.call(Maven3Builder.java:134)
	at hudson.maven.Maven3Builder.call(Maven3Builder.java:69)
	at hudson.remoting.UserRequest.perform(UserRequest.java:118)
	at hudson.remoting.UserRequest.perform(UserRequest.java:48)
	at hudson.remoting.Request$2.run(Request.java:328)
	at hudson.remoting.InterceptingExecutorService$1.call(InterceptingExecutorService.java:72)
	at java.util.concurrent.FutureTask$Sync.innerRun(FutureTask.java:303)
	at java.util.concurrent.FutureTask.run(FutureTask.java:138)
	at java.util.concurrent.ThreadPoolExecutor$Worker.runTask(ThreadPoolExecutor.java:895)
	at java.util.concurrent.ThreadPoolExecutor$Worker.run(ThreadPoolExecutor.java:918)
	at java.lang.Thread.run(Thread.java:662)
Caused by: java.lang.IllegalStateException: Unable to call isArchivingDisabled. Invalid object
ID 26
	at hudson.remoting.RemoteInvocationHandler$RPCRequest.perform(RemoteInvocationHandler.java:293)
	at hudson.remoting.RemoteInvocationHandler$RPCRequest.call(RemoteInvocationHandler.java:280)
	at hudson.remoting.RemoteInvocationHandler$RPCRequest.call(RemoteInvocationHandler.java:239)
	at hudson.remoting.UserRequest.perform(UserRequest.java:118)
	at hudson.remoting.UserRequest.perform(UserRequest.java:48)
	at hudson.remoting.Request$2.run(Request.java:328)
	at hudson.remoting.InterceptingExecutorService$1.call(InterceptingExecutorService.java:72)
	at java.util.concurrent.FutureTask$Sync.innerRun(FutureTask.java:334)
	at java.util.concurrent.FutureTask.run(FutureTask.java:166)
	at java.util.concurrent.ThreadPoolExecutor.runWorker(ThreadPoolExecutor.java:1145)
	at java.util.concurrent.ThreadPoolExecutor$Worker.run(ThreadPoolExecutor.java:615)
	at java.lang.Thread.run(Thread.java:724)
[ERROR] 
[ERROR] To see the full stack trace of the errors, re-run Maven with the -e switch.
[ERROR] Re-run Maven using the -X switch to enable full debug logging.
[ERROR] 
[ERROR] For more information about the errors and possible solutions, please read the following
articles:
[ERROR] [Help 1] http://cwiki.apache.org/confluence/display/MAVEN/InternalErrorException
2013-11-30 05:37:11.082:INFO::org.mortbay.io.nio.SelectorManager$SelectSet@678641 JVM BUG(s)
- injecting delay1 times
2013-11-30 05:37:11.082:INFO::org.mortbay.io.nio.SelectorManager$SelectSet@678641 JVM BUG(s)
- recreating selector 1 times, canceled keys 311 times
2013-11-30 05:38:11.650:INFO::org.mortbay.io.nio.SelectorManager$SelectSet@678641 JVM BUG(s)
- injecting delay10 times
2013-11-30 05:38:11.650:INFO::org.mortbay.io.nio.SelectorManager$SelectSet@678641 JVM BUG(s)
- recreating selector 10 times, canceled keys 362 times
channel stopped
2013-11-30 05:52:55.664:INFO::Shutdown hook executing
2013-11-30 05:52:56.286:INFO::Shutdown hook complete

Mime
View raw message