chemistry-commits mailing list archives

Site index · List index
Message view « Date » · « Thread »
Top « Date » · « Thread »
From Apache Jenkins Server <jenk...@builds.apache.org>
Subject Build failed in Jenkins: Chemistry - OpenCMIS - install #2381
Date Wed, 20 Nov 2013 19:09:09 GMT
See <https://builds.apache.org/job/Chemistry%20-%20OpenCMIS%20-%20install/2381/>

------------------------------------------
[...truncated 3670 lines...]

Types Test Group (WEBSERVICES) (3 tests)
  Types Test (WEBSERVICES) (1108ms): INFO
  Create and Delete Type Test (WEBSERVICES) (304ms): SKIPPED
  Secondary Types Test (WEBSERVICES) (305ms): SKIPPED


CRUD Test Group (WEBSERVICES) (17 tests)
  Create and Delete Folder Test (WEBSERVICES) (6120ms): INFO
  Create and Delete Document Test (WEBSERVICES) (5618ms): INFO
  Create Big Document Test (WEBSERVICES) (1695ms): OK
  Create Document without Content Test (WEBSERVICES) (1532ms): OK
  Create Object With Invalid Type Test (WEBSERVICES) (1339ms): OK
  Name Charset Test (WEBSERVICES) (3574ms): INFO
  Create and Delete Relationship Test (WEBSERVICES) (1884ms): OK
  Create and Delete Item Test (WEBSERVICES) (299ms): SKIPPED
  Update Smoke Test (WEBSERVICES) (1498ms): OK
  Bulk Update Properties Test (WEBSERVICES) (299ms): SKIPPED
  Set, Append, and Delete Content Test (WEBSERVICES) (1444ms): OK
  Change Token Test (WEBSERVICES) (1735ms): OK
  Content Ranges Test (WEBSERVICES) (1551ms): OK
  Copy Test (WEBSERVICES) (1598ms): OK
  Move Test (WEBSERVICES) (1533ms): OK
  Delete Tree Test (WEBSERVICES) (2804ms): OK
  Operation Context (WEBSERVICES) (1407ms): OK


Versioning Test Group (WEBSERVICES) (4 tests)
  Versioning Smoke Test (WEBSERVICES) (1382ms): SKIPPED
  Versioning Delete Test (WEBSERVICES) (1366ms): SKIPPED
  Versioning State Create Test (WEBSERVICES) (1459ms): SKIPPED
  Checked out Test (WEBSERVICES) (1381ms): WARNING


Filing Test Group (WEBSERVICES) (2 tests)
  Multifiling Test (WEBSERVICES) (2560ms): OK
  Unfiling Test (WEBSERVICES) (2090ms): OK


Control Test Group (WEBSERVICES) (1 tests)
  ACL Test (WEBSERVICES) (1688ms): OK


Query Test Group (WEBSERVICES) (6 tests)
  Query Smoke Test (WEBSERVICES) (605ms): INFO
  Query Root Folder Test (WEBSERVICES) (940ms): INFO
  Query For Object Test (WEBSERVICES)2013-11-20 18:54:38.101:INFO::org.mortbay.io.nio.SelectorManager$SelectSet@1fd3e1d
JVM BUG(s) - injecting delay6 times
2013-11-20 18:54:38.102:INFO::org.mortbay.io.nio.SelectorManager$SelectSet@1fd3e1d JVM BUG(s)
- recreating selector 6 times, canceled keys 322 times
 (1892ms): INFO
  Query LIKE Test (WEBSERVICES) (712ms): OK
  Query IN_FOLDER and IN_TREE Test (WEBSERVICES) (6331ms): INFO
  Content Changes Smoke Test (WEBSERVICES) (1459ms): OK

Tests run: 1, Failures: 0, Errors: 0, Skipped: 0, Time elapsed: 63.469 sec
Running org.apache.chemistry.opencmis.fit.tck.AtomPub11VersTckIT

Basics Test Group (ATOMPUB) (3 tests)
  Security Test (ATOMPUB) (3ms): WARNING
  Repository Info Test (ATOMPUB) (7ms): WARNING
  Root Folder Test (ATOMPUB) (8ms): OK


Types Test Group (ATOMPUB) (3 tests)
  Types Test (ATOMPUB) (220ms): INFO
  Create and Delete Type Test (ATOMPUB) (18ms): INFO
  Secondary Types Test (ATOMPUB) (52ms): OK


CRUD Test Group (ATOMPUB) (17 tests)
  Create and Delete Folder Test (ATOMPUB) (1581ms): INFO
  Create and Delete Document Test (ATOMPUB) (2266ms): INFO
  Create Big Document Test (ATOMPUB) (772ms): OK
  Create Document without Content Test (ATOMPUB) (27ms): OK
  Create Object With Invalid Type Test (ATOMPUB) (25ms): WARNING
  Name Charset Test (ATOMPUB) (1128ms): INFO
  Create and Delete Relationship Test (ATOMPUB) (54ms): OK
  Create and Delete Item Test (ATOMPUB) (819ms): INFO
  Update Smoke Test (ATOMPUB) (47ms): OK
  Bulk Update Properties Test (ATOMPUB) (1119ms): OK
  Set, Append, and Delete Content Test (ATOMPUB) (42ms): OK
  Change Token Test (ATOMPUB) (81ms): SKIPPED
  Content Ranges Test (ATOMPUB) (30ms): OK
  Copy Test (ATOMPUB) (60ms): OK
  Move Test (ATOMPUB) (258ms): OK
  Delete Tree Test (ATOMPUB) (634ms): OK
  Operation Context (ATOMPUB) (31ms): OK


Versioning Test Group (ATOMPUB) (4 tests)
  Versioning Smoke Test (ATOMPUB) (68ms): OK
  Versioning Delete Test (ATOMPUB) (338ms): OK
  Versioning State Create Test (ATOMPUB) (393ms): OK
  Checked out Test (ATOMPUB) (41ms): INFO


Filing Test Group (ATOMPUB) (2 tests)
  Multifiling Test (ATOMPUB) (226ms): OK
  Unfiling Test (ATOMPUB) (769ms): OK


Control Test Group (ATOMPUB) (1 tests)
  ACL Test (ATOMPUB) (31ms): OK


Query Test Group (ATOMPUB) (6 tests)
  Query Smoke Test (ATOMPUB) (6ms): INFO
  Query Root Folder Test (ATOMPUB) (12ms): INFO
  Query For Object Test (ATOMPUB) (42ms): INFO
  Query LIKE Test (ATOMPUB) (81ms): OK
  Query IN_FOLDER and IN_TREE Test (ATOMPUB) (1877ms): INFO
  Content Changes Smoke Test (ATOMPUB) (33ms): INFO

Tests run: 1, Failures: 0, Errors: 0, Skipped: 0, Time elapsed: 13.208 sec
Running org.apache.chemistry.opencmis.fit.tck.WebServices11VersTckIT

Basics Test Group (WEBSERVICES) (3 tests)
  Security Test (WEBSERVICES) (298ms): WARNING
  Repository Info Test (WEBSERVICES) (305ms): WARNING
  Root Folder Test (WEBSERVICES) (1235ms): OK


Types Test Group (WEBSERVICES) (3 tests)
  Types Test (WEBSERVICES) (1125ms): INFO
  Create and Delete Type Test (WEBSERVICES) (352ms): INFO
  Secondary Types Test (WEBSERVICES) (1522ms): OK


CRUD Test Group (WEBSERVICES) (17 tests)
  Create and Delete Folder Test (WEBSERVICES) (5827ms): INFO
  Create and Delete Document Test (WEBSERVICES) (8915ms): INFO
  Create Big Document Test (WEBSERVICES) (2340ms): OK
  Create Document without Content Test (WEBSERVICES) (1348ms): OK
  Create Object With Invalid Type Test (WEBSERVICES) (1493ms): OK
  Name Charset Test (WEBSERVICES) (3396ms): INFO
  Create and Delete Relationship Test (WEBSERVICES) (1849ms): OK
  Create and Delete Item Test (WEBSERVICES) (2400ms): INFO
  Update Smoke Test (WEBSERVICES) (1454ms): OK
  Bulk Update Properties Test (WEBSERVICES)2013-11-20 18:55:38.108:INFO::org.mortbay.io.nio.SelectorManager$SelectSet@1fd3e1d
JVM BUG(s) - injecting delay14 times
2013-11-20 18:55:38.108:INFO::org.mortbay.io.nio.SelectorManager$SelectSet@1fd3e1d JVM BUG(s)
- recreating selector 14 times, canceled keys 524 times
 (4137ms): INFO
  Set, Append, and Delete Content Test (WEBSERVICES) (1746ms): OK
  Change Token Test (WEBSERVICES) (1843ms): SKIPPED
  Content Ranges Test (WEBSERVICES) (1418ms): OK
  Copy Test (WEBSERVICES) (1582ms): OK
  Move Test (WEBSERVICES) (1518ms): OK
  Delete Tree Test (WEBSERVICES) (2732ms): OK
  Operation Context (WEBSERVICES) (1364ms): OK


Versioning Test Group (WEBSERVICES) (4 tests)
  Versioning Smoke Test (WEBSERVICES) (1938ms): OK
  Versioning Delete Test (WEBSERVICES) (2228ms): OK
  Versioning State Create Test (WEBSERVICES) (1789ms): OK
  Checked out Test (WEBSERVICES) (1744ms): INFO


Filing Test Group (WEBSERVICES) (2 tests)
Build timed out (after 83 minutes). Marking the build as failed.
  Multifiling Test (WEBSERVICES)
Results :

Tests run: 7, Failures: 0, Errors: 0, Skipped: 0

[INFO] ------------------------------------------------------------------------
[INFO] Reactor Summary:
[INFO] 
[INFO] Apache Chemistry OpenCMIS ......................... SUCCESS [1:05.371s]
[INFO] OpenCMIS Commons API .............................. SUCCESS [29.509s]
[INFO] OpenCMIS Commons Implementation ................... SUCCESS [1:00.786s]
[INFO] OpenCMIS Client API ............................... SUCCESS [27.179s]
[INFO] OpenCMIS Client Bindings Implementation ........... SUCCESS [45.307s]
[INFO] OpenCMIS Client Implementation .................... SUCCESS [47.155s]
[INFO] OpenCMIS Server Support ........................... SUCCESS [35.080s]
[INFO] OpenCMIS Server Implementation .................... SUCCESS [1:09.396s]
[INFO] OpenCMIS Server Implementation WAR packaging ...... SUCCESS [31.926s]
[INFO] OpenCMIS Test Utilities ........................... SUCCESS [33.851s]
[INFO] OpenCMIS InMemory Server WAR packaging ............ SUCCESS [41.620s]
[INFO] OpenCMIS FileShare Server Implementation .......... SUCCESS [38.406s]
[INFO] OpenCMIS JCR Server Implementation ................ SUCCESS [36.779s]
[INFO] OpenCMIS Server Archetype ......................... SUCCESS [35.756s]
[INFO] OpenCMIS Bridge WAR packaging ..................... SUCCESS [32.582s]
[INFO] OpenCMIS Test Compatibility Kit ................... SUCCESS [38.426s]
[INFO] OpenCMIS Full Integration Tests ................... FAILURE [5:15.514s]
[INFO] OpenCMIS Tools .................................... SKIPPED
[INFO] OpenCMIS Browser .................................. SKIPPED
[INFO] OpenCMIS Browser Application ...................... SKIPPED
[INFO] OpenCMIS Workbench ................................ SKIPPED
[INFO] OpenCMIS OSGi Client Wrapper ...................... SKIPPED
[INFO] OpenCMIS Android Client ........................... SKIPPED
[INFO] OpenCMIS Assemblies Distribution .................. SKIPPED
[INFO] ------------------------------------------------------------------------
[INFO] BUILD FAILURE
[INFO] ------------------------------------------------------------------------
[INFO] Total time: 1:21:59.913s
[INFO] Finished at: Wed Nov 20 18:55:59 UTC 2013
[INFO] Final Memory: 105M/276M
[INFO] ------------------------------------------------------------------------
[ERROR] Internal error: java.lang.IllegalStateException: Unable to call isArchivingDisabled.
Invalid object ID 26 -> [Help 1]
org.apache.maven.InternalErrorException: Internal error: java.lang.IllegalStateException:
Unable to call isArchivingDisabled. Invalid object ID 26
	at org.apache.maven.DefaultMaven.execute(DefaultMaven.java:168)
	at org.jvnet.hudson.maven3.launcher.Maven3Launcher.main(Maven3Launcher.java:117)
	at sun.reflect.NativeMethodAccessorImpl.invoke0(Native Method)
	at sun.reflect.NativeMethodAccessorImpl.invoke(NativeMethodAccessorImpl.java:39)
	at sun.reflect.DelegatingMethodAccessorImpl.invoke(DelegatingMethodAccessorImpl.java:25)
	at java.lang.reflect.Method.invoke(Method.java:597)
	at org.codehaus.plexus.classworlds.launcher.Launcher.launchStandard(Launcher.java:329)
	at org.codehaus.plexus.classworlds.launcher.Launcher.launch(Launcher.java:239)
	at org.jvnet.hudson.maven3.agent.Maven3Main.launch(Maven3Main.java:178)
	at sun.reflect.NativeMethodAccessorImpl.invoke0(Native Method)
	at sun.reflect.NativeMethodAccessorImpl.invoke(NativeMethodAccessorImpl.java:39)
	at sun.reflect.DelegatingMethodAccessorImpl.invoke(DelegatingMethodAccessorImpl.java:25)
	at java.lang.reflect.Method.invoke(Method.java:597)
	at hudson.maven.Maven3Builder.call(Maven3Builder.java:134)
	at hudson.maven.Maven3Builder.call(Maven3Builder.java:69)
	at hudson.remoting.UserRequest.perform(UserRequest.java:118)
	at hudson.remoting.UserRequest.perform(UserRequest.java:48)
	at hudson.remoting.Request$2.run(Request.java:328)
	at hudson.remoting.InterceptingExecutorService$1.call(InterceptingExecutorService.java:72)
	at java.util.concurrent.FutureTask$Sync.innerRun(FutureTask.java:303)
	at java.util.concurrent.FutureTask.run(FutureTask.java:138)
	at java.util.concurrent.ThreadPoolExecutor$Worker.runTask(ThreadPoolExecutor.java:895)
	at java.util.concurrent.ThreadPoolExecutor$Worker.run(ThreadPoolExecutor.java:918)
	at java.lang.Thread.run(Thread.java:662)
Caused by: java.lang.IllegalStateException: Unable to call isArchivingDisabled. Invalid object
ID 26
	at hudson.remoting.RemoteInvocationHandler$RPCRequest.perform(RemoteInvocationHandler.java:293)
	at hudson.remoting.RemoteInvocationHandler$RPCRequest.call(RemoteInvocationHandler.java:280)
	at hudson.remoting.RemoteInvocationHandler$RPCRequest.call(RemoteInvocationHandler.java:239)
	at hudson.remoting.UserRequest.perform(UserRequest.java:118)
	at hudson.remoting.UserRequest.perform(UserRequest.java:48)
	at hudson.remoting.Request$2.run(Request.java:328)
	at hudson.remoting.InterceptingExecutorService$1.call(InterceptingExecutorService.java:72)
	at java.util.concurrent.FutureTask$Sync.innerRun(FutureTask.java:334)
	at java.util.concurrent.FutureTask.run(FutureTask.java:166)
	at java.util.concurrent.ThreadPoolExecutor.runWorker(ThreadPoolExecutor.java:1145)
	at java.util.concurrent.ThreadPoolExecutor$Worker.run(ThreadPoolExecutor.java:615)
	at java.lang.Thread.run(Thread.java:724)
[ERROR] 
[ERROR] To see the full stack trace of the errors, re-run Maven with the -e switch.
[ERROR] Re-run Maven using the -X switch to enable full debug logging.
[ERROR] 
[ERROR] For more information about the errors and possible solutions, please read the following
articles:
[ERROR] [Help 1] http://cwiki.apache.org/confluence/display/MAVEN/InternalErrorException
2013-11-20 18:56:38.401:INFO::org.mortbay.io.nio.SelectorManager$SelectSet@1fd3e1d JVM BUG(s)
- injecting delay1 times
2013-11-20 18:56:38.401:INFO::org.mortbay.io.nio.SelectorManager$SelectSet@1fd3e1d JVM BUG(s)
- recreating selector 1 times, canceled keys 317 times
2013-11-20 18:57:39.113:INFO::org.mortbay.io.nio.SelectorManager$SelectSet@1fd3e1d JVM BUG(s)
- injecting delay10 times
2013-11-20 18:57:39.113:INFO::org.mortbay.io.nio.SelectorManager$SelectSet@1fd3e1d JVM BUG(s)
- recreating selector 10 times, canceled keys 369 times
channel stopped
2013-11-20 19:09:07.699:INFO::Shutdown hook executing
2013-11-20 19:09:08.327:INFO::Shutdown hook complete

Mime
View raw message