chemistry-commits mailing list archives

Site index · List index
Message view « Date » · « Thread »
Top « Date » · « Thread »
From Apache Jenkins Server <jenk...@builds.apache.org>
Subject Build failed in Jenkins: Chemistry-Phyton-cmislib-doc #827
Date Tue, 05 Mar 2013 11:49:35 GMT
See <https://builds.apache.org/job/Chemistry-Phyton-cmislib-doc/827/>

------------------------------------------
Started by timer
Building remotely on ubuntu2 in workspace <https://builds.apache.org/job/Chemistry-Phyton-cmislib-doc/ws/>
Updating http://svn.apache.org/repos/asf/chemistry/cmislib/trunk
At revision 1452750
no revision recorded for http://svn.apache.org/repos/asf/chemistry/cmislib/trunk in the previous
build
[Chemistry-Phyton-cmislib-doc] $ /bin/bash -xe /tmp/hudson3028370883669422442.sh
+ <https://builds.apache.org/job/Chemistry-Phyton-cmislib-doc/ws/trunk/src/doc/src/run-sphinx.py>
sphinx-build -b html -d <https://builds.apache.org/job/Chemistry-Phyton-cmislib-doc/ws/trunk/src/doc/src/../build/doctrees>
  <https://builds.apache.org/job/Chemistry-Phyton-cmislib-doc/ws/trunk/src/doc/src>
<https://builds.apache.org/job/Chemistry-Phyton-cmislib-doc/ws/trunk/src/doc/src/../build/html>
Traceback (most recent call last):
  File "/usr/local/bin/sphinx-build", line 5, in <module>
    from pkg_resources import load_entry_point
  File "/usr/lib/python2.7/dist-packages/pkg_resources.py", line 2707, in <module>
    working_set.require(__requires__)
  File "/usr/lib/python2.7/dist-packages/pkg_resources.py", line 686, in require
    needed = self.resolve(parse_requirements(requirements))
  File "/usr/lib/python2.7/dist-packages/pkg_resources.py", line 584, in resolve
    raise DistributionNotFound(req)
pkg_resources.DistributionNotFound: Sphinx==1.0.5
make: *** [html] Error 1
rm: cannot remove `<https://builds.apache.org/job/Chemistry-Phyton-cmislib-doc/ws/trunk/src/doc/src/../docs.zip'>:
No such file or directory
Removing build dir: <https://builds.apache.org/job/Chemistry-Phyton-cmislib-doc/ws/trunk/src/doc/src/../build>
Traceback (most recent call last):
  File "<https://builds.apache.org/job/Chemistry-Phyton-cmislib-doc/ws/trunk/src/doc/src/run-sphinx.py",>
line 32, in <module>
    os.chdir(build_dir)
OSError: [Errno 2] No such file or directory: '<https://builds.apache.org/job/Chemistry-Phyton-cmislib-doc/ws/trunk/src/doc/src/../build'>
Build step 'Execute shell' marked build as failure

Mime
View raw message