chemistry-commits mailing list archives

Site index · List index
Message view « Date » · « Thread »
Top « Date » · « Thread »
From Apache Jenkins Server <jenk...@builds.apache.org>
Subject Build failed in Jenkins: Chemistry - OpenCMIS - install #1093
Date Sun, 04 Dec 2011 03:07:13 GMT
See <https://builds.apache.org/job/Chemistry%20-%20OpenCMIS%20-%20install/1093/>

------------------------------------------
[...truncated 3256 lines...]
  id(org.apache.chemistry.opencmis.fit.runtime.atom.ReadOnlyRepositoryInfoAtomPubIT)
  description(org.apache.chemistry.opencmis.fit.runtime.atom.ReadOnlyRepositoryInfoAtomPubIT):
Service Unavailable
  description(org.apache.chemistry.opencmis.fit.runtime.atom.ReadOnlyRepositoryInfoAtomPubIT)
  changesIncomplete(org.apache.chemistry.opencmis.fit.runtime.atom.ReadOnlyRepositoryInfoAtomPubIT):
Service Unavailable
  changesIncomplete(org.apache.chemistry.opencmis.fit.runtime.atom.ReadOnlyRepositoryInfoAtomPubIT)
  changesOnType(org.apache.chemistry.opencmis.fit.runtime.atom.ReadOnlyRepositoryInfoAtomPubIT):
Service Unavailable
  changesOnType(org.apache.chemistry.opencmis.fit.runtime.atom.ReadOnlyRepositoryInfoAtomPubIT)
  cmisVersionSupported(org.apache.chemistry.opencmis.fit.runtime.atom.ReadOnlyRepositoryInfoAtomPubIT):
Service Unavailable
  cmisVersionSupported(org.apache.chemistry.opencmis.fit.runtime.atom.ReadOnlyRepositoryInfoAtomPubIT)
  principalIdAnonymous(org.apache.chemistry.opencmis.fit.runtime.atom.ReadOnlyRepositoryInfoAtomPubIT):
Service Unavailable
  principalIdAnonymous(org.apache.chemistry.opencmis.fit.runtime.atom.ReadOnlyRepositoryInfoAtomPubIT)
  principalIdAnyone(org.apache.chemistry.opencmis.fit.runtime.atom.ReadOnlyRepositoryInfoAtomPubIT):
Service Unavailable
  principalIdAnyone(org.apache.chemistry.opencmis.fit.runtime.atom.ReadOnlyRepositoryInfoAtomPubIT)
  productName(org.apache.chemistry.opencmis.fit.runtime.atom.ReadOnlyRepositoryInfoAtomPubIT):
Service Unavailable
  productName(org.apache.chemistry.opencmis.fit.runtime.atom.ReadOnlyRepositoryInfoAtomPubIT)
  thinClientUri(org.apache.chemistry.opencmis.fit.runtime.atom.ReadOnlyRepositoryInfoAtomPubIT):
Service Unavailable
  thinClientUri(org.apache.chemistry.opencmis.fit.runtime.atom.ReadOnlyRepositoryInfoAtomPubIT)
  vendorName(org.apache.chemistry.opencmis.fit.runtime.atom.ReadOnlyRepositoryInfoAtomPubIT):
Service Unavailable
  vendorName(org.apache.chemistry.opencmis.fit.runtime.atom.ReadOnlyRepositoryInfoAtomPubIT)
  repositoryCapabilitiesAclSupport(org.apache.chemistry.opencmis.fit.runtime.atom.ReadOnlyRepositoryInfoAtomPubIT):
Service Unavailable
  repositoryCapabilitiesAclSupport(org.apache.chemistry.opencmis.fit.runtime.atom.ReadOnlyRepositoryInfoAtomPubIT)
  repositoryCapabilitiesChangesSupport(org.apache.chemistry.opencmis.fit.runtime.atom.ReadOnlyRepositoryInfoAtomPubIT):
Service Unavailable
  repositoryCapabilitiesChangesSupport(org.apache.chemistry.opencmis.fit.runtime.atom.ReadOnlyRepositoryInfoAtomPubIT)
  repositoryCapabilitiesContentStreamUpdateabilitySupport(org.apache.chemistry.opencmis.fit.runtime.atom.ReadOnlyRepositoryInfoAtomPubIT):
Service Unavailable
  repositoryCapabilitiesContentStreamUpdateabilitySupport(org.apache.chemistry.opencmis.fit.runtime.atom.ReadOnlyRepositoryInfoAtomPubIT)
  repositoryCapabilitiesJointSupport(org.apache.chemistry.opencmis.fit.runtime.atom.ReadOnlyRepositoryInfoAtomPubIT):
Service Unavailable
  repositoryCapabilitiesJointSupport(org.apache.chemistry.opencmis.fit.runtime.atom.ReadOnlyRepositoryInfoAtomPubIT)
  repositoryCapabilitiesQuerySupport(org.apache.chemistry.opencmis.fit.runtime.atom.ReadOnlyRepositoryInfoAtomPubIT):
Service Unavailable
  repositoryCapabilitiesQuerySupport(org.apache.chemistry.opencmis.fit.runtime.atom.ReadOnlyRepositoryInfoAtomPubIT)
  repositoryCapabilitiesRenditionSupport(org.apache.chemistry.opencmis.fit.runtime.atom.ReadOnlyRepositoryInfoAtomPubIT):
Service Unavailable
  repositoryCapabilitiesRenditionSupport(org.apache.chemistry.opencmis.fit.runtime.atom.ReadOnlyRepositoryInfoAtomPubIT)
  readOptionalBaseTypePolicy(org.apache.chemistry.opencmis.fit.runtime.atom.ReadOnlyTypeAtomPubIT):
Service Unavailable
  readOptionalBaseTypePolicy(org.apache.chemistry.opencmis.fit.runtime.atom.ReadOnlyTypeAtomPubIT)
  readOptionalBaseTypeRelation(org.apache.chemistry.opencmis.fit.runtime.atom.ReadOnlyTypeAtomPubIT):
Service Unavailable
  readOptionalBaseTypeRelation(org.apache.chemistry.opencmis.fit.runtime.atom.ReadOnlyTypeAtomPubIT)
  readBaseTypeDocument(org.apache.chemistry.opencmis.fit.runtime.atom.ReadOnlyTypeAtomPubIT):
Service Unavailable
  readBaseTypeDocument(org.apache.chemistry.opencmis.fit.runtime.atom.ReadOnlyTypeAtomPubIT)
  readBaseTypeFolder(org.apache.chemistry.opencmis.fit.runtime.atom.ReadOnlyTypeAtomPubIT):
Service Unavailable
  readBaseTypeFolder(org.apache.chemistry.opencmis.fit.runtime.atom.ReadOnlyTypeAtomPubIT)
  readTypeChildrenDocument(org.apache.chemistry.opencmis.fit.runtime.atom.ReadOnlyTypeAtomPubIT):
Service Unavailable
  readTypeChildrenDocument(org.apache.chemistry.opencmis.fit.runtime.atom.ReadOnlyTypeAtomPubIT)
  readTypeChildrenDocumentSkip(org.apache.chemistry.opencmis.fit.runtime.atom.ReadOnlyTypeAtomPubIT):
Service Unavailable
  readTypeChildrenDocumentSkip(org.apache.chemistry.opencmis.fit.runtime.atom.ReadOnlyTypeAtomPubIT)
  readTypeChildrenFolder(org.apache.chemistry.opencmis.fit.runtime.atom.ReadOnlyTypeAtomPubIT):
Service Unavailable
  readTypeChildrenFolder(org.apache.chemistry.opencmis.fit.runtime.atom.ReadOnlyTypeAtomPubIT)
  readTypeChildrenFolderSkip(org.apache.chemistry.opencmis.fit.runtime.atom.ReadOnlyTypeAtomPubIT):
Service Unavailable
  readTypeChildrenFolderSkip(org.apache.chemistry.opencmis.fit.runtime.atom.ReadOnlyTypeAtomPubIT)
  readTypeDescandantsDocument(org.apache.chemistry.opencmis.fit.runtime.atom.ReadOnlyTypeAtomPubIT):
Service Unavailable
  readTypeDescandantsDocument(org.apache.chemistry.opencmis.fit.runtime.atom.ReadOnlyTypeAtomPubIT)
  readTypeDescandantsFolder(org.apache.chemistry.opencmis.fit.runtime.atom.ReadOnlyTypeAtomPubIT):
Service Unavailable
  readTypeDescandantsFolder(org.apache.chemistry.opencmis.fit.runtime.atom.ReadOnlyTypeAtomPubIT)
  testSession(org.apache.chemistry.opencmis.fit.runtime.atom.ReadOnlySessionAtomPubIT): Service
Unavailable
  testSession(org.apache.chemistry.opencmis.fit.runtime.atom.ReadOnlySessionAtomPubIT)
  testSessionObjectAccess(org.apache.chemistry.opencmis.fit.runtime.atom.ReadOnlySessionAtomPubIT):
Service Unavailable
  testSessionObjectAccess(org.apache.chemistry.opencmis.fit.runtime.atom.ReadOnlySessionAtomPubIT)
  testSessionClear(org.apache.chemistry.opencmis.fit.runtime.atom.ReadOnlySessionAtomPubIT):
Service Unavailable
  testSessionClear(org.apache.chemistry.opencmis.fit.runtime.atom.ReadOnlySessionAtomPubIT)
  verifyRoot(org.apache.chemistry.opencmis.fit.runtime.atom.ReadOnlyObjectAtomPubIT): Service
Unavailable
  verifyRoot(org.apache.chemistry.opencmis.fit.runtime.atom.ReadOnlyObjectAtomPubIT)
  readTestFolder(org.apache.chemistry.opencmis.fit.runtime.atom.ReadOnlyObjectAtomPubIT):
Service Unavailable
  readTestFolder(org.apache.chemistry.opencmis.fit.runtime.atom.ReadOnlyObjectAtomPubIT)
  readTestDocument(org.apache.chemistry.opencmis.fit.runtime.atom.ReadOnlyObjectAtomPubIT):
Service Unavailable
  readTestDocument(org.apache.chemistry.opencmis.fit.runtime.atom.ReadOnlyObjectAtomPubIT)
  readDocumentPropertiesWithFilter(org.apache.chemistry.opencmis.fit.runtime.atom.ReadOnlyObjectAtomPubIT):
Service Unavailable
  readDocumentPropertiesWithFilter(org.apache.chemistry.opencmis.fit.runtime.atom.ReadOnlyObjectAtomPubIT)
  readDocumentProperties(org.apache.chemistry.opencmis.fit.runtime.atom.ReadOnlyObjectAtomPubIT):
Service Unavailable
  readDocumentProperties(org.apache.chemistry.opencmis.fit.runtime.atom.ReadOnlyObjectAtomPubIT)
  readSingleProperty(org.apache.chemistry.opencmis.fit.runtime.atom.ReadOnlyObjectAtomPubIT):
Service Unavailable
  readSingleProperty(org.apache.chemistry.opencmis.fit.runtime.atom.ReadOnlyObjectAtomPubIT)
  readMultiValueProperty(org.apache.chemistry.opencmis.fit.runtime.atom.ReadOnlyObjectAtomPubIT):
Service Unavailable
  readMultiValueProperty(org.apache.chemistry.opencmis.fit.runtime.atom.ReadOnlyObjectAtomPubIT)
  readContentStream(org.apache.chemistry.opencmis.fit.runtime.atom.ReadOnlyContentStreamAtomPubIT):
Service Unavailable
  readContentStream(org.apache.chemistry.opencmis.fit.runtime.atom.ReadOnlyContentStreamAtomPubIT)
  transientUpdate(org.apache.chemistry.opencmis.fit.runtime.atom.TransientObjectAtomPubIT):
Service Unavailable
  transientUpdate(org.apache.chemistry.opencmis.fit.runtime.atom.TransientObjectAtomPubIT)
  transientFolderSessionCheck(org.apache.chemistry.opencmis.fit.runtime.atom.TransientObjectAtomPubIT):
Service Unavailable
  transientFolderSessionCheck(org.apache.chemistry.opencmis.fit.runtime.atom.TransientObjectAtomPubIT)
  transientDocumentSessionCheck(org.apache.chemistry.opencmis.fit.runtime.atom.TransientObjectAtomPubIT):
Service Unavailable
  transientDocumentSessionCheck(org.apache.chemistry.opencmis.fit.runtime.atom.TransientObjectAtomPubIT)
  moveObject(org.apache.chemistry.opencmis.fit.runtime.atom.WriteObjectMoveAtomPubIT): Service
Unavailable
  moveObject(org.apache.chemistry.opencmis.fit.runtime.atom.WriteObjectMoveAtomPubIT)
  repositoryCapabilitiesAclPropagation(org.apache.chemistry.opencmis.fit.runtime.atom.ReadOnlyAclCapabilityAtomPubIT):
Service Unavailable
  repositoryCapabilitiesAclPropagation(org.apache.chemistry.opencmis.fit.runtime.atom.ReadOnlyAclCapabilityAtomPubIT)
  repositoryCapabilitiesAclPermissionMapping(org.apache.chemistry.opencmis.fit.runtime.atom.ReadOnlyAclCapabilityAtomPubIT):
Service Unavailable
  repositoryCapabilitiesAclPermissionMapping(org.apache.chemistry.opencmis.fit.runtime.atom.ReadOnlyAclCapabilityAtomPubIT)
  navigateChildrenSkip(org.apache.chemistry.opencmis.fit.runtime.atom.ReadOnlyNavigationAtomPubIT):
Service Unavailable
  navigateChildrenSkip(org.apache.chemistry.opencmis.fit.runtime.atom.ReadOnlyNavigationAtomPubIT)
  navigateChildrenMin(org.apache.chemistry.opencmis.fit.runtime.atom.ReadOnlyNavigationAtomPubIT):
Service Unavailable
  navigateChildrenMin(org.apache.chemistry.opencmis.fit.runtime.atom.ReadOnlyNavigationAtomPubIT)
  navigateChildrenMax(org.apache.chemistry.opencmis.fit.runtime.atom.ReadOnlyNavigationAtomPubIT):
Service Unavailable
  navigateChildrenMax(org.apache.chemistry.opencmis.fit.runtime.atom.ReadOnlyNavigationAtomPubIT)
  navigateChildrenMed(org.apache.chemistry.opencmis.fit.runtime.atom.ReadOnlyNavigationAtomPubIT):
Service Unavailable
  navigateChildrenMed(org.apache.chemistry.opencmis.fit.runtime.atom.ReadOnlyNavigationAtomPubIT)
  navigateDescendantsMin(org.apache.chemistry.opencmis.fit.runtime.atom.ReadOnlyNavigationAtomPubIT):
Service Unavailable
  navigateDescendantsMin(org.apache.chemistry.opencmis.fit.runtime.atom.ReadOnlyNavigationAtomPubIT)
  navigateDescendantsMax(org.apache.chemistry.opencmis.fit.runtime.atom.ReadOnlyNavigationAtomPubIT):
Service Unavailable
  navigateDescendantsMax(org.apache.chemistry.opencmis.fit.runtime.atom.ReadOnlyNavigationAtomPubIT)
  navigateDescendantsMed(org.apache.chemistry.opencmis.fit.runtime.atom.ReadOnlyNavigationAtomPubIT):
Service Unavailable
  navigateDescendantsMed(org.apache.chemistry.opencmis.fit.runtime.atom.ReadOnlyNavigationAtomPubIT)
  navigateTreeMed(org.apache.chemistry.opencmis.fit.runtime.atom.ReadOnlyNavigationAtomPubIT):
Service Unavailable
  navigateTreeMed(org.apache.chemistry.opencmis.fit.runtime.atom.ReadOnlyNavigationAtomPubIT)
  navigateTreeMin(org.apache.chemistry.opencmis.fit.runtime.atom.ReadOnlyNavigationAtomPubIT):
Service Unavailable
  navigateTreeMin(org.apache.chemistry.opencmis.fit.runtime.atom.ReadOnlyNavigationAtomPubIT)
  navigateTreeMax(org.apache.chemistry.opencmis.fit.runtime.atom.ReadOnlyNavigationAtomPubIT):
Service Unavailable
  navigateTreeMax(org.apache.chemistry.opencmis.fit.runtime.atom.ReadOnlyNavigationAtomPubIT)
  navigatePagingRandom(org.apache.chemistry.opencmis.fit.runtime.atom.ReadOnlyNavigationAtomPubIT):
Service Unavailable
  navigatePagingRandom(org.apache.chemistry.opencmis.fit.runtime.atom.ReadOnlyNavigationAtomPubIT)
  rootParent(org.apache.chemistry.opencmis.fit.runtime.atom.ReadOnlyNavigationAtomPubIT):
Service Unavailable
  rootParent(org.apache.chemistry.opencmis.fit.runtime.atom.ReadOnlyNavigationAtomPubIT)
  createDefaultSession(org.apache.chemistry.opencmis.fit.runtime.misc.ReadOnlyCreateSessionAtomPubIT):
Service Unavailable
  createDefaultSession(org.apache.chemistry.opencmis.fit.runtime.misc.ReadOnlyCreateSessionWebServicesIT):
Cannot initalize Web Services service object [org.apache.chemistry.opencmis.binding.webservices.RepositoryService]:
Failed to access the WSDL at: http://localhost:19080/opencmis/services/RepositoryService?wsdl.
It failed with: 
	Server returned HTTP response code: 503 for URL: http://localhost:19080/opencmis/services/RepositoryService?wsdl.
  testRepositoryInfo(org.apache.chemistry.opencmis.fit.sample.AtomPubSampleIT): Service Unavailable
  testTypes(org.apache.chemistry.opencmis.fit.sample.AtomPubSampleIT): Service Unavailable
  testRepositoryInfo(org.apache.chemistry.opencmis.fit.sample.WebServicesSampleIT): Cannot
initalize Web Services service object [org.apache.chemistry.opencmis.binding.webservices.RepositoryService]:
Failed to access the WSDL at: http://localhost:19080/opencmis/services/RepositoryService?wsdl.
It failed with: 
	Server returned HTTP response code: 503 for URL: http://localhost:19080/opencmis/services/RepositoryService?wsdl.
  testTypes(org.apache.chemistry.opencmis.fit.sample.WebServicesSampleIT): Cannot initalize
Web Services service object [org.apache.chemistry.opencmis.binding.webservices.RepositoryService]:
Failed to access the WSDL at: http://localhost:19080/opencmis/services/RepositoryService?wsdl.
It failed with: 
	Server returned HTTP response code: 503 for URL: http://localhost:19080/opencmis/services/RepositoryService?wsdl.

Tests run: 307, Failures: 0, Errors: 296, Skipped: 11

[JENKINS] Recording test results
[INFO] [INFO] Stopping server 0

[INFO] --- maven-jetty-plugin:6.1.22:stop (stop-jetty) @ chemistry-opencmis-test-fit ---
[INFO] [INFO] Failsafe report directory: <https://builds.apache.org/job/Chemistry%20-%20OpenCMIS%20-%20install/ws/trunk/chemistry-opencmis-test/chemistry-opencmis-test-fit/target/failsafe-reports>

[INFO] --- maven-failsafe-plugin:2.7.2:verify (verify) @ chemistry-opencmis-test-fit ---
2011-12-04 03:07:07.132:WARN::failed org.mortbay.jetty.plugin.Jetty6PluginWebAppContext@10ff04b{/opencmis,/x1/jenkins/jenkins-slave/workspace/Chemistry
- OpenCMIS - install/trunk/chemistry-opencmis-test/chemistry-opencmis-test-fit/target/chemistry-opencmis-test-fit-0.6.0-SNAPSHOT.war}:
java.lang.NullPointerException
2011-12-04 03:07:07.133:WARN::failed ContextHandlerCollection@155f5eb: java.lang.NullPointerException
2011-12-04 03:07:07.133:WARN::failed HandlerCollection@844311: java.lang.NullPointerException
2011-12-04 03:07:07.233:WARN::failed Server@c499c8: java.lang.NullPointerException
[ERROR] 
java.lang.NullPointerException
	at org.mortbay.jetty.plus.webapp.EnvConfiguration.deconfigureWebApp(EnvConfiguration.java:147)
	at org.mortbay.jetty.webapp.WebAppContext.doStop(WebAppContext.java:511)
	at org.mortbay.jetty.plugin.Jetty6PluginWebAppContext.doStop(Jetty6PluginWebAppContext.java:123)
	at org.mortbay.component.AbstractLifeCycle.stop(AbstractLifeCycle.java:76)
	at org.mortbay.jetty.handler.HandlerCollection.doStop(HandlerCollection.java:169)
	at org.mortbay.component.AbstractLifeCycle.stop(AbstractLifeCycle.java:76)
	at org.mortbay.jetty.handler.HandlerCollection.doStop(HandlerCollection.java:169)
	at org.mortbay.component.AbstractLifeCycle.stop(AbstractLifeCycle.java:76)
	at org.mortbay.jetty.handler.HandlerWrapper.doStop(HandlerWrapper.java:142)
	at org.mortbay.jetty.Server.doStop(Server.java:283)
	at org.mortbay.component.AbstractLifeCycle.stop(AbstractLifeCycle.java:76)
	at org.mortbay.jetty.plugin.util.Monitor.run(Monitor.java:101)
[INFO] ------------------------------------------------------------------------
[INFO] Reactor Summary:
[INFO] 
[INFO] Apache Chemistry OpenCMIS ......................... SUCCESS [5.684s]
[INFO] OpenCMIS Commons API .............................. SUCCESS [4.741s]
[INFO] OpenCMIS Commons Implementation ................... SUCCESS [20.444s]
[INFO] OpenCMIS Client API ............................... SUCCESS [3.108s]
[INFO] OpenCMIS Client Bindings Implementation ........... SUCCESS [8.422s]
[INFO] OpenCMIS Client Implementation .................... SUCCESS [7.690s]
[INFO] OpenCMIS Client Bindings Implementation (WebSphere)  SUCCESS [2.264s]
[INFO] OpenCMIS Server Support ........................... SUCCESS [16.956s]
[INFO] OpenCMIS Server Implementation WAR packaging ...... SUCCESS [7.975s]
[INFO] OpenCMIS Test Utilities ........................... SUCCESS [3.686s]
[INFO] OpenCMIS InMemory Server WAR packaging ............ SUCCESS [15.108s]
[INFO] OpenCMIS FileShare Server Implementation .......... SUCCESS [5.339s]
[INFO] OpenCMIS JCR Server Implementation ................ SUCCESS [5.736s]
[INFO] OpenCMIS Full Integration Tests ................... FAILURE [20.036s]
[INFO] OpenCMIS Test Compatibility Kit ................... SKIPPED
[INFO] OpenCMIS Tools .................................... SKIPPED
[INFO] OpenCMIS Browser .................................. SKIPPED
[INFO] OpenCMIS Browser Application ...................... SKIPPED
[INFO] OpenCMIS Workbench ................................ SKIPPED
[INFO] OpenCMIS OSGi Client Wrapper ...................... SKIPPED
[INFO] OpenCMIS OSGi Server Wrapper ...................... SKIPPED
[INFO] OpenCMIS Assemblies Distribution .................. SKIPPED
[INFO] ------------------------------------------------------------------------
[INFO] BUILD FAILURE
[INFO] ------------------------------------------------------------------------
[INFO] Total time: 3:20.863s
[INFO] Finished at: Sun Dec 04 03:07:10 UTC 2011
[INFO] Final Memory: 111M/246M
[INFO] ------------------------------------------------------------------------
Waiting for Jenkins to finish collecting data
mavenExecutionResult exceptions not empty
message : Failed to execute goal org.apache.maven.plugins:maven-failsafe-plugin:2.7.2:verify
(verify) on project chemistry-opencmis-test-fit: There are test failures.

Please refer to <https://builds.apache.org/job/Chemistry%20-%20OpenCMIS%20-%20install/ws/trunk/chemistry-opencmis-test/chemistry-opencmis-test-fit/target/failsafe-reports>
for the individual test results.
cause : There are test failures.

Please refer to <https://builds.apache.org/job/Chemistry%20-%20OpenCMIS%20-%20install/ws/trunk/chemistry-opencmis-test/chemistry-opencmis-test-fit/target/failsafe-reports>
for the individual test results.
Stack trace : 
org.apache.maven.lifecycle.LifecycleExecutionException: Failed to execute goal org.apache.maven.plugins:maven-failsafe-plugin:2.7.2:verify
(verify) on project chemistry-opencmis-test-fit: There are test failures.

Please refer to <https://builds.apache.org/job/Chemistry%20-%20OpenCMIS%20-%20install/ws/trunk/chemistry-opencmis-test/chemistry-opencmis-test-fit/target/failsafe-reports>
for the individual test results.
	at org.apache.maven.lifecycle.internal.MojoExecutor.execute(MojoExecutor.java:213)
	at org.apache.maven.lifecycle.internal.MojoExecutor.execute(MojoExecutor.java:153)
	at org.apache.maven.lifecycle.internal.MojoExecutor.execute(MojoExecutor.java:145)
	at org.apache.maven.lifecycle.internal.LifecycleModuleBuilder.buildProject(LifecycleModuleBuilder.java:84)
	at org.apache.maven.lifecycle.internal.LifecycleModuleBuilder.buildProject(LifecycleModuleBuilder.java:59)
	at org.apache.maven.lifecycle.internal.LifecycleStarter.singleThreadedBuild(LifecycleStarter.java:183)
	at org.apache.maven.lifecycle.internal.LifecycleStarter.execute(LifecycleStarter.java:161)
	at org.apache.maven.DefaultMaven.doExecute(DefaultMaven.java:319)
	at org.apache.maven.DefaultMaven.execute(DefaultMaven.java:156)
	at org.jvnet.hudson.maven3.launcher.Maven3Launcher.main(Maven3Launcher.java:79)
	at sun.reflect.NativeMethodAccessorImpl.invoke0(Native Method)
	at sun.reflect.NativeMethodAccessorImpl.invoke(NativeMethodAccessorImpl.java:39)
	at sun.reflect.DelegatingMethodAccessorImpl.invoke(DelegatingMethodAccessorImpl.java:25)
	at java.lang.reflect.Method.invoke(Method.java:597)
	at org.codehaus.plexus.classworlds.launcher.Launcher.launchStandard(Launcher.java:329)
	at org.codehaus.plexus.classworlds.launcher.Launcher.launch(Launcher.java:239)
	at org.jvnet.hudson.maven3.agent.Maven3Main.launch(Maven3Main.java:158)
	at hudson.maven.Maven3Builder.call(Maven3Builder.java:122)
	at hudson.maven.Maven3Builder.call(Maven3Builder.java:74)
	at hudson.remoting.UserRequest.perform(UserRequest.java:118)
	at hudson.remoting.UserRequest.perform(UserRequest.java:48)
	at hudson.remoting.Request$2.run(Request.java:287)
	at java.util.concurrent.Executors$RunnableAdapter.call(Executors.java:441)
	at java.util.concurrent.FutureTask$Sync.innerRun(FutureTask.java:303)
	at java.util.concurrent.FutureTask.run(FutureTask.java:138)
	at java.util.concurrent.ThreadPoolExecutor$Worker.runTask(ThreadPoolExecutor.java:886)
	at java.util.concurrent.ThreadPoolExecutor$Worker.run(ThreadPoolExecutor.java:908)
	at java.lang.Thread.run(Thread.java:662)
Caused by: org.apache.maven.plugin.MojoFailureException: There are test failures.

Please refer to <https://builds.apache.org/job/Chemistry%20-%20OpenCMIS%20-%20install/ws/trunk/chemistry-opencmis-test/chemistry-opencmis-test-fit/target/failsafe-reports>
for the individual test results.
	at org.apache.maven.plugin.surefire.SurefireHelper.reportExecution(SurefireHelper.java:74)
	at org.apache.maven.plugin.failsafe.VerifyMojo.execute(VerifyMojo.java:205)
	at org.apache.maven.plugin.DefaultBuildPluginManager.executeMojo(DefaultBuildPluginManager.java:101)
	at org.apache.maven.lifecycle.internal.MojoExecutor.execute(MojoExecutor.java:209)
	... 27 more
Maven failed with error.
Sending e-mails to: commits@chemistry.apache.org
channel stopped
2011-12-04 03:07:11.754:INFO::Shutdown hook executing
2011-12-04 03:07:12.255:WARN::failed org.mortbay.jetty.plugin.Jetty6PluginWebAppContext@10ff04b{/opencmis,/x1/jenkins/jenkins-slave/workspace/Chemistry
- OpenCMIS - install/trunk/chemistry-opencmis-test/chemistry-opencmis-test-fit/target/chemistry-opencmis-test-fit-0.6.0-SNAPSHOT.war}:
java.lang.NullPointerException
2011-12-04 03:07:12.255:WARN::failed ContextHandlerCollection@155f5eb: java.lang.NullPointerException
2011-12-04 03:07:12.255:WARN::failed HandlerCollection@844311: java.lang.NullPointerException
2011-12-04 03:07:12.255:WARN::failed Server@c499c8: java.lang.NullPointerException
2011-12-04 03:07:12.255:WARN::EXCEPTION 
java.lang.NullPointerException
	at org.mortbay.jetty.plus.webapp.EnvConfiguration.deconfigureWebApp(EnvConfiguration.java:147)
	at org.mortbay.jetty.webapp.WebAppContext.doStop(WebAppContext.java:511)
	at org.mortbay.jetty.plugin.Jetty6PluginWebAppContext.doStop(Jetty6PluginWebAppContext.java:123)
	at org.mortbay.component.AbstractLifeCycle.stop(AbstractLifeCycle.java:76)
	at org.mortbay.jetty.handler.HandlerCollection.doStop(HandlerCollection.java:169)
	at org.mortbay.component.AbstractLifeCycle.stop(AbstractLifeCycle.java:76)
	at org.mortbay.jetty.handler.HandlerCollection.doStop(HandlerCollection.java:169)
	at org.mortbay.component.AbstractLifeCycle.stop(AbstractLifeCycle.java:76)
	at org.mortbay.jetty.handler.HandlerWrapper.doStop(HandlerWrapper.java:142)
	at org.mortbay.jetty.Server.doStop(Server.java:283)
	at org.mortbay.component.AbstractLifeCycle.stop(AbstractLifeCycle.java:76)
	at org.mortbay.jetty.Server$ShutdownHookThread.run(Server.java:561)
2011-12-04 03:07:12.255:INFO::Shutdown hook complete


Mime
View raw message