chemistry-commits mailing list archives

Site index · List index
Message view « Date » · « Thread »
Top « Date » · « Thread »
From Apache Jenkins Server <jenk...@builds.apache.org>
Subject Build failed in Jenkins: Chemistry - OpenCMIS - install #981
Date Tue, 11 Oct 2011 21:18:35 GMT
See <https://builds.apache.org/job/Chemistry%20-%20OpenCMIS%20-%20install/981/changes>

Changes:

[jens] ACL support in InMemory: add default ACL if nothing is set, provide information for
AtomPub links, correct RepositoryInfo [CMIS-414]

------------------------------------------
[...truncated 2630 lines...]
Running org.apache.chemistry.opencmis.fit.runtime.webservices.WriteObjectVersionWebServicesIT
Oct 11, 2011 9:16:04 PM org.apache.chemistry.opencmis.inmemory.server.InMemoryNavigationServiceImpl
getCheckedOutDocs
INFO: Checked out: children:101
Oct 11, 2011 9:16:05 PM org.apache.chemistry.opencmis.inmemory.server.InMemoryNavigationServiceImpl
getCheckedOutDocs
INFO: Checked out: children:114
Tests run: 2, Failures: 0, Errors: 0, Skipped: 0, Time elapsed: 3.742 sec
Running org.apache.chemistry.opencmis.fit.runtime.webservices.ReadOnlyAclCapabilityWebServicesIT
2011-10-11 21:16:08,301 ERROR [main] org.apache.chemistry.opencmis.fit.runtime.webservices.ReadOnlyAclCapabilityWebServicesIT:
repositoryCapabilitiesAclPermissionMapping
java.lang.NullPointerException
	at org.apache.chemistry.opencmis.fit.runtime.AbstractReadOnlyAclCapabilityIT.repositoryCapabilitiesAclPermissionMapping(AbstractReadOnlyAclCapabilityIT.java:72)
	at sun.reflect.NativeMethodAccessorImpl.invoke0(Native Method)
	at sun.reflect.NativeMethodAccessorImpl.invoke(NativeMethodAccessorImpl.java:39)
	at sun.reflect.DelegatingMethodAccessorImpl.invoke(DelegatingMethodAccessorImpl.java:25)
	at java.lang.reflect.Method.invoke(Method.java:597)
	at org.junit.runners.model.FrameworkMethod$1.runReflectiveCall(FrameworkMethod.java:44)
	at org.junit.internal.runners.model.ReflectiveCallable.run(ReflectiveCallable.java:15)
	at org.junit.runners.model.FrameworkMethod.invokeExplosively(FrameworkMethod.java:41)
	at org.junit.internal.runners.statements.InvokeMethod.evaluate(InvokeMethod.java:20)
	at org.junit.rules.TestWatchman$1.evaluate(TestWatchman.java:48)
	at org.junit.internal.runners.statements.RunBefores.evaluate(RunBefores.java:28)
	at org.junit.internal.runners.statements.RunAfters.evaluate(RunAfters.java:31)
	at org.junit.runners.BlockJUnit4ClassRunner.runChild(BlockJUnit4ClassRunner.java:76)
	at org.junit.runners.BlockJUnit4ClassRunner.runChild(BlockJUnit4ClassRunner.java:50)
	at org.junit.runners.ParentRunner$3.run(ParentRunner.java:193)
	at org.junit.runners.ParentRunner$1.schedule(ParentRunner.java:52)
	at org.junit.runners.ParentRunner.runChildren(ParentRunner.java:191)
	at org.junit.runners.ParentRunner.access$000(ParentRunner.java:42)
	at org.junit.runners.ParentRunner$2.evaluate(ParentRunner.java:184)
	at org.junit.internal.runners.statements.RunBefores.evaluate(RunBefores.java:28)
	at org.junit.runners.ParentRunner.run(ParentRunner.java:236)
	at org.apache.maven.surefire.junit4.JUnit4TestSet.execute(JUnit4TestSet.java:35)
	at org.apache.maven.surefire.junit4.JUnit4Provider.executeTestSet(JUnit4Provider.java:115)
	at org.apache.maven.surefire.junit4.JUnit4Provider.invoke(JUnit4Provider.java:97)
	at sun.reflect.NativeMethodAccessorImpl.invoke0(Native Method)
	at sun.reflect.NativeMethodAccessorImpl.invoke(NativeMethodAccessorImpl.java:39)
	at sun.reflect.DelegatingMethodAccessorImpl.invoke(DelegatingMethodAccessorImpl.java:25)
	at java.lang.reflect.Method.invoke(Method.java:597)
	at org.apache.maven.surefire.booter.ProviderFactory$ClassLoaderProxy.invoke(ProviderFactory.java:103)
	at $Proxy0.invoke(Unknown Source)
	at org.apache.maven.surefire.booter.SurefireStarter.invokeProvider(SurefireStarter.java:150)
	at org.apache.maven.surefire.booter.SurefireStarter.runSuitesInProcess(SurefireStarter.java:91)
	at org.apache.maven.surefire.booter.ForkedBooter.main(ForkedBooter.java:69)
Tests run: 2, Failures: 0, Errors: 1, Skipped: 0, Time elapsed: 2.62 sec <<< FAILURE!
Running org.apache.chemistry.opencmis.fit.runtime.webservices.ReadOnlyRepositoryInfoWebServicesIT
Tests run: 17, Failures: 0, Errors: 0, Skipped: 0, Time elapsed: 26.105 sec
Running org.apache.chemistry.opencmis.fit.runtime.webservices.ReadOnlyNavigationWebServicesIT
Tests run: 12, Failures: 0, Errors: 0, Skipped: 0, Time elapsed: 25.775 sec
Running org.apache.chemistry.opencmis.fit.runtime.webservices.WriteObjectCopyWebServicesIT
Tests run: 1, Failures: 0, Errors: 0, Skipped: 0, Time elapsed: 2.145 sec
Running org.apache.chemistry.opencmis.fit.runtime.webservices.ReadOnlyContentStreamWebServicesIT
Tests run: 1, Failures: 0, Errors: 0, Skipped: 0, Time elapsed: 1.942 sec
Running org.apache.chemistry.opencmis.fit.runtime.webservices.ReadOnlySessionWebServicesIT
Tests run: 3, Failures: 0, Errors: 0, Skipped: 0, Time elapsed: 4.846 sec
Running org.apache.chemistry.opencmis.fit.runtime.webservices.WriteAclWebServicesIT
Tests run: 1, Failures: 0, Errors: 0, Skipped: 1, Time elapsed: 0 sec
Running org.apache.chemistry.opencmis.fit.runtime.webservices.WriteObjectWebServicesIT
Tests run: 11, Failures: 0, Errors: 0, Skipped: 3, Time elapsed: 14.579 sec
Running org.apache.chemistry.opencmis.fit.runtime.webservices.ReadOnlyDiscoverWebServicesIT
Tests run: 3, Failures: 0, Errors: 0, Skipped: 0, Time elapsed: 4.94 sec
Running org.apache.chemistry.opencmis.fit.runtime.webservices.WriteObjectMoveWebServicesIT
Tests run: 1, Failures: 0, Errors: 0, Skipped: 0, Time elapsed: 2.136 sec
Running org.apache.chemistry.opencmis.fit.runtime.webservices.ReadOnlyObjectWebServicesIT
Tests run: 7, Failures: 0, Errors: 0, Skipped: 0, Time elapsed: 13.183 sec
Running org.apache.chemistry.opencmis.fit.runtime.webservices.WriteObjectRelationWebServicesIT
Tests run: 1, Failures: 0, Errors: 0, Skipped: 1, Time elapsed: 0 sec
Running org.apache.chemistry.opencmis.fit.runtime.webservices.TransientObjectWebServicesIT
Tests run: 3, Failures: 0, Errors: 0, Skipped: 0, Time elapsed: 6.237 sec
Running org.apache.chemistry.opencmis.fit.runtime.webservices.ReadOnlyTypeWebServicesIT
Tests run: 10, Failures: 0, Errors: 0, Skipped: 0, Time elapsed: 14.939 sec
Running org.apache.chemistry.opencmis.fit.runtime.atom.ReadOnlyDiscoverAtomPubIT
Tests run: 3, Failures: 0, Errors: 0, Skipped: 0, Time elapsed: 0.998 sec
Running org.apache.chemistry.opencmis.fit.runtime.atom.ReadOnlyTypeAtomPubIT
Tests run: 10, Failures: 0, Errors: 0, Skipped: 0, Time elapsed: 3.003 sec
Running org.apache.chemistry.opencmis.fit.runtime.atom.ReadOnlyContentStreamAtomPubIT
Tests run: 1, Failures: 0, Errors: 0, Skipped: 0, Time elapsed: 0.324 sec
Running org.apache.chemistry.opencmis.fit.runtime.atom.TransientObjectAtomPubIT
Tests run: 3, Failures: 0, Errors: 0, Skipped: 0, Time elapsed: 1.108 sec
Running org.apache.chemistry.opencmis.fit.runtime.atom.ReadOnlyNavigationAtomPubIT
Tests run: 12, Failures: 0, Errors: 0, Skipped: 0, Time elapsed: 3.517 sec
Running org.apache.chemistry.opencmis.fit.runtime.atom.WriteObjectCopyAtomPubIT
Tests run: 1, Failures: 0, Errors: 0, Skipped: 1, Time elapsed: 0 sec
Running org.apache.chemistry.opencmis.fit.runtime.atom.ReadOnlyObjectAtomPubIT
Tests run: 7, Failures: 0, Errors: 0, Skipped: 0, Time elapsed: 2.034 sec
Running org.apache.chemistry.opencmis.fit.runtime.atom.WriteObjectVersionAtomPubIT
Oct 11, 2011 9:18:16 PM org.apache.chemistry.opencmis.inmemory.server.InMemoryNavigationServiceImpl
getCheckedOutDocs
INFO: Checked out: children:1489
Oct 11, 2011 9:18:16 PM org.apache.chemistry.opencmis.inmemory.server.InMemoryNavigationServiceImpl
getCheckedOutDocs
INFO: Checked out: children:1502
Tests run: 2, Failures: 0, Errors: 0, Skipped: 0, Time elapsed: 0.549 sec
Running org.apache.chemistry.opencmis.fit.runtime.atom.ReadOnlySessionAtomPubIT
Tests run: 3, Failures: 0, Errors: 0, Skipped: 0, Time elapsed: 0.828 sec
Running org.apache.chemistry.opencmis.fit.runtime.atom.WriteObjectMoveAtomPubIT
Tests run: 1, Failures: 0, Errors: 0, Skipped: 0, Time elapsed: 0.298 sec
Running org.apache.chemistry.opencmis.fit.runtime.atom.WriteObjectRelationAtomPubIT
Tests run: 1, Failures: 0, Errors: 0, Skipped: 1, Time elapsed: 0 sec
Running org.apache.chemistry.opencmis.fit.runtime.atom.ReadOnlyAclCapabilityAtomPubIT
2011-10-11 21:18:18,383 ERROR [main] org.apache.chemistry.opencmis.fit.runtime.atom.ReadOnlyAclCapabilityAtomPubIT:
repositoryCapabilitiesAclPermissionMapping
java.lang.NullPointerException
	at org.apache.chemistry.opencmis.fit.runtime.AbstractReadOnlyAclCapabilityIT.repositoryCapabilitiesAclPermissionMapping(AbstractReadOnlyAclCapabilityIT.java:72)
	at sun.reflect.NativeMethodAccessorImpl.invoke0(Native Method)
	at sun.reflect.NativeMethodAccessorImpl.invoke(NativeMethodAccessorImpl.java:39)
	at sun.reflect.DelegatingMethodAccessorImpl.invoke(DelegatingMethodAccessorImpl.java:25)
	at java.lang.reflect.Method.invoke(Method.java:597)
	at org.junit.runners.model.FrameworkMethod$1.runReflectiveCall(FrameworkMethod.java:44)
	at org.junit.internal.runners.model.ReflectiveCallable.run(ReflectiveCallable.java:15)
	at org.junit.runners.model.FrameworkMethod.invokeExplosively(FrameworkMethod.java:41)
	at org.junit.internal.runners.statements.InvokeMethod.evaluate(InvokeMethod.java:20)
	at org.junit.rules.TestWatchman$1.evaluate(TestWatchman.java:48)
	at org.junit.internal.runners.statements.RunBefores.evaluate(RunBefores.java:28)
	at org.junit.internal.runners.statements.RunAfters.evaluate(RunAfters.java:31)
	at org.junit.runners.BlockJUnit4ClassRunner.runChild(BlockJUnit4ClassRunner.java:76)
	at org.junit.runners.BlockJUnit4ClassRunner.runChild(BlockJUnit4ClassRunner.java:50)
	at org.junit.runners.ParentRunner$3.run(ParentRunner.java:193)
	at org.junit.runners.ParentRunner$1.schedule(ParentRunner.java:52)
	at org.junit.runners.ParentRunner.runChildren(ParentRunner.java:191)
	at org.junit.runners.ParentRunner.access$000(ParentRunner.java:42)
	at org.junit.runners.ParentRunner$2.evaluate(ParentRunner.java:184)
	at org.junit.internal.runners.statements.RunBefores.evaluate(RunBefores.java:28)
	at org.junit.runners.ParentRunner.run(ParentRunner.java:236)
	at org.apache.maven.surefire.junit4.JUnit4TestSet.execute(JUnit4TestSet.java:35)
	at org.apache.maven.surefire.junit4.JUnit4Provider.executeTestSet(JUnit4Provider.java:115)
	at org.apache.maven.surefire.junit4.JUnit4Provider.invoke(JUnit4Provider.java:97)
	at sun.reflect.NativeMethodAccessorImpl.invoke0(Native Method)
	at sun.reflect.NativeMethodAccessorImpl.invoke(NativeMethodAccessorImpl.java:39)
	at sun.reflect.DelegatingMethodAccessorImpl.invoke(DelegatingMethodAccessorImpl.java:25)
	at java.lang.reflect.Method.invoke(Method.java:597)
	at org.apache.maven.surefire.booter.ProviderFactory$ClassLoaderProxy.invoke(ProviderFactory.java:103)
	at $Proxy0.invoke(Unknown Source)
	at org.apache.maven.surefire.booter.SurefireStarter.invokeProvider(SurefireStarter.java:150)
	at org.apache.maven.surefire.booter.SurefireStarter.runSuitesInProcess(SurefireStarter.java:91)
	at org.apache.maven.surefire.booter.ForkedBooter.main(ForkedBooter.java:69)
Tests run: 2, Failures: 0, Errors: 1, Skipped: 0, Time elapsed: 0.556 sec <<< FAILURE!
Running org.apache.chemistry.opencmis.fit.runtime.atom.ReadOnlyRepositoryInfoAtomPubIT
Tests run: 17, Failures: 0, Errors: 0, Skipped: 0, Time elapsed: 4.622 sec
Running org.apache.chemistry.opencmis.fit.runtime.atom.WriteObjectAtomPubIT
Tests run: 11, Failures: 0, Errors: 0, Skipped: 3, Time elapsed: 2.522 sec
Running org.apache.chemistry.opencmis.fit.runtime.atom.WriteAclAtomPubIT
Tests run: 1, Failures: 0, Errors: 0, Skipped: 1, Time elapsed: 0 sec
Running org.apache.chemistry.opencmis.fit.bindings.WebServicesSimpleBindingIT
Tests run: 2, Failures: 0, Errors: 0, Skipped: 0, Time elapsed: 0.65 sec
Running org.apache.chemistry.opencmis.fit.bindings.AtomPubSimpleBindingIT
Tests run: 2, Failures: 0, Errors: 0, Skipped: 0, Time elapsed: 0.05 sec
Running org.apache.chemistry.opencmis.fit.sample.WebServicesSampleIT
Tests run: 2, Failures: 0, Errors: 0, Skipped: 0, Time elapsed: 0.335 sec
Running org.apache.chemistry.opencmis.fit.sample.AtomPubSampleIT
Tests run: 2, Failures: 0, Errors: 0, Skipped: 0, Time elapsed: 0.041 sec

Results :

Tests in error: 
  repositoryCapabilitiesAclPermissionMapping(org.apache.chemistry.opencmis.fit.runtime.webservices.ReadOnlyAclCapabilityWebServicesIT)
  repositoryCapabilitiesAclPermissionMapping(org.apache.chemistry.opencmis.fit.runtime.atom.ReadOnlyAclCapabilityAtomPubIT)

Tests run: 162, Failures: 0, Errors: 2, Skipped: 13

[JENKINS] Recording test results
[INFO] [INFO] Stopping server 0

[INFO] --- maven-jetty-plugin:6.1.22:stop (stop-jetty) @ chemistry-opencmis-test-fit ---
[INFO] [INFO] Failsafe report directory: <https://builds.apache.org/job/Chemistry%20-%20OpenCMIS%20-%20install/ws/trunk/chemistry-opencmis-test/chemistry-opencmis-test-fit/target/failsafe-reports>

[INFO] --- maven-failsafe-plugin:2.7.2:verify (verify) @ chemistry-opencmis-test-fit ---
Oct 11, 2011 9:18:29 PM com.sun.xml.ws.transport.http.servlet.WSServletDelegate destroy
INFO: WSSERVLET15: JAX-WS servlet destroyed
Oct 11, 2011 9:18:29 PM com.sun.xml.ws.transport.http.servlet.WSServletContextListener contextDestroyed
INFO: WSSERVLET13: JAX-WS context listener destroyed
[INFO] ------------------------------------------------------------------------
[INFO] Reactor Summary:
[INFO] 
[INFO] Apache Chemistry OpenCMIS ......................... SUCCESS [13.259s]
[INFO] OpenCMIS Commons API .............................. SUCCESS [7.724s]
[INFO] OpenCMIS Commons Implementation ................... SUCCESS [42.330s]
[INFO] OpenCMIS Client API ............................... SUCCESS [4.432s]
[INFO] OpenCMIS Client Bindings Implementation ........... SUCCESS [8.990s]
[INFO] OpenCMIS Client Implementation .................... SUCCESS [23.478s]
[INFO] OpenCMIS Server Support ........................... SUCCESS [11.573s]
[INFO] OpenCMIS Server Implementation WAR packaging ...... SUCCESS [10.566s]
[INFO] OpenCMIS Test Utilities ........................... SUCCESS [5.934s]
[INFO] OpenCMIS InMemory Server WAR packaging ............ SUCCESS [12.751s]
[INFO] OpenCMIS FileShare Server Implementation .......... SUCCESS [7.807s]
[INFO] OpenCMIS JCR Server Implementation ................ SUCCESS [8.574s]
[INFO] OpenCMIS Full Integration Tests ................... FAILURE [3:15.712s]
[INFO] OpenCMIS Test Compatibility Kit ................... SKIPPED
[INFO] OpenCMIS Tools .................................... SKIPPED
[INFO] OpenCMIS Browser .................................. SKIPPED
[INFO] OpenCMIS Browser Application ...................... SKIPPED
[INFO] OpenCMIS Workbench ................................ SKIPPED
[INFO] OpenCMIS OSGi Client Wrapper ...................... SKIPPED
[INFO] OpenCMIS OSGi Server Wrapper ...................... SKIPPED
[INFO] OpenCMIS Assemblies Distribution .................. SKIPPED
[INFO] ------------------------------------------------------------------------
[INFO] BUILD FAILURE
[INFO] ------------------------------------------------------------------------
[INFO] Total time: 8:46.953s
[INFO] Finished at: Tue Oct 11 21:18:32 UTC 2011
[INFO] Final Memory: 127M/255M
[INFO] ------------------------------------------------------------------------
mavenExecutionResult exceptions not empty
message : Failed to execute goal org.apache.maven.plugins:maven-failsafe-plugin:2.7.2:verify
(verify) on project chemistry-opencmis-test-fit: There are test failures.

Please refer to <https://builds.apache.org/job/Chemistry%20-%20OpenCMIS%20-%20install/ws/trunk/chemistry-opencmis-test/chemistry-opencmis-test-fit/target/failsafe-reports>
for the individual test results.
cause : There are test failures.

Please refer to <https://builds.apache.org/job/Chemistry%20-%20OpenCMIS%20-%20install/ws/trunk/chemistry-opencmis-test/chemistry-opencmis-test-fit/target/failsafe-reports>
for the individual test results.
Stack trace : 
org.apache.maven.lifecycle.LifecycleExecutionException: Failed to execute goal org.apache.maven.plugins:maven-failsafe-plugin:2.7.2:verify
(verify) on project chemistry-opencmis-test-fit: There are test failures.

Please refer to <https://builds.apache.org/job/Chemistry%20-%20OpenCMIS%20-%20install/ws/trunk/chemistry-opencmis-test/chemistry-opencmis-test-fit/target/failsafe-reports>
for the individual test results.
	at org.apache.maven.lifecycle.internal.MojoExecutor.execute(MojoExecutor.java:213)
	at org.apache.maven.lifecycle.internal.MojoExecutor.execute(MojoExecutor.java:153)
	at org.apache.maven.lifecycle.internal.MojoExecutor.execute(MojoExecutor.java:145)
	at org.apache.maven.lifecycle.internal.LifecycleModuleBuilder.buildProject(LifecycleModuleBuilder.java:84)
	at org.apache.maven.lifecycle.internal.LifecycleModuleBuilder.buildProject(LifecycleModuleBuilder.java:59)
	at org.apache.maven.lifecycle.internal.LifecycleStarter.singleThreadedBuild(LifecycleStarter.java:183)
	at org.apache.maven.lifecycle.internal.LifecycleStarter.execute(LifecycleStarter.java:161)
	at org.apache.maven.DefaultMaven.doExecute(DefaultMaven.java:319)
	at org.apache.maven.DefaultMaven.execute(DefaultMaven.java:156)
	at org.jvnet.hudson.maven3.launcher.Maven3Launcher.main(Maven3Launcher.java:79)
	at sun.reflect.NativeMethodAccessorImpl.invoke0(Native Method)
	at sun.reflect.NativeMethodAccessorImpl.invoke(NativeMethodAccessorImpl.java:39)
	at sun.reflect.DelegatingMethodAccessorImpl.invoke(DelegatingMethodAccessorImpl.java:25)
	at java.lang.reflect.Method.invoke(Method.java:597)
	at org.codehaus.plexus.classworlds.launcher.Launcher.launchStandard(Launcher.java:329)
	at org.codehaus.plexus.classworlds.launcher.Launcher.launch(Launcher.java:239)
	at org.jvnet.hudson.maven3.agent.Maven3Main.launch(Maven3Main.java:158)
	at hudson.maven.Maven3Builder.call(Maven3Builder.java:122)
	at hudson.maven.Maven3Builder.call(Maven3Builder.java:74)
	at hudson.remoting.UserRequest.perform(UserRequest.java:118)
	at hudson.remoting.UserRequest.perform(UserRequest.java:48)
	at hudson.remoting.Request$2.run(Request.java:287)
	at java.util.concurrent.Executors$RunnableAdapter.call(Executors.java:441)
	at java.util.concurrent.FutureTask$Sync.innerRun(FutureTask.java:303)
	at java.util.concurrent.FutureTask.run(FutureTask.java:138)
	at java.util.concurrent.ThreadPoolExecutor$Worker.runTask(ThreadPoolExecutor.java:886)
	at java.util.concurrent.ThreadPoolExecutor$Worker.run(ThreadPoolExecutor.java:908)
	at java.lang.Thread.run(Thread.java:619)
Caused by: org.apache.maven.plugin.MojoFailureException: There are test failures.

Please refer to <https://builds.apache.org/job/Chemistry%20-%20OpenCMIS%20-%20install/ws/trunk/chemistry-opencmis-test/chemistry-opencmis-test-fit/target/failsafe-reports>
for the individual test results.
	at org.apache.maven.plugin.surefire.SurefireHelper.reportExecution(SurefireHelper.java:74)
	at org.apache.maven.plugin.failsafe.VerifyMojo.execute(VerifyMojo.java:205)
	at org.apache.maven.plugin.DefaultBuildPluginManager.executeMojo(DefaultBuildPluginManager.java:101)
	at org.apache.maven.lifecycle.internal.MojoExecutor.execute(MojoExecutor.java:209)
	... 27 more
Maven failed with error.
Sending e-mails to: commits@chemistry.apache.org
channel stopped
2011-10-11 21:18:34.123:INFO::Shutdown hook executing
2011-10-11 21:18:34.123:INFO::Shutdown hook complete


Mime
View raw message