cayenne-commits mailing list archives

Site index · List index
Message view « Date » · « Thread »
Top « Date » · « Thread »
From Apache Jenkins Server <jenk...@builds.apache.org>
Subject Build failed in Jenkins: cayenne-31 » derby,JDK 1.7 (latest),ubuntu #148
Date Fri, 05 Jan 2018 14:42:07 GMT
See <https://builds.apache.org/job/cayenne-31/cayenneTestConnection=derby,jdk=JDK%201.7%20(latest),slave=ubuntu/148/display/redirect?page=changes>

Changes:

[stariy95] CAY-2371 Switch documentation from Docbook to Asciidoctor format

[stariy95] CAY-2371 Switch documentation from Docbook to Asciidoctor format   fix

------------------------------------------
Started by upstream project "cayenne-31" build number 148
originally caused by:
 Started by an SCM change
 Started by an SCM change
[EnvInject] - Loading node environment variables.
Building remotely on ubuntu-4 (ubuntu trusty) in workspace <https://builds.apache.org/job/cayenne-31/cayenneTestConnection=derby,jdk=JDK%201.7%20(latest),slave=ubuntu/ws/>
 > git rev-parse --is-inside-work-tree # timeout=10
Fetching changes from the remote Git repository
 > git config remote.origin.url https://git-wip-us.apache.org/repos/asf/cayenne.git # timeout=10
Fetching upstream changes from https://git-wip-us.apache.org/repos/asf/cayenne.git
 > git --version # timeout=10
 > git fetch --tags --progress https://git-wip-us.apache.org/repos/asf/cayenne.git +refs/heads/*:refs/remotes/origin/*
Checking out Revision 1e9c4837dd1b5e48180e85e03dfa6e76b22948c5 (refs/remotes/origin/STABLE-3.1)
 > git config core.sparsecheckout # timeout=10
 > git checkout -f 1e9c4837dd1b5e48180e85e03dfa6e76b22948c5
Commit message: "CAY-2371 Switch documentation from Docbook to Asciidoctor format   fix paths
to asciidoc headers"
 > git rev-list 4cc7a6eec3a1f25c7b67c734549fbaf2a74939fc # timeout=10
[ubuntu] $ /home/jenkins/tools/maven/apache-maven-3.0.5/bin/mvn "-Djdk=JDK 1.7 (latest)" -Dslave=ubuntu
-DcayenneTestConnection=derby "-Dmaven.repo.local=<https://builds.apache.org/job/cayenne-31/cayenneTestConnection=derby,jdk=JDK%201.7%20(latest),slave=ubuntu/ws/.repository">
-e clean install
[INFO] Error stacktraces are turned on.
[INFO] Scanning for projects...
[ERROR] The build could not read 4 projects -> [Help 1]
org.apache.maven.project.ProjectBuildingException: Some problems were encountered while processing
the POMs:
[WARNING] 'parent.relativePath' points at org.apache.cayenne.docs:cayenne-asciidoc-parent
instead of org.apache.cayenne.parents:cayenne-asciidoc-parent, please verify your project
structure @ line 24, column 13
[FATAL] Non-resolvable parent POM: Could not find artifact org.apache.cayenne.parents:cayenne-asciidoc-parent:pom:3.1.3-SNAPSHOT
and 'parent.relativePath' points at wrong local POM @ line 24, column 13
[WARNING] 'parent.relativePath' points at org.apache.cayenne.docs:cayenne-asciidoc-parent
instead of org.apache.cayenne.parents:cayenne-asciidoc-parent, please verify your project
structure @ line 5, column 13
[FATAL] Non-resolvable parent POM: Could not find artifact org.apache.cayenne.parents:cayenne-asciidoc-parent:pom:3.1.3-SNAPSHOT
and 'parent.relativePath' points at wrong local POM @ line 5, column 13
[WARNING] 'parent.relativePath' points at org.apache.cayenne.docs:cayenne-asciidoc-parent
instead of org.apache.cayenne.parents:cayenne-asciidoc-parent, please verify your project
structure @ line 5, column 13
[FATAL] Non-resolvable parent POM: Could not find artifact org.apache.cayenne.parents:cayenne-asciidoc-parent:pom:3.1.3-SNAPSHOT
and 'parent.relativePath' points at wrong local POM @ line 5, column 13
[WARNING] 'parent.relativePath' points at org.apache.cayenne.docs:cayenne-asciidoc-parent
instead of org.apache.cayenne.parents:cayenne-asciidoc-parent, please verify your project
structure @ line 5, column 13
[FATAL] Non-resolvable parent POM: Could not find artifact org.apache.cayenne.parents:cayenne-asciidoc-parent:pom:3.1.3-SNAPSHOT
and 'parent.relativePath' points at wrong local POM @ line 5, column 13
[WARNING] 'dependencies.dependency.(groupId:artifactId:type:classifier)' must be unique: org.apache.cayenne.build-tools:cayenne-test-utilities:jar
-> duplicate declaration of version ${project.version} @ line 46, column 15

	at org.apache.maven.project.DefaultProjectBuilder.build(DefaultProjectBuilder.java:363)
	at org.apache.maven.DefaultMaven.collectProjects(DefaultMaven.java:636)
	at org.apache.maven.DefaultMaven.getProjectsForMavenReactor(DefaultMaven.java:585)
	at org.apache.maven.DefaultMaven.doExecute(DefaultMaven.java:234)
	at org.apache.maven.DefaultMaven.execute(DefaultMaven.java:156)
	at org.apache.maven.cli.MavenCli.execute(MavenCli.java:537)
	at org.apache.maven.cli.MavenCli.doMain(MavenCli.java:196)
	at org.apache.maven.cli.MavenCli.main(MavenCli.java:141)
	at sun.reflect.NativeMethodAccessorImpl.invoke0(Native Method)
	at sun.reflect.NativeMethodAccessorImpl.invoke(NativeMethodAccessorImpl.java:57)
	at sun.reflect.DelegatingMethodAccessorImpl.invoke(DelegatingMethodAccessorImpl.java:43)
	at java.lang.reflect.Method.invoke(Method.java:606)
	at org.codehaus.plexus.classworlds.launcher.Launcher.launchEnhanced(Launcher.java:290)
	at org.codehaus.plexus.classworlds.launcher.Launcher.launch(Launcher.java:230)
	at org.codehaus.plexus.classworlds.launcher.Launcher.mainWithExitCode(Launcher.java:409)
	at org.codehaus.plexus.classworlds.launcher.Launcher.main(Launcher.java:352)
[ERROR]   
[ERROR]   The project org.apache.cayenne.parents:getting-started-guide:3.1.3-SNAPSHOT (<https://builds.apache.org/job/cayenne-31/cayenneTestConnection=derby,jdk=JDK%201.7%20(latest),slave=ubuntu/ws/docs/asciidoc/getting-started-guide/pom.xml)>
has 1 error
[ERROR]     Non-resolvable parent POM: Could not find artifact org.apache.cayenne.parents:cayenne-asciidoc-parent:pom:3.1.3-SNAPSHOT
and 'parent.relativePath' points at wrong local POM @ line 24, column 13 -> [Help 2]
org.apache.maven.model.resolution.UnresolvableModelException: Could not find artifact org.apache.cayenne.parents:cayenne-asciidoc-parent:pom:3.1.3-SNAPSHOT
	at org.apache.maven.project.ProjectModelResolver.resolveModel(ProjectModelResolver.java:159)
	at org.apache.maven.model.building.DefaultModelBuilder.readParentExternally(DefaultModelBuilder.java:813)
	at org.apache.maven.model.building.DefaultModelBuilder.readParent(DefaultModelBuilder.java:664)
	at org.apache.maven.model.building.DefaultModelBuilder.build(DefaultModelBuilder.java:310)
	at org.apache.maven.model.building.DefaultModelBuilder.build(DefaultModelBuilder.java:232)
	at org.apache.maven.project.DefaultProjectBuilder.build(DefaultProjectBuilder.java:410)
	at org.apache.maven.project.DefaultProjectBuilder.build(DefaultProjectBuilder.java:379)
	at org.apache.maven.project.DefaultProjectBuilder.build(DefaultProjectBuilder.java:495)
	at org.apache.maven.project.DefaultProjectBuilder.build(DefaultProjectBuilder.java:379)
	at org.apache.maven.project.DefaultProjectBuilder.build(DefaultProjectBuilder.java:495)
	at org.apache.maven.project.DefaultProjectBuilder.build(DefaultProjectBuilder.java:379)
	at org.apache.maven.project.DefaultProjectBuilder.build(DefaultProjectBuilder.java:495)
	at org.apache.maven.project.DefaultProjectBuilder.build(DefaultProjectBuilder.java:379)
	at org.apache.maven.project.DefaultProjectBuilder.build(DefaultProjectBuilder.java:343)
	at org.apache.maven.DefaultMaven.collectProjects(DefaultMaven.java:636)
	at org.apache.maven.DefaultMaven.getProjectsForMavenReactor(DefaultMaven.java:585)
	at org.apache.maven.DefaultMaven.doExecute(DefaultMaven.java:234)
	at org.apache.maven.DefaultMaven.execute(DefaultMaven.java:156)
	at org.apache.maven.cli.MavenCli.execute(MavenCli.java:537)
	at org.apache.maven.cli.MavenCli.doMain(MavenCli.java:196)
	at org.apache.maven.cli.MavenCli.main(MavenCli.java:141)
	at sun.reflect.NativeMethodAccessorImpl.invoke0(Native Method)
	at sun.reflect.NativeMethodAccessorImpl.invoke(NativeMethodAccessorImpl.java:57)
	at sun.reflect.DelegatingMethodAccessorImpl.invoke(DelegatingMethodAccessorImpl.java:43)
	at java.lang.reflect.Method.invoke(Method.java:606)
	at org.codehaus.plexus.classworlds.launcher.Launcher.launchEnhanced(Launcher.java:290)
	at org.codehaus.plexus.classworlds.launcher.Launcher.launch(Launcher.java:230)
	at org.codehaus.plexus.classworlds.launcher.Launcher.mainWithExitCode(Launcher.java:409)
	at org.codehaus.plexus.classworlds.launcher.Launcher.main(Launcher.java:352)
Caused by: org.sonatype.aether.resolution.ArtifactResolutionException: Could not find artifact
org.apache.cayenne.parents:cayenne-asciidoc-parent:pom:3.1.3-SNAPSHOT
	at org.sonatype.aether.impl.internal.DefaultArtifactResolver.resolve(DefaultArtifactResolver.java:538)
	at org.sonatype.aether.impl.internal.DefaultArtifactResolver.resolveArtifacts(DefaultArtifactResolver.java:216)
	at org.sonatype.aether.impl.internal.DefaultArtifactResolver.resolveArtifact(DefaultArtifactResolver.java:193)
	at org.sonatype.aether.impl.internal.DefaultRepositorySystem.resolveArtifact(DefaultRepositorySystem.java:286)
	at org.apache.maven.project.ProjectModelResolver.resolveModel(ProjectModelResolver.java:155)
	... 28 more
Caused by: org.sonatype.aether.transfer.ArtifactNotFoundException: Could not find artifact
org.apache.cayenne.parents:cayenne-asciidoc-parent:pom:3.1.3-SNAPSHOT
	at org.sonatype.aether.impl.internal.DefaultArtifactResolver.resolve(DefaultArtifactResolver.java:528)
	... 32 more
[ERROR]   
[ERROR]   The project org.apache.cayenne.parents:cayenne-guide:3.1.3-SNAPSHOT (<https://builds.apache.org/job/cayenne-31/cayenneTestConnection=derby,jdk=JDK%201.7%20(latest),slave=ubuntu/ws/docs/asciidoc/cayenne-guide/pom.xml)>
has 1 error
[ERROR]     Non-resolvable parent POM: Could not find artifact org.apache.cayenne.parents:cayenne-asciidoc-parent:pom:3.1.3-SNAPSHOT
and 'parent.relativePath' points at wrong local POM @ line 5, column 13 -> [Help 2]
org.apache.maven.model.resolution.UnresolvableModelException: Could not find artifact org.apache.cayenne.parents:cayenne-asciidoc-parent:pom:3.1.3-SNAPSHOT
	at org.apache.maven.project.ProjectModelResolver.resolveModel(ProjectModelResolver.java:159)
	at org.apache.maven.model.building.DefaultModelBuilder.readParentExternally(DefaultModelBuilder.java:813)
	at org.apache.maven.model.building.DefaultModelBuilder.readParent(DefaultModelBuilder.java:664)
	at org.apache.maven.model.building.DefaultModelBuilder.build(DefaultModelBuilder.java:310)
	at org.apache.maven.model.building.DefaultModelBuilder.build(DefaultModelBuilder.java:232)
	at org.apache.maven.project.DefaultProjectBuilder.build(DefaultProjectBuilder.java:410)
	at org.apache.maven.project.DefaultProjectBuilder.build(DefaultProjectBuilder.java:379)
	at org.apache.maven.project.DefaultProjectBuilder.build(DefaultProjectBuilder.java:495)
	at org.apache.maven.project.DefaultProjectBuilder.build(DefaultProjectBuilder.java:379)
	at org.apache.maven.project.DefaultProjectBuilder.build(DefaultProjectBuilder.java:495)
	at org.apache.maven.project.DefaultProjectBuilder.build(DefaultProjectBuilder.java:379)
	at org.apache.maven.project.DefaultProjectBuilder.build(DefaultProjectBuilder.java:495)
	at org.apache.maven.project.DefaultProjectBuilder.build(DefaultProjectBuilder.java:379)
	at org.apache.maven.project.DefaultProjectBuilder.build(DefaultProjectBuilder.java:343)
	at org.apache.maven.DefaultMaven.collectProjects(DefaultMaven.java:636)
	at org.apache.maven.DefaultMaven.getProjectsForMavenReactor(DefaultMaven.java:585)
	at org.apache.maven.DefaultMaven.doExecute(DefaultMaven.java:234)
	at org.apache.maven.DefaultMaven.execute(DefaultMaven.java:156)
	at org.apache.maven.cli.MavenCli.execute(MavenCli.java:537)
	at org.apache.maven.cli.MavenCli.doMain(MavenCli.java:196)
	at org.apache.maven.cli.MavenCli.main(MavenCli.java:141)
	at sun.reflect.NativeMethodAccessorImpl.invoke0(Native Method)
	at sun.reflect.NativeMethodAccessorImpl.invoke(NativeMethodAccessorImpl.java:57)
	at sun.reflect.DelegatingMethodAccessorImpl.invoke(DelegatingMethodAccessorImpl.java:43)
	at java.lang.reflect.Method.invoke(Method.java:606)
	at org.codehaus.plexus.classworlds.launcher.Launcher.launchEnhanced(Launcher.java:290)
	at org.codehaus.plexus.classworlds.launcher.Launcher.launch(Launcher.java:230)
	at org.codehaus.plexus.classworlds.launcher.Launcher.mainWithExitCode(Launcher.java:409)
	at org.codehaus.plexus.classworlds.launcher.Launcher.main(Launcher.java:352)
Caused by: org.sonatype.aether.resolution.ArtifactResolutionException: Could not find artifact
org.apache.cayenne.parents:cayenne-asciidoc-parent:pom:3.1.3-SNAPSHOT
	at org.sonatype.aether.impl.internal.DefaultArtifactResolver.resolve(DefaultArtifactResolver.java:538)
	at org.sonatype.aether.impl.internal.DefaultArtifactResolver.resolveArtifacts(DefaultArtifactResolver.java:216)
	at org.sonatype.aether.impl.internal.DefaultArtifactResolver.resolveArtifact(DefaultArtifactResolver.java:193)
	at org.sonatype.aether.impl.internal.DefaultRepositorySystem.resolveArtifact(DefaultRepositorySystem.java:286)
	at org.apache.maven.project.ProjectModelResolver.resolveModel(ProjectModelResolver.java:155)
	... 28 more
Caused by: org.sonatype.aether.transfer.ArtifactNotFoundException: Could not find artifact
org.apache.cayenne.parents:cayenne-asciidoc-parent:pom:3.1.3-SNAPSHOT
	at org.sonatype.aether.impl.internal.DefaultArtifactResolver.resolve(DefaultArtifactResolver.java:528)
	... 32 more
[ERROR]   
[ERROR]   The project org.apache.cayenne.parents:getting-started-rop:3.1.3-SNAPSHOT (<https://builds.apache.org/job/cayenne-31/cayenneTestConnection=derby,jdk=JDK%201.7%20(latest),slave=ubuntu/ws/docs/asciidoc/getting-started-rop/pom.xml)>
has 1 error
[ERROR]     Non-resolvable parent POM: Could not find artifact org.apache.cayenne.parents:cayenne-asciidoc-parent:pom:3.1.3-SNAPSHOT
and 'parent.relativePath' points at wrong local POM @ line 5, column 13 -> [Help 2]
org.apache.maven.model.resolution.UnresolvableModelException: Could not find artifact org.apache.cayenne.parents:cayenne-asciidoc-parent:pom:3.1.3-SNAPSHOT
	at org.apache.maven.project.ProjectModelResolver.resolveModel(ProjectModelResolver.java:159)
	at org.apache.maven.model.building.DefaultModelBuilder.readParentExternally(DefaultModelBuilder.java:813)
	at org.apache.maven.model.building.DefaultModelBuilder.readParent(DefaultModelBuilder.java:664)
	at org.apache.maven.model.building.DefaultModelBuilder.build(DefaultModelBuilder.java:310)
	at org.apache.maven.model.building.DefaultModelBuilder.build(DefaultModelBuilder.java:232)
	at org.apache.maven.project.DefaultProjectBuilder.build(DefaultProjectBuilder.java:410)
	at org.apache.maven.project.DefaultProjectBuilder.build(DefaultProjectBuilder.java:379)
	at org.apache.maven.project.DefaultProjectBuilder.build(DefaultProjectBuilder.java:495)
	at org.apache.maven.project.DefaultProjectBuilder.build(DefaultProjectBuilder.java:379)
	at org.apache.maven.project.DefaultProjectBuilder.build(DefaultProjectBuilder.java:495)
	at org.apache.maven.project.DefaultProjectBuilder.build(DefaultProjectBuilder.java:379)
	at org.apache.maven.project.DefaultProjectBuilder.build(DefaultProjectBuilder.java:495)
	at org.apache.maven.project.DefaultProjectBuilder.build(DefaultProjectBuilder.java:379)
	at org.apache.maven.project.DefaultProjectBuilder.build(DefaultProjectBuilder.java:343)
	at org.apache.maven.DefaultMaven.collectProjects(DefaultMaven.java:636)
	at org.apache.maven.DefaultMaven.getProjectsForMavenReactor(DefaultMaven.java:585)
	at org.apache.maven.DefaultMaven.doExecute(DefaultMaven.java:234)
	at org.apache.maven.DefaultMaven.execute(DefaultMaven.java:156)
	at org.apache.maven.cli.MavenCli.execute(MavenCli.java:537)
	at org.apache.maven.cli.MavenCli.doMain(MavenCli.java:196)
	at org.apache.maven.cli.MavenCli.main(MavenCli.java:141)
	at sun.reflect.NativeMethodAccessorImpl.invoke0(Native Method)
	at sun.reflect.NativeMethodAccessorImpl.invoke(NativeMethodAccessorImpl.java:57)
	at sun.reflect.DelegatingMethodAccessorImpl.invoke(DelegatingMethodAccessorImpl.java:43)
	at java.lang.reflect.Method.invoke(Method.java:606)
	at org.codehaus.plexus.classworlds.launcher.Launcher.launchEnhanced(Launcher.java:290)
	at org.codehaus.plexus.classworlds.launcher.Launcher.launch(Launcher.java:230)
	at org.codehaus.plexus.classworlds.launcher.Launcher.mainWithExitCode(Launcher.java:409)
	at org.codehaus.plexus.classworlds.launcher.Launcher.main(Launcher.java:352)
Caused by: org.sonatype.aether.resolution.ArtifactResolutionException: Could not find artifact
org.apache.cayenne.parents:cayenne-asciidoc-parent:pom:3.1.3-SNAPSHOT
	at org.sonatype.aether.impl.internal.DefaultArtifactResolver.resolve(DefaultArtifactResolver.java:538)
	at org.sonatype.aether.impl.internal.DefaultArtifactResolver.resolveArtifacts(DefaultArtifactResolver.java:216)
	at org.sonatype.aether.impl.internal.DefaultArtifactResolver.resolveArtifact(DefaultArtifactResolver.java:193)
	at org.sonatype.aether.impl.internal.DefaultRepositorySystem.resolveArtifact(DefaultRepositorySystem.java:286)
	at org.apache.maven.project.ProjectModelResolver.resolveModel(ProjectModelResolver.java:155)
	... 28 more
Caused by: org.sonatype.aether.transfer.ArtifactNotFoundException: Could not find artifact
org.apache.cayenne.parents:cayenne-asciidoc-parent:pom:3.1.3-SNAPSHOT
	at org.sonatype.aether.impl.internal.DefaultArtifactResolver.resolve(DefaultArtifactResolver.java:528)
	... 32 more
[ERROR]   
[ERROR]   The project org.apache.cayenne.parents:upgrade-guide:3.1.3-SNAPSHOT (<https://builds.apache.org/job/cayenne-31/cayenneTestConnection=derby,jdk=JDK%201.7%20(latest),slave=ubuntu/ws/docs/asciidoc/upgrade-guide/pom.xml)>
has 1 error
[ERROR]     Non-resolvable parent POM: Could not find artifact org.apache.cayenne.parents:cayenne-asciidoc-parent:pom:3.1.3-SNAPSHOT
and 'parent.relativePath' points at wrong local POM @ line 5, column 13 -> [Help 2]
org.apache.maven.model.resolution.UnresolvableModelException: Could not find artifact org.apache.cayenne.parents:cayenne-asciidoc-parent:pom:3.1.3-SNAPSHOT
	at org.apache.maven.project.ProjectModelResolver.resolveModel(ProjectModelResolver.java:159)
	at org.apache.maven.model.building.DefaultModelBuilder.readParentExternally(DefaultModelBuilder.java:813)
	at org.apache.maven.model.building.DefaultModelBuilder.readParent(DefaultModelBuilder.java:664)
	at org.apache.maven.model.building.DefaultModelBuilder.build(DefaultModelBuilder.java:310)
	at org.apache.maven.model.building.DefaultModelBuilder.build(DefaultModelBuilder.java:232)
	at org.apache.maven.project.DefaultProjectBuilder.build(DefaultProjectBuilder.java:410)
	at org.apache.maven.project.DefaultProjectBuilder.build(DefaultProjectBuilder.java:379)
	at org.apache.maven.project.DefaultProjectBuilder.build(DefaultProjectBuilder.java:495)
	at org.apache.maven.project.DefaultProjectBuilder.build(DefaultProjectBuilder.java:379)
	at org.apache.maven.project.DefaultProjectBuilder.build(DefaultProjectBuilder.java:495)
	at org.apache.maven.project.DefaultProjectBuilder.build(DefaultProjectBuilder.java:379)
	at org.apache.maven.project.DefaultProjectBuilder.build(DefaultProjectBuilder.java:495)
	at org.apache.maven.project.DefaultProjectBuilder.build(DefaultProjectBuilder.java:379)
	at org.apache.maven.project.DefaultProjectBuilder.build(DefaultProjectBuilder.java:343)
	at org.apache.maven.DefaultMaven.collectProjects(DefaultMaven.java:636)
	at org.apache.maven.DefaultMaven.getProjectsForMavenReactor(DefaultMaven.java:585)
	at org.apache.maven.DefaultMaven.doExecute(DefaultMaven.java:234)
	at org.apache.maven.DefaultMaven.execute(DefaultMaven.java:156)
	at org.apache.maven.cli.MavenCli.execute(MavenCli.java:537)
	at org.apache.maven.cli.MavenCli.doMain(MavenCli.java:196)
	at org.apache.maven.cli.MavenCli.main(MavenCli.java:141)
	at sun.reflect.NativeMethodAccessorImpl.invoke0(Native Method)
	at sun.reflect.NativeMethodAccessorImpl.invoke(NativeMethodAccessorImpl.java:57)
	at sun.reflect.DelegatingMethodAccessorImpl.invoke(DelegatingMethodAccessorImpl.java:43)
	at java.lang.reflect.Method.invoke(Method.java:606)
	at org.codehaus.plexus.classworlds.launcher.Launcher.launchEnhanced(Launcher.java:290)
	at org.codehaus.plexus.classworlds.launcher.Launcher.launch(Launcher.java:230)
	at org.codehaus.plexus.classworlds.launcher.Launcher.mainWithExitCode(Launcher.java:409)
	at org.codehaus.plexus.classworlds.launcher.Launcher.main(Launcher.java:352)
Caused by: org.sonatype.aether.resolution.ArtifactResolutionException: Could not find artifact
org.apache.cayenne.parents:cayenne-asciidoc-parent:pom:3.1.3-SNAPSHOT
	at org.sonatype.aether.impl.internal.DefaultArtifactResolver.resolve(DefaultArtifactResolver.java:538)
	at org.sonatype.aether.impl.internal.DefaultArtifactResolver.resolveArtifacts(DefaultArtifactResolver.java:216)
	at org.sonatype.aether.impl.internal.DefaultArtifactResolver.resolveArtifact(DefaultArtifactResolver.java:193)
	at org.sonatype.aether.impl.internal.DefaultRepositorySystem.resolveArtifact(DefaultRepositorySystem.java:286)
	at org.apache.maven.project.ProjectModelResolver.resolveModel(ProjectModelResolver.java:155)
	... 28 more
Caused by: org.sonatype.aether.transfer.ArtifactNotFoundException: Could not find artifact
org.apache.cayenne.parents:cayenne-asciidoc-parent:pom:3.1.3-SNAPSHOT
	at org.sonatype.aether.impl.internal.DefaultArtifactResolver.resolve(DefaultArtifactResolver.java:528)
	... 32 more
[ERROR] 
[ERROR] Re-run Maven using the -X switch to enable full debug logging.
[ERROR] 
[ERROR] For more information about the errors and possible solutions, please read the following
articles:
[ERROR] [Help 1] http://cwiki.apache.org/confluence/display/MAVEN/ProjectBuildingException
[ERROR] [Help 2] http://cwiki.apache.org/confluence/display/MAVEN/UnresolvableModelException
Build step 'Invoke top-level Maven targets' marked build as failure
Not sending mail to unregistered user stariy95@gmail.com

Mime
View raw message