cayenne-commits mailing list archives

Site index · List index
Message view « Date » · « Thread »
Top « Date » · « Thread »
From Apache Jenkins Server <jenk...@builds.apache.org>
Subject Build failed in Jenkins: cayenne-master » h2,JDK 1.8 (latest),ubuntu #751
Date Sun, 15 Oct 2017 10:30:50 GMT
See <https://builds.apache.org/job/cayenne-master/cayenneTestConnection=h2,jdk=JDK%201.8%20(latest),slave=ubuntu/751/display/redirect?page=changes>

Changes:

[hugi] Add Hugi as a developer

------------------------------------------
[...truncated 9.48 MB...]
[INFO] --- maven-checkstyle-plugin:2.17:check (default) @ cayenne-dbcp2 ---
[INFO] 
[INFO] >>> maven-pmd-plugin:3.8:check (default) > :pmd @ cayenne-dbcp2 >>>
[INFO] 
[INFO] --- maven-pmd-plugin:3.8:pmd (pmd) @ cayenne-dbcp2 ---
[INFO] 
[INFO] <<< maven-pmd-plugin:3.8:check (default) < :pmd @ cayenne-dbcp2 <<<
[INFO] 
[INFO] 
[INFO] --- maven-pmd-plugin:3.8:check (default) @ cayenne-dbcp2 ---
[INFO] 
[INFO] --- maven-remote-resources-plugin:1.5:process (default) @ cayenne-dbcp2 ---
[INFO] 
[INFO] --- maven-resources-plugin:3.0.2:resources (default-resources) @ cayenne-dbcp2 ---
[INFO] Using 'UTF-8' encoding to copy filtered resources.
[INFO] skip non existing resourceDirectory <https://builds.apache.org/job/cayenne-master/cayenneTestConnection=h2,jdk=JDK%201.8%20(latest),slave=ubuntu/ws/cayenne-dbcp2/src/main/resources>
[INFO] Copying 2 resources
[INFO] 
[INFO] --- maven-compiler-plugin:3.6.2:compile (default-compile) @ cayenne-dbcp2 ---
[INFO] Changes detected - recompiling the module!
[INFO] Compiling 1 source file to <https://builds.apache.org/job/cayenne-master/cayenneTestConnection=h2,jdk=JDK%201.8%20(latest),slave=ubuntu/ws/cayenne-dbcp2/target/classes>
[INFO] 
[INFO] --- maven-resources-plugin:3.0.2:testResources (default-testResources) @ cayenne-dbcp2
---
[INFO] Using 'UTF-8' encoding to copy filtered resources.
[INFO] Copying 1 resource
[INFO] Copying 3 resources
[INFO] 
[INFO] --- maven-compiler-plugin:3.6.2:testCompile (default-testCompile) @ cayenne-dbcp2 ---
[INFO] Changes detected - recompiling the module!
[INFO] Compiling 1 source file to <https://builds.apache.org/job/cayenne-master/cayenneTestConnection=h2,jdk=JDK%201.8%20(latest),slave=ubuntu/ws/cayenne-dbcp2/target/test-classes>
[INFO] 
[INFO] --- maven-surefire-plugin:2.20.1:test (default-test) @ cayenne-dbcp2 ---
[INFO] Surefire report directory: <https://builds.apache.org/job/cayenne-master/cayenneTestConnection=h2,jdk=JDK%201.8%20(latest),slave=ubuntu/ws/cayenne-dbcp2/target/surefire-reports>
[WARNING] The system property cayenneTestConnection is configured twice! The property appears
in <argLine/> and any of <systemPropertyVariables/>, <systemProperties/>
or user property.
[INFO] 
[INFO] -------------------------------------------------------
[INFO]  T E S T S
[INFO] -------------------------------------------------------
[INFO] Running org.apache.cayenne.configuration.server.DBCP2DataSourceFactoryTest
[INFO] Tests run: 2, Failures: 0, Errors: 0, Skipped: 0, Time elapsed: 0.123 s - in org.apache.cayenne.configuration.server.DBCP2DataSourceFactoryTest
[INFO] 
[INFO] Results:
[INFO] 
[INFO] Tests run: 2, Failures: 0, Errors: 0, Skipped: 0
[INFO] 
[INFO] 
[INFO] --- maven-jar-plugin:3.0.2:jar (default-jar) @ cayenne-dbcp2 ---
[INFO] Building jar: <https://builds.apache.org/job/cayenne-master/cayenneTestConnection=h2,jdk=JDK%201.8%20(latest),slave=ubuntu/ws/cayenne-dbcp2/target/cayenne-dbcp2-4.1.M2-SNAPSHOT.jar>
[INFO] 
[INFO] >>> maven-source-plugin:3.0.1:jar (bundle-source-jar) > generate-sources
@ cayenne-dbcp2 >>>
[INFO] 
[INFO] <<< maven-source-plugin:3.0.1:jar (bundle-source-jar) < generate-sources
@ cayenne-dbcp2 <<<
[INFO] 
[INFO] 
[INFO] --- maven-source-plugin:3.0.1:jar (bundle-source-jar) @ cayenne-dbcp2 ---
[INFO] Building jar: <https://builds.apache.org/job/cayenne-master/cayenneTestConnection=h2,jdk=JDK%201.8%20(latest),slave=ubuntu/ws/cayenne-dbcp2/target/cayenne-dbcp2-4.1.M2-SNAPSHOT-sources.jar>
[INFO] 
[INFO] --- maven-failsafe-plugin:2.20.1:integration-test (integration-test) @ cayenne-dbcp2
---
[INFO] 
[INFO] --- maven-failsafe-plugin:2.20.1:verify (integration-test) @ cayenne-dbcp2 ---
[INFO] Failsafe report directory: <https://builds.apache.org/job/cayenne-master/cayenneTestConnection=h2,jdk=JDK%201.8%20(latest),slave=ubuntu/ws/cayenne-dbcp2/target/failsafe-reports>
[INFO] 
[INFO] ------------------------------------------------------------------------
[INFO] Building cayenne-gradle-plugin: Cayenne Gradle Plugin 4.1.M2-SNAPSHOT
[INFO] ------------------------------------------------------------------------
[INFO] 
[INFO] --- maven-clean-plugin:2.5:clean (default-clean) @ cayenne-gradle-plugin ---
[INFO] 
[INFO] --- maven-dependency-plugin:3.0.1:build-classpath (build-classpath) @ cayenne-gradle-plugin
---
[INFO] Wrote classpath file '<https://builds.apache.org/job/cayenne-master/cayenneTestConnection=h2,jdk=JDK%201.8%20(latest),slave=ubuntu/ws/cayenne-gradle-plugin/build/classpath.txt'.>
[INFO] 
[INFO] --- exec-maven-plugin:1.6.0:exec (gradle) @ cayenne-gradle-plugin ---
:clean
:compileJava
:licenseFiles
:pluginDescriptors
:versionFile
:processResources
:classes
:jar
:assemble
:pluginUnderTestMetadata
:compileTestJava
:processTestResources
:testClasses
:test

org.apache.cayenne.tools.DbImportIT > emptyDbTaskSuccess FAILED
    org.gradle.testkit.runner.UnexpectedBuildFailure at DbImportIT.java:61

28 tests completed, 1 failed
:test FAILED

FAILURE: Build failed with an exception.

* What went wrong:
Execution failed for task ':test'.
> There were failing tests. See the report at: file:///home/jenkins/jenkins-slave/workspace/cayenne-master/cayenneTestConnection/h2/jdk/JDK%201.8%20(latest)/slave/ubuntu/cayenne-gradle-plugin/build/reports/tests/test/index.html

* Try:
Run with --stacktrace option to get the stack trace. Run with --info or --debug option to
get more log output.

BUILD FAILED

Total time: 1 mins 10.203 secs
[ERROR] Command execution failed.
org.apache.commons.exec.ExecuteException: Process exited with an error: 1 (Exit value: 1)
	at org.apache.commons.exec.DefaultExecutor.executeInternal(DefaultExecutor.java:404)
	at org.apache.commons.exec.DefaultExecutor.execute(DefaultExecutor.java:166)
	at org.codehaus.mojo.exec.ExecMojo.executeCommandLine(ExecMojo.java:804)
	at org.codehaus.mojo.exec.ExecMojo.executeCommandLine(ExecMojo.java:751)
	at org.codehaus.mojo.exec.ExecMojo.execute(ExecMojo.java:313)
	at org.apache.maven.plugin.DefaultBuildPluginManager.executeMojo(DefaultBuildPluginManager.java:134)
	at org.apache.maven.lifecycle.internal.MojoExecutor.execute(MojoExecutor.java:208)
	at org.apache.maven.lifecycle.internal.MojoExecutor.execute(MojoExecutor.java:154)
	at org.apache.maven.lifecycle.internal.MojoExecutor.execute(MojoExecutor.java:146)
	at org.apache.maven.lifecycle.internal.LifecycleModuleBuilder.buildProject(LifecycleModuleBuilder.java:117)
	at org.apache.maven.lifecycle.internal.LifecycleModuleBuilder.buildProject(LifecycleModuleBuilder.java:81)
	at org.apache.maven.lifecycle.internal.builder.singlethreaded.SingleThreadedBuilder.build(SingleThreadedBuilder.java:51)
	at org.apache.maven.lifecycle.internal.LifecycleStarter.execute(LifecycleStarter.java:128)
	at org.apache.maven.DefaultMaven.doExecute(DefaultMaven.java:309)
	at org.apache.maven.DefaultMaven.doExecute(DefaultMaven.java:194)
	at org.apache.maven.DefaultMaven.execute(DefaultMaven.java:107)
	at org.apache.maven.cli.MavenCli.execute(MavenCli.java:993)
	at org.apache.maven.cli.MavenCli.doMain(MavenCli.java:345)
	at org.apache.maven.cli.MavenCli.main(MavenCli.java:191)
	at sun.reflect.NativeMethodAccessorImpl.invoke0(Native Method)
	at sun.reflect.NativeMethodAccessorImpl.invoke(NativeMethodAccessorImpl.java:62)
	at sun.reflect.DelegatingMethodAccessorImpl.invoke(DelegatingMethodAccessorImpl.java:43)
	at java.lang.reflect.Method.invoke(Method.java:498)
	at org.codehaus.plexus.classworlds.launcher.Launcher.launchEnhanced(Launcher.java:289)
	at org.codehaus.plexus.classworlds.launcher.Launcher.launch(Launcher.java:229)
	at org.codehaus.plexus.classworlds.launcher.Launcher.mainWithExitCode(Launcher.java:415)
	at org.codehaus.plexus.classworlds.launcher.Launcher.main(Launcher.java:356)
[INFO] ------------------------------------------------------------------------
[INFO] Reactor Summary:
[INFO] 
[INFO] cayenne-parent: Top-level parent of Cayenne modules  SUCCESS [  0.714 s]
[INFO] build-tools-parent: Cayenne Build Tools Parent ..... SUCCESS [  0.030 s]
[INFO] cayenne-legal: Cayenne License and Notice Bundle ... SUCCESS [  1.085 s]
[INFO] cayenne-test-utilities: Common Unit Test Utilities . SUCCESS [  0.988 s]
[INFO] cayenne-checkers: Cayenne Code Checkers ............ SUCCESS [  0.060 s]
[INFO] cayenne-di: Cayenne Dependency Injection Container . SUCCESS [  4.382 s]
[INFO] cayenne-server: Cayenne Server ..................... SUCCESS [01:15 min]
[INFO] cayenne-project: Cayenne Project ................... SUCCESS [  2.203 s]
[INFO] cayenne-dbsync: Database Synchronization Tools ..... SUCCESS [ 13.051 s]
[INFO] cayenne-cgen: Cayenne Class Generation Tools ....... SUCCESS [  1.742 s]
[INFO] cayenne-ant: Cayenne Ant Tasks ..................... SUCCESS [  5.019 s]
[INFO] cayenne-cache-invalidation: Cayenne Cache Invalidation SUCCESS [  2.409 s]
[INFO] cayenne-client: Cayenne ROP Client ................. SUCCESS [ 18.983 s]
[INFO] cayenne-client-jetty: Cayenne ROP Client (Jetty) ... SUCCESS [  2.835 s]
[INFO] cayenne-commitlog: Cayenne Commit Log Module ....... SUCCESS [  4.095 s]
[INFO] cayenne-maven-plugins-parent: Maven Plugins parent . SUCCESS [  0.273 s]
[INFO] cayenne-maven-plugin: Cayenne Maven Plugin ......... SUCCESS [ 18.861 s]
[INFO] cayenne-crypto: Cayenne Cryptography Extensions .... SUCCESS [  5.637 s]
[INFO] cayenne-dbcp2: Cayenne DBCP2 Extension ............. SUCCESS [  0.978 s]
[INFO] cayenne-gradle-plugin: Cayenne Gradle Plugin ....... FAILURE [01:10 min]
[INFO] cayenne-java8: Cayenne Java8 Extensions ............ SKIPPED
[INFO] cayenne-jcache: Cayenne JCache Integration ......... SKIPPED
[INFO] cayenne-joda: Cayenne Joda Extensions .............. SKIPPED
[INFO] cayenne-lifecycle: Cayenne Lifecycle Utilities ..... SKIPPED
[INFO] cayenne-project-compatibility ...................... SKIPPED
[INFO] cayenne-protostuff: Cayenne Protostuff Extension ... SKIPPED
[INFO] cayenne-velocity: Cayenne Velocity template processor SKIPPED
[INFO] cayenne-eventbridges-parent: Event bridges implementations parent SKIPPED
[INFO] cayenne-jgroups: Cayenne JGroups Event bridge ...... SKIPPED
[INFO] cayenne-jms: Cayenne JMS Event bridge .............. SKIPPED
[INFO] cayenne-xmpp: Cayenne XMPP Event bridge ............ SKIPPED
[INFO] cayenne-itests-parent: Integration Tests Parent .... SKIPPED
[INFO] cayenne-tools-itest: Tools integration tests ....... SKIPPED
[INFO] maven-cayenne-plugin: Deprecated Cayenne Maven Plugin SKIPPED
[INFO] cayenne-modeler-parent: Cayenne Modeler Parent ..... SKIPPED
[INFO] cayenne-wocompat: WebObjects Compatibility Library . SKIPPED
[INFO] cayenne-modeler: Cayenne Modeler Core .............. SKIPPED
[INFO] cayenne-modeler-generic-ext: Modeler Generic Extensions SKIPPED
[INFO] cayenne-modeler-maven-plugin: Cayenne Modeler Maven Plugin SKIPPED
[INFO] cayenne-modeler-generic: Modeler Generic Assembly .. SKIPPED
[INFO] cayenne-modeler-mac-ext: Modeler MacOS Extensions .. SKIPPED
[INFO] cayenne-modeler-mac: Modeler MacOS Assembly ........ SKIPPED
[INFO] cayenne-modeler-win-ext: Modeler Win Extensions .... SKIPPED
[INFO] cayenne-modeler-win: Modeler Windows Assembly ...... SKIPPED
[INFO] cayenne-tutorials-parent: Cayenne Tutorials ........ SKIPPED
[INFO] tutorial: Cayenne Tutorial ......................... SKIPPED
[INFO] tutorial-rop-client: Cayenne ROP Client Tutorial ... SKIPPED
[INFO] tutorial-rop-client-http2: Cayenne ROP HTTP/2 Client Tutorial SKIPPED
[INFO] tutorial-rop-server: Cayenne ROP Server Tutorial ... SKIPPED
[INFO] tutorial-rop-server-http2: Cayenne ROP HTTP/2 Server Tutorial SKIPPED
[INFO] cayenne-docs-parent: Cayenne Documenation Parent ... SKIPPED
[INFO] cayenne-doc: Cayenne Documentation ................. SKIPPED
[INFO] cayenne-docbook: Cayenne Docbook Documentation ..... SKIPPED
[INFO] docbook-stylesheets: Docbook - Cayenne Stylesheets . SKIPPED
[INFO] cayenne-guide: Docbook - Cayenne Guide ............. SKIPPED
[INFO] getting-started: Docbook - Getting Started with Cayenne SKIPPED
[INFO] getting-started-rop: Docbook - Getting Started with Cayenne ROP SKIPPED
[INFO] upgrade-guide: Docbook - Cayenne New Features and Upgrade Guide SKIPPED
[INFO] cayenne-assembly: Cayenne Release Assembly ......... SKIPPED
[INFO] ------------------------------------------------------------------------
[INFO] BUILD FAILURE
[INFO] ------------------------------------------------------------------------
[INFO] Total time: 03:50 min
[INFO] Finished at: 2017-10-15T10:30:43Z
[INFO] Final Memory: 78M/473M
[INFO] ------------------------------------------------------------------------
[ERROR] Failed to execute goal org.codehaus.mojo:exec-maven-plugin:1.6.0:exec (gradle) on
project cayenne-gradle-plugin: Command execution failed.: Process exited with an error: 1
(Exit value: 1) -> [Help 1]
org.apache.maven.lifecycle.LifecycleExecutionException: Failed to execute goal org.codehaus.mojo:exec-maven-plugin:1.6.0:exec
(gradle) on project cayenne-gradle-plugin: Command execution failed.
	at org.apache.maven.lifecycle.internal.MojoExecutor.execute(MojoExecutor.java:213)
	at org.apache.maven.lifecycle.internal.MojoExecutor.execute(MojoExecutor.java:154)
	at org.apache.maven.lifecycle.internal.MojoExecutor.execute(MojoExecutor.java:146)
	at org.apache.maven.lifecycle.internal.LifecycleModuleBuilder.buildProject(LifecycleModuleBuilder.java:117)
	at org.apache.maven.lifecycle.internal.LifecycleModuleBuilder.buildProject(LifecycleModuleBuilder.java:81)
	at org.apache.maven.lifecycle.internal.builder.singlethreaded.SingleThreadedBuilder.build(SingleThreadedBuilder.java:51)
	at org.apache.maven.lifecycle.internal.LifecycleStarter.execute(LifecycleStarter.java:128)
	at org.apache.maven.DefaultMaven.doExecute(DefaultMaven.java:309)
	at org.apache.maven.DefaultMaven.doExecute(DefaultMaven.java:194)
	at org.apache.maven.DefaultMaven.execute(DefaultMaven.java:107)
	at org.apache.maven.cli.MavenCli.execute(MavenCli.java:993)
	at org.apache.maven.cli.MavenCli.doMain(MavenCli.java:345)
	at org.apache.maven.cli.MavenCli.main(MavenCli.java:191)
	at sun.reflect.NativeMethodAccessorImpl.invoke0(Native Method)
	at sun.reflect.NativeMethodAccessorImpl.invoke(NativeMethodAccessorImpl.java:62)
	at sun.reflect.DelegatingMethodAccessorImpl.invoke(DelegatingMethodAccessorImpl.java:43)
	at java.lang.reflect.Method.invoke(Method.java:498)
	at org.codehaus.plexus.classworlds.launcher.Launcher.launchEnhanced(Launcher.java:289)
	at org.codehaus.plexus.classworlds.launcher.Launcher.launch(Launcher.java:229)
	at org.codehaus.plexus.classworlds.launcher.Launcher.mainWithExitCode(Launcher.java:415)
	at org.codehaus.plexus.classworlds.launcher.Launcher.main(Launcher.java:356)
Caused by: org.apache.maven.plugin.MojoExecutionException: Command execution failed.
	at org.codehaus.mojo.exec.ExecMojo.execute(ExecMojo.java:326)
	at org.apache.maven.plugin.DefaultBuildPluginManager.executeMojo(DefaultBuildPluginManager.java:134)
	at org.apache.maven.lifecycle.internal.MojoExecutor.execute(MojoExecutor.java:208)
	... 20 more
Caused by: org.apache.commons.exec.ExecuteException: Process exited with an error: 1 (Exit
value: 1)
	at org.apache.commons.exec.DefaultExecutor.executeInternal(DefaultExecutor.java:404)
	at org.apache.commons.exec.DefaultExecutor.execute(DefaultExecutor.java:166)
	at org.codehaus.mojo.exec.ExecMojo.executeCommandLine(ExecMojo.java:804)
	at org.codehaus.mojo.exec.ExecMojo.executeCommandLine(ExecMojo.java:751)
	at org.codehaus.mojo.exec.ExecMojo.execute(ExecMojo.java:313)
	... 22 more
[ERROR] 
[ERROR] Re-run Maven using the -X switch to enable full debug logging.
[ERROR] 
[ERROR] For more information about the errors and possible solutions, please read the following
articles:
[ERROR] [Help 1] http://cwiki.apache.org/confluence/display/MAVEN/MojoExecutionException
[ERROR] 
[ERROR] After correcting the problems, you can resume the build with the command
[ERROR]   mvn <goals> -rf :cayenne-gradle-plugin
Build step 'Invoke top-level Maven targets' marked build as failure
Recording test results
Not sending mail to unregistered user andrus@objectstyle.com

Mime
View raw message