cayenne-commits mailing list archives

Site index · List index
Message view « Date » · « Thread »
Top « Date » · « Thread »
From Apache Jenkins Server <jenk...@builds.apache.org>
Subject Build failed in Jenkins: cayenne-master » derby,JDK 1.8 (latest),ubuntu #562
Date Wed, 15 Feb 2017 14:32:51 GMT
See <https://builds.apache.org/job/cayenne-master/cayenneTestConnection=derby,jdk=JDK%201.8%20(latest),slave=ubuntu/562/changes>

Changes:

[stariy95] CAY-2228 Deprecate multiple cache groups in caching and query API  -

[stariy95] CAY-2229 NPE in Modeler find action

------------------------------------------
[...truncated 61102 lines...]
[main] INFO org.apache.cayenne.configuration.XMLDataChannelDescriptorLoader - Loading XML
configuration resource from jar:<https://builds.apache.org/job/cayenne-master/cayenneTestConnection=derby,jdk=JDK%201.8%20(latest),slave=ubuntu/ws/cayenne-server/target/cayenne-server-4.0.M5-SNAPSHOT-tests.jar!/cayenne-multi-tier.xml>
[main] INFO org.apache.cayenne.configuration.XMLDataChannelDescriptorLoader - Loading XML
DataMap resource from jar:<https://builds.apache.org/job/cayenne-master/cayenneTestConnection=derby,jdk=JDK%201.8%20(latest),slave=ubuntu/ws/cayenne-server/target/cayenne-server-4.0.M5-SNAPSHOT-tests.jar!/multi-tier.map.xml>
[main] INFO org.apache.cayenne.remote.service.LocalConnection - --- Message 0: Bootstrap
[main] INFO org.apache.cayenne.remote.service.LocalConnection - === Message 0: Bootstrap done
- took 3 ms.
[main] INFO org.apache.cayenne.configuration.XMLDataChannelDescriptorLoader - Loading XML
configuration resource from jar:<https://builds.apache.org/job/cayenne-master/cayenneTestConnection=derby,jdk=JDK%201.8%20(latest),slave=ubuntu/ws/cayenne-server/target/cayenne-server-4.0.M5-SNAPSHOT-tests.jar!/cayenne-multi-tier.xml>
[main] INFO org.apache.cayenne.configuration.XMLDataChannelDescriptorLoader - Loading XML
DataMap resource from jar:<https://builds.apache.org/job/cayenne-master/cayenneTestConnection=derby,jdk=JDK%201.8%20(latest),slave=ubuntu/ws/cayenne-server/target/cayenne-server-4.0.M5-SNAPSHOT-tests.jar!/multi-tier.map.xml>
[main] INFO org.apache.cayenne.test.jdbc.UtilityLogger - delete from MT_JOIN45
[main] INFO org.apache.cayenne.test.jdbc.UtilityLogger - delete from MT_TABLE2
[main] INFO org.apache.cayenne.test.jdbc.UtilityLogger - delete from MT_TABLE5
[main] INFO org.apache.cayenne.test.jdbc.UtilityLogger - delete from MT_TABLE4
[main] INFO org.apache.cayenne.test.jdbc.UtilityLogger - delete from MT_TABLE3
[main] INFO org.apache.cayenne.test.jdbc.UtilityLogger - delete from MT_TABLE1
[main] INFO org.apache.cayenne.test.jdbc.UtilityLogger - INSERT INTO MT_TABLE1 (TABLE1_ID,
GLOBAL_ATTRIBUTE1, SERVER_ATTRIBUTE1, SUBCLASS_ATTRIBUTE1) VALUES (?, ?, ?, ?)
[main] INFO org.apache.cayenne.test.jdbc.UtilityLogger - INSERT INTO MT_TABLE1 (TABLE1_ID,
GLOBAL_ATTRIBUTE1, SERVER_ATTRIBUTE1, SUBCLASS_ATTRIBUTE1) VALUES (?, ?, ?, ?)
[main] INFO org.apache.cayenne.test.jdbc.UtilityLogger - INSERT INTO MT_TABLE1 (TABLE1_ID,
GLOBAL_ATTRIBUTE1, SERVER_ATTRIBUTE1, SUBCLASS_ATTRIBUTE1) VALUES (?, ?, ?, ?)
[main] INFO org.apache.cayenne.remote.service.LocalConnection - --- Message 1: Query
[main] INFO org.apache.cayenne.log.CommonsJdbcEventLogger - --- transaction started.
[main] INFO org.apache.cayenne.log.CommonsJdbcEventLogger - SELECT t0.GLOBAL_ATTRIBUTE1, t0.SERVER_ATTRIBUTE1,
t0.TABLE1_ID, t0.SUBCLASS_ATTRIBUTE1 FROM MT_TABLE1 t0 WHERE t0.SERVER_ATTRIBUTE1 LIKE ? [bind:
1->SERVER_ATTRIBUTE1:'X%']
[main] INFO org.apache.cayenne.log.CommonsJdbcEventLogger - === returned 2 rows. - took 5
ms.
[main] INFO org.apache.cayenne.log.CommonsJdbcEventLogger - +++ transaction committed.
[main] INFO org.apache.cayenne.remote.service.LocalConnection - === Message 1: Query done
- took 6 ms.
[main] INFO org.apache.cayenne.configuration.XMLDataChannelDescriptorLoader - Loading XML
configuration resource from jar:<https://builds.apache.org/job/cayenne-master/cayenneTestConnection=derby,jdk=JDK%201.8%20(latest),slave=ubuntu/ws/cayenne-server/target/cayenne-server-4.0.M5-SNAPSHOT-tests.jar!/cayenne-multi-tier.xml>
[main] INFO org.apache.cayenne.configuration.XMLDataChannelDescriptorLoader - Loading XML
DataMap resource from jar:<https://builds.apache.org/job/cayenne-master/cayenneTestConnection=derby,jdk=JDK%201.8%20(latest),slave=ubuntu/ws/cayenne-server/target/cayenne-server-4.0.M5-SNAPSHOT-tests.jar!/multi-tier.map.xml>
[main] INFO org.apache.cayenne.remote.service.LocalConnection - --- Message 0: Bootstrap
[main] INFO org.apache.cayenne.remote.service.LocalConnection - === Message 0: Bootstrap done
- took 4 ms.
[main] INFO org.apache.cayenne.configuration.XMLDataChannelDescriptorLoader - Loading XML
configuration resource from jar:<https://builds.apache.org/job/cayenne-master/cayenneTestConnection=derby,jdk=JDK%201.8%20(latest),slave=ubuntu/ws/cayenne-server/target/cayenne-server-4.0.M5-SNAPSHOT-tests.jar!/cayenne-multi-tier.xml>
[main] INFO org.apache.cayenne.configuration.XMLDataChannelDescriptorLoader - Loading XML
DataMap resource from jar:<https://builds.apache.org/job/cayenne-master/cayenneTestConnection=derby,jdk=JDK%201.8%20(latest),slave=ubuntu/ws/cayenne-server/target/cayenne-server-4.0.M5-SNAPSHOT-tests.jar!/multi-tier.map.xml>
[main] INFO org.apache.cayenne.test.jdbc.UtilityLogger - delete from MT_JOIN45
[main] INFO org.apache.cayenne.test.jdbc.UtilityLogger - delete from MT_TABLE2
[main] INFO org.apache.cayenne.test.jdbc.UtilityLogger - delete from MT_TABLE5
[main] INFO org.apache.cayenne.test.jdbc.UtilityLogger - delete from MT_TABLE4
[main] INFO org.apache.cayenne.test.jdbc.UtilityLogger - delete from MT_TABLE3
[main] INFO org.apache.cayenne.test.jdbc.UtilityLogger - delete from MT_TABLE1
[main] INFO org.apache.cayenne.test.jdbc.UtilityLogger - INSERT INTO MT_TABLE1 (TABLE1_ID,
GLOBAL_ATTRIBUTE1, SERVER_ATTRIBUTE1, SUBCLASS_ATTRIBUTE1) VALUES (?, ?, ?, ?)
[main] INFO org.apache.cayenne.test.jdbc.UtilityLogger - INSERT INTO MT_TABLE1 (TABLE1_ID,
GLOBAL_ATTRIBUTE1, SERVER_ATTRIBUTE1, SUBCLASS_ATTRIBUTE1) VALUES (?, ?, ?, ?)
[main] INFO org.apache.cayenne.test.jdbc.UtilityLogger - INSERT INTO MT_TABLE1 (TABLE1_ID,
GLOBAL_ATTRIBUTE1, SERVER_ATTRIBUTE1, SUBCLASS_ATTRIBUTE1) VALUES (?, ?, ?, ?)
[main] INFO org.apache.cayenne.remote.service.LocalConnection - --- Message 1: Query
[main] INFO org.apache.cayenne.log.CommonsJdbcEventLogger - --- transaction started.
[main] INFO org.apache.cayenne.log.CommonsJdbcEventLogger - SELECT t0.GLOBAL_ATTRIBUTE1, t0.SERVER_ATTRIBUTE1,
t0.SUBCLASS_ATTRIBUTE1, t0.TABLE1_ID FROM MT_TABLE1 t0 WHERE t0.GLOBAL_ATTRIBUTE1 = ? [bind:
1->GLOBAL_ATTRIBUTE1:'sub1']
[main] INFO org.apache.cayenne.log.CommonsJdbcEventLogger - === returned 1 row. - took 3 ms.
[main] INFO org.apache.cayenne.log.CommonsJdbcEventLogger - +++ transaction committed.
[main] INFO org.apache.cayenne.remote.service.LocalConnection - === Message 1: Query done
- took 5 ms.
Tests run: 4, Failures: 0, Errors: 0, Skipped: 0, Time elapsed: 0.33 sec - in org.apache.cayenne.CayenneContextInheritanceIT

Results :

Tests run: 250, Failures: 0, Errors: 0, Skipped: 0

[INFO] 
[INFO] --- maven-failsafe-plugin:2.17:verify (integration-test) @ cayenne-client ---
[INFO] Failsafe report directory: <https://builds.apache.org/job/cayenne-master/cayenneTestConnection=derby,jdk=JDK%201.8%20(latest),slave=ubuntu/ws/cayenne-client/target/failsafe-reports>
[INFO]                                                                         
[INFO] ------------------------------------------------------------------------
[INFO] Building cayenne-project: Cayenne Project 4.0.M5-SNAPSHOT
[INFO] ------------------------------------------------------------------------
[INFO] 
[INFO] --- maven-clean-plugin:2.5:clean (default-clean) @ cayenne-project ---
[INFO] 
[INFO] --- maven-checkstyle-plugin:2.9.1:check (default) @ cayenne-project ---
[INFO] 
[INFO] >>> maven-pmd-plugin:3.2:check (default) > :pmd @ cayenne-project >>>
[INFO] 
[INFO] --- maven-pmd-plugin:3.2:pmd (pmd) @ cayenne-project ---
[INFO] 
[INFO] <<< maven-pmd-plugin:3.2:check (default) < :pmd @ cayenne-project <<<
[INFO] 
[INFO] --- maven-pmd-plugin:3.2:check (default) @ cayenne-project ---
[INFO] 
[INFO] --- maven-remote-resources-plugin:1.5:process (default) @ cayenne-project ---
[INFO] 
[INFO] --- maven-resources-plugin:2.4.3:resources (default-resources) @ cayenne-project ---
[INFO] Using 'UTF-8' encoding to copy filtered resources.
[INFO] Copying 1 resource
[INFO] Copying 3 resources
[INFO] 
[INFO] --- maven-compiler-plugin:2.3.2:compile (default-compile) @ cayenne-project ---
[INFO] Compiling 54 source files to <https://builds.apache.org/job/cayenne-master/cayenneTestConnection=derby,jdk=JDK%201.8%20(latest),slave=ubuntu/ws/cayenne-project/target/classes>
[INFO] 
[INFO] --- maven-resources-plugin:2.4.3:testResources (default-testResources) @ cayenne-project
---
[INFO] Using 'UTF-8' encoding to copy filtered resources.
[INFO] Copying 46 resources
[INFO] Copying 71 resources
[INFO] 
[INFO] --- maven-compiler-plugin:2.3.2:testCompile (default-testCompile) @ cayenne-project
---
[INFO] Compiling 9 source files to <https://builds.apache.org/job/cayenne-master/cayenneTestConnection=derby,jdk=JDK%201.8%20(latest),slave=ubuntu/ws/cayenne-project/target/test-classes>
[INFO] 
[INFO] --- maven-surefire-plugin:2.5:test (default-test) @ cayenne-project ---
[INFO] Surefire report directory: <https://builds.apache.org/job/cayenne-master/cayenneTestConnection=derby,jdk=JDK%201.8%20(latest),slave=ubuntu/ws/cayenne-project/target/surefire-reports>

-------------------------------------------------------
 T E S T S
-------------------------------------------------------
Running org.apache.cayenne.project.ProjectTest
Tests run: 1, Failures: 0, Errors: 0, Skipped: 0, Time elapsed: 0.091 sec
Running org.apache.cayenne.project.DataChannelProjectLoaderTest
[main] INFO org.apache.cayenne.configuration.XMLDataChannelDescriptorLoader - Loading XML
configuration resource from <https://builds.apache.org/job/cayenne-master/cayenneTestConnection=derby,jdk=JDK%201.8%20(latest),slave=ubuntu/ws/cayenne-project/target/test-classes/org/apache/cayenne/project/cayenne-PROJECT1.xml>
[main] INFO org.apache.cayenne.configuration.XMLDataChannelDescriptorLoader - Loading XML
DataMap resource from <https://builds.apache.org/job/cayenne-master/cayenneTestConnection=derby,jdk=JDK%201.8%20(latest),slave=ubuntu/ws/cayenne-project/target/test-classes/org/apache/cayenne/project/testProjectMap1_1.map.xml>
[main] INFO org.apache.cayenne.configuration.XMLDataChannelDescriptorLoader - Loading XML
DataMap resource from <https://builds.apache.org/job/cayenne-master/cayenneTestConnection=derby,jdk=JDK%201.8%20(latest),slave=ubuntu/ws/cayenne-project/target/test-classes/org/apache/cayenne/project/testProjectMap1_2.map.xml>
[main] INFO org.apache.cayenne.configuration.XMLDataChannelDescriptorLoader - loading user
name and password.
Tests run: 1, Failures: 0, Errors: 0, Skipped: 0, Time elapsed: 0.188 sec
Running org.apache.cayenne.project.FileProjectSaverTest
Tests run: 2, Failures: 0, Errors: 0, Skipped: 0, Time elapsed: 0.766 sec
Running org.apache.cayenne.project.upgrade.v9.ProjectUpgrader_V9Test
[main] INFO org.apache.cayenne.configuration.XMLDataChannelDescriptorLoader - Loading XML
configuration resource from <https://builds.apache.org/job/cayenne-master/cayenneTestConnection=derby,jdk=JDK%201.8%20(latest),slave=ubuntu/ws/cayenne-project/target/testrun/org/apache/cayenne/project/upgrade/v9/ProjectUpgrader_V9Test/testPerformUpgradeFrom8/cayenne-PROJECT1.xml>
[main] INFO org.apache.cayenne.configuration.XMLDataChannelDescriptorLoader - Loading XML
DataMap resource from <https://builds.apache.org/job/cayenne-master/cayenneTestConnection=derby,jdk=JDK%201.8%20(latest),slave=ubuntu/ws/cayenne-project/target/testrun/org/apache/cayenne/project/upgrade/v9/ProjectUpgrader_V9Test/testPerformUpgradeFrom8/testProjectMap1_1.map.xml>
[main] INFO org.apache.cayenne.configuration.XMLDataChannelDescriptorLoader - Loading XML
DataMap resource from <https://builds.apache.org/job/cayenne-master/cayenneTestConnection=derby,jdk=JDK%201.8%20(latest),slave=ubuntu/ws/cayenne-project/target/testrun/org/apache/cayenne/project/upgrade/v9/ProjectUpgrader_V9Test/testPerformUpgradeFrom8/testProjectMap1_2.map.xml>
[main] INFO org.apache.cayenne.configuration.XMLDataChannelDescriptorLoader - loading user
name and password.
Tests run: 3, Failures: 0, Errors: 0, Skipped: 0, Time elapsed: 0.187 sec
Running org.apache.cayenne.project.upgrade.v7.ProjectUpgrader_V7Test
[main] INFO org.apache.cayenne.configuration.XMLDataChannelDescriptorLoader - Loading XML
configuration resource from <https://builds.apache.org/job/cayenne-master/cayenneTestConnection=derby,jdk=JDK%201.8%20(latest),slave=ubuntu/ws/cayenne-project/target/testrun/org/apache/cayenne/project/upgrade/v7/ProjectUpgrader_V7Test/testObjAttribute/cayenne-TestProject.xml>
[main] INFO org.apache.cayenne.configuration.XMLDataChannelDescriptorLoader - Loading XML
DataMap resource from <https://builds.apache.org/job/cayenne-master/cayenneTestConnection=derby,jdk=JDK%201.8%20(latest),slave=ubuntu/ws/cayenne-project/target/testrun/org/apache/cayenne/project/upgrade/v7/ProjectUpgrader_V7Test/testObjAttribute/testProjectMap1.map.xml>
[main] INFO org.apache.cayenne.configuration.XMLDataChannelDescriptorLoader - Loading XML
DataMap resource from <https://builds.apache.org/job/cayenne-master/cayenneTestConnection=derby,jdk=JDK%201.8%20(latest),slave=ubuntu/ws/cayenne-project/target/testrun/org/apache/cayenne/project/upgrade/v7/ProjectUpgrader_V7Test/testObjAttribute/testProjectMap2.map.xml>
[main] INFO org.apache.cayenne.configuration.XMLDataChannelDescriptorLoader - loading user
name and password.
[main] INFO org.apache.cayenne.configuration.XMLDataChannelDescriptorLoader - Loading XML
configuration resource from <https://builds.apache.org/job/cayenne-master/cayenneTestConnection=derby,jdk=JDK%201.8%20(latest),slave=ubuntu/ws/cayenne-project/target/testrun/org/apache/cayenne/project/upgrade/v7/ProjectUpgrader_V7Test/testPerformUpgrade_3_0_0_1/cayenne-d1.xml>
[main] INFO org.apache.cayenne.configuration.XMLDataChannelDescriptorLoader - Loading XML
DataMap resource from <https://builds.apache.org/job/cayenne-master/cayenneTestConnection=derby,jdk=JDK%201.8%20(latest),slave=ubuntu/ws/cayenne-project/target/testrun/org/apache/cayenne/project/upgrade/v7/ProjectUpgrader_V7Test/testPerformUpgrade_3_0_0_1/d1Map1.map.xml>
[main] INFO org.apache.cayenne.configuration.XMLDataChannelDescriptorLoader - Loading XML
DataMap resource from <https://builds.apache.org/job/cayenne-master/cayenneTestConnection=derby,jdk=JDK%201.8%20(latest),slave=ubuntu/ws/cayenne-project/target/testrun/org/apache/cayenne/project/upgrade/v7/ProjectUpgrader_V7Test/testPerformUpgrade_3_0_0_1/d1Map2.map.xml>
[main] INFO org.apache.cayenne.configuration.XMLDataChannelDescriptorLoader - loading user
name and password.
[main] INFO org.apache.cayenne.configuration.XMLDataChannelDescriptorLoader - Loading XML
configuration resource from <https://builds.apache.org/job/cayenne-master/cayenneTestConnection=derby,jdk=JDK%201.8%20(latest),slave=ubuntu/ws/cayenne-project/target/testrun/org/apache/cayenne/project/upgrade/v7/ProjectUpgrader_V7Test/testUpgrade6a/cayenne-PROJECT1.xml>
[main] INFO org.apache.cayenne.configuration.XMLDataChannelDescriptorLoader - Loading XML
DataMap resource from <https://builds.apache.org/job/cayenne-master/cayenneTestConnection=derby,jdk=JDK%201.8%20(latest),slave=ubuntu/ws/cayenne-project/target/testrun/org/apache/cayenne/project/upgrade/v7/ProjectUpgrader_V7Test/testUpgrade6a/testProjectMap1_1.map.xml>
[main] INFO org.apache.cayenne.configuration.XMLDataChannelDescriptorLoader - Loading XML
DataMap resource from <https://builds.apache.org/job/cayenne-master/cayenneTestConnection=derby,jdk=JDK%201.8%20(latest),slave=ubuntu/ws/cayenne-project/target/testrun/org/apache/cayenne/project/upgrade/v7/ProjectUpgrader_V7Test/testUpgrade6a/testProjectMap1_2.map.xml>
[main] INFO org.apache.cayenne.configuration.XMLDataChannelDescriptorLoader - loading user
name and password.
Tests run: 7, Failures: 0, Errors: 0, Skipped: 0, Time elapsed: 0.668 sec
Running org.apache.cayenne.project.upgrade.v8.ProjectUpgrader_V8Test
Tests run: 1, Failures: 0, Errors: 1, Skipped: 0, Time elapsed: 0.037 sec <<< FAILURE!
Running org.apache.cayenne.project.DataChannelProjectSaverTest
[main] INFO org.apache.cayenne.configuration.XMLDataChannelDescriptorLoader - Loading XML
configuration resource from <https://builds.apache.org/job/cayenne-master/cayenneTestConnection=derby,jdk=JDK%201.8%20(latest),slave=ubuntu/ws/cayenne-project/target/test-classes/org/apache/cayenne/project/cayenne-PROJECT2.xml>
[main] INFO org.apache.cayenne.configuration.XMLDataChannelDescriptorLoader - Loading XML
DataMap resource from <https://builds.apache.org/job/cayenne-master/cayenneTestConnection=derby,jdk=JDK%201.8%20(latest),slave=ubuntu/ws/cayenne-project/target/test-classes/org/apache/cayenne/project/testProjectMap2_1.map.xml>
[main] INFO org.apache.cayenne.configuration.XMLDataChannelDescriptorLoader - Loading XML
DataMap resource from <https://builds.apache.org/job/cayenne-master/cayenneTestConnection=derby,jdk=JDK%201.8%20(latest),slave=ubuntu/ws/cayenne-project/target/test-classes/org/apache/cayenne/project/testProjectMap2_2.map.xml>
[main] INFO org.apache.cayenne.configuration.XMLDataChannelDescriptorLoader - loading user
name and password.
[main] INFO org.apache.cayenne.configuration.XMLDataChannelDescriptorLoader - Loading XML
configuration resource from <https://builds.apache.org/job/cayenne-master/cayenneTestConnection=derby,jdk=JDK%201.8%20(latest),slave=ubuntu/ws/cayenne-project/target/test-classes/org/apache/cayenne/project/cayenne-PROJECT2.xml>
[main] INFO org.apache.cayenne.configuration.XMLDataChannelDescriptorLoader - Loading XML
DataMap resource from <https://builds.apache.org/job/cayenne-master/cayenneTestConnection=derby,jdk=JDK%201.8%20(latest),slave=ubuntu/ws/cayenne-project/target/test-classes/org/apache/cayenne/project/testProjectMap2_1.map.xml>
[main] INFO org.apache.cayenne.configuration.XMLDataChannelDescriptorLoader - Loading XML
DataMap resource from <https://builds.apache.org/job/cayenne-master/cayenneTestConnection=derby,jdk=JDK%201.8%20(latest),slave=ubuntu/ws/cayenne-project/target/test-classes/org/apache/cayenne/project/testProjectMap2_2.map.xml>
[main] INFO org.apache.cayenne.configuration.XMLDataChannelDescriptorLoader - loading user
name and password.
Tests run: 2, Failures: 0, Errors: 0, Skipped: 0, Time elapsed: 0.171 sec
Running org.apache.cayenne.project.ProjectModuleProviderTest
Tests run: 1, Failures: 0, Errors: 0, Skipped: 0, Time elapsed: 0.009 sec

Results :

Tests in error: 
  testPerformUpgrade(org.apache.cayenne.project.upgrade.v8.ProjectUpgrader_V8Test)

Tests run: 18, Failures: 0, Errors: 1, Skipped: 0

[INFO] ------------------------------------------------------------------------
[INFO] Reactor Summary:
[INFO] 
[INFO] cayenne-parent: Top-level parent of Cayenne modules  SUCCESS [  0.803 s]
[INFO] build-tools-parent: Cayenne Build Tools Parent ..... SUCCESS [  0.014 s]
[INFO] cayenne-legal: Cayenne License and Notice Bundle ... SUCCESS [  1.325 s]
[INFO] cayenne-test-utilities: Common Unit Test Utilities . SUCCESS [  1.052 s]
[INFO] cayenne-checkers: Cayenne Code Checkers ............ SUCCESS [  0.056 s]
[INFO] cayenne-di: Cayenne Dependency Injection Container . SUCCESS [  9.416 s]
[INFO] cayenne-server: Cayenne Server ..................... SUCCESS [06:37 min]
[INFO] cayenne-client: Cayenne ROP Client ................. SUCCESS [03:33 min]
[INFO] cayenne-project: Cayenne Project ................... FAILURE [  8.332 s]
[INFO] cayenne-dbsync: Database Synchronization Tools ..... SKIPPED
[INFO] cayenne-cgen: Cayenne Class Generation Tools ....... SKIPPED
[INFO] cayenne-ant: Cayenne Ant Tasks ..................... SKIPPED
[INFO] cayenne-lifecycle: Cayenne Lifecycle Utilities ..... SKIPPED
[INFO] cayenne-maven-plugins-parent: Maven Plugins parent . SKIPPED
[INFO] cayenne-maven-plugin: Cayenne Maven Plugin ......... SKIPPED
[INFO] cayenne-crypto: Cayenne Cryptography Extensions .... SKIPPED
[INFO] cayenne-joda: Cayenne Joda Extensions .............. SKIPPED
[INFO] cayenne-dbcp2: Cayenne DBCP2 Extension ............. SKIPPED
[INFO] cayenne-jcache: Cayenne JCache Integration ......... SKIPPED
[INFO] cayenne-itests-parent: Integration Tests Parent .... SKIPPED
[INFO] cayenne-tools-itest: Tools integration tests ....... SKIPPED
[INFO] cayenne-modeler-parent: Cayenne Modeler Parent ..... SKIPPED
[INFO] cayenne-wocompat: WebObjects Compatibility Library . SKIPPED
[INFO] cayenne-modeler: Cayenne Modeler Core .............. SKIPPED
[INFO] cayenne-modeler-generic-ext: Modeler Generic Extensions SKIPPED
[INFO] cayenne-modeler-generic: Modeler Generic Assembly .. SKIPPED
[INFO] cayenne-modeler-mac-ext: Modeler MacOS Extensions .. SKIPPED
[INFO] cayenne-modeler-mac: Modeler MacOS Assembly ........ SKIPPED
[INFO] cayenne-modeler-win-ext: Modeler Win Extensions .... SKIPPED
[INFO] cayenne-modeler-win: Modeler Windows Assembly ...... SKIPPED
[INFO] maven-cayenne-plugin: Deprecated Cayenne Maven Plugin SKIPPED
[INFO] cayenne-modeler-maven-plugin: Cayenne Modeler Maven Plugin SKIPPED
[INFO] cayenne-tutorials-parent: Cayenne Tutorials ........ SKIPPED
[INFO] tutorial: ayenne Tutorial .......................... SKIPPED
[INFO] tutorial-rop-server: Cayenne ROP Server Tutorial ... SKIPPED
[INFO] tutorial-rop-client: Cayenne ROP Client Tutorial ... SKIPPED
[INFO] cayenne-java8: Cayenne Java8 Extensions ............ SKIPPED
[INFO] cayenne-protostuff: Cayenne Protostuff Extension ... SKIPPED
[INFO] tutorial-rop-server-http2: Cayenne ROP HTTP/2 Server Tutorial SKIPPED
[INFO] cayenne-client-jetty: Cayenne ROP Client (Jetty) ... SKIPPED
[INFO] tutorial-rop-client-http2: Cayenne ROP HTTP/2 Client Tutorial SKIPPED
[INFO] cayenne-docs-parent: Cayenne Documenation Parent ... SKIPPED
[INFO] cayenne-doc: Cayenne Documentation ................. SKIPPED
[INFO] cayenne-docbook: Cayenne Docbook Documentation ..... SKIPPED
[INFO] docbook-stylesheets: Docbook - Cayenne Stylesheets . SKIPPED
[INFO] cayenne-guide: Docbook - Cayenne Guide ............. SKIPPED
[INFO] getting-started: Docbook - Getting Started with Cayenne SKIPPED
[INFO] getting-started-rop: Docbook - Getting Started with Cayenne ROP SKIPPED
[INFO] upgrade-guide: Docbook - Cayenne New Features and Upgrade Guide SKIPPED
[INFO] cayenne-assembly: Cayenne Release Assembly ......... SKIPPED
[INFO] ------------------------------------------------------------------------
[INFO] BUILD FAILURE
[INFO] ------------------------------------------------------------------------
[INFO] Total time: 10:33 min
[INFO] Finished at: 2017-02-15T14:32:40+00:00
[INFO] Final Memory: 137M/483M
[INFO] ------------------------------------------------------------------------
[ERROR] Failed to execute goal org.apache.maven.plugins:maven-surefire-plugin:2.5:test (default-test)
on project cayenne-project: There are test failures.
[ERROR] 
[ERROR] Please refer to <https://builds.apache.org/job/cayenne-master/cayenneTestConnection=derby,jdk=JDK%201.8%20(latest),slave=ubuntu/ws/cayenne-project/target/surefire-reports>
for the individual test results.
[ERROR] -> [Help 1]
org.apache.maven.lifecycle.LifecycleExecutionException: Failed to execute goal org.apache.maven.plugins:maven-surefire-plugin:2.5:test
(default-test) on project cayenne-project: There are test failures.

Please refer to <https://builds.apache.org/job/cayenne-master/cayenneTestConnection=derby,jdk=JDK%201.8%20(latest),slave=ubuntu/ws/cayenne-project/target/surefire-reports>
for the individual test results.
	at org.apache.maven.lifecycle.internal.MojoExecutor.execute(MojoExecutor.java:212)
	at org.apache.maven.lifecycle.internal.MojoExecutor.execute(MojoExecutor.java:153)
	at org.apache.maven.lifecycle.internal.MojoExecutor.execute(MojoExecutor.java:145)
	at org.apache.maven.lifecycle.internal.LifecycleModuleBuilder.buildProject(LifecycleModuleBuilder.java:116)
	at org.apache.maven.lifecycle.internal.LifecycleModuleBuilder.buildProject(LifecycleModuleBuilder.java:80)
	at org.apache.maven.lifecycle.internal.builder.singlethreaded.SingleThreadedBuilder.build(SingleThreadedBuilder.java:51)
	at org.apache.maven.lifecycle.internal.LifecycleStarter.execute(LifecycleStarter.java:128)
	at org.apache.maven.DefaultMaven.doExecute(DefaultMaven.java:307)
	at org.apache.maven.DefaultMaven.doExecute(DefaultMaven.java:193)
	at org.apache.maven.DefaultMaven.execute(DefaultMaven.java:106)
	at org.apache.maven.cli.MavenCli.execute(MavenCli.java:863)
	at org.apache.maven.cli.MavenCli.doMain(MavenCli.java:288)
	at org.apache.maven.cli.MavenCli.main(MavenCli.java:199)
	at sun.reflect.NativeMethodAccessorImpl.invoke0(Native Method)
	at sun.reflect.NativeMethodAccessorImpl.invoke(NativeMethodAccessorImpl.java:62)
	at sun.reflect.DelegatingMethodAccessorImpl.invoke(DelegatingMethodAccessorImpl.java:43)
	at java.lang.reflect.Method.invoke(Method.java:498)
	at org.codehaus.plexus.classworlds.launcher.Launcher.launchEnhanced(Launcher.java:289)
	at org.codehaus.plexus.classworlds.launcher.Launcher.launch(Launcher.java:229)
	at org.codehaus.plexus.classworlds.launcher.Launcher.mainWithExitCode(Launcher.java:415)
	at org.codehaus.plexus.classworlds.launcher.Launcher.main(Launcher.java:356)
Caused by: org.apache.maven.plugin.MojoFailureException: There are test failures.

Please refer to <https://builds.apache.org/job/cayenne-master/cayenneTestConnection=derby,jdk=JDK%201.8%20(latest),slave=ubuntu/ws/cayenne-project/target/surefire-reports>
for the individual test results.
	at org.apache.maven.plugin.surefire.SurefirePlugin.execute(SurefirePlugin.java:629)
	at org.apache.maven.plugin.DefaultBuildPluginManager.executeMojo(DefaultBuildPluginManager.java:134)
	at org.apache.maven.lifecycle.internal.MojoExecutor.execute(MojoExecutor.java:207)
	... 20 more
[ERROR] 
[ERROR] Re-run Maven using the -X switch to enable full debug logging.
[ERROR] 
[ERROR] For more information about the errors and possible solutions, please read the following
articles:
[ERROR] [Help 1] http://cwiki.apache.org/confluence/display/MAVEN/MojoFailureException
[ERROR] 
[ERROR] After correcting the problems, you can resume the build with the command
[ERROR]   mvn <goals> -rf :cayenne-project
Build step 'Invoke top-level Maven targets' marked build as failure
Recording test results

Mime
View raw message