cayenne-commits mailing list archives

Site index · List index
Message view « Date » · « Thread »
Top « Date » · « Thread »
From Apache Jenkins Server <jenk...@builds.apache.org>
Subject Build failed in Jenkins: cayenne-master » derby,JDK 1.8 (latest),ubuntu #486
Date Sat, 07 Jan 2017 15:27:22 GMT
See <https://builds.apache.org/job/cayenne-master/cayenneTestConnection=derby,jdk=JDK%201.8%20(latest),slave=ubuntu/486/changes>

Changes:

[andrus] null unit test

------------------------------------------
[...truncated 66433 lines...]
[INFO] Building jar: <https://builds.apache.org/job/cayenne-master/cayenneTestConnection=derby,jdk=JDK%201.8%20(latest),slave=ubuntu/ws/cayenne-java8/target/cayenne-java8-4.0.M5-SNAPSHOT.jar>
[INFO] 
[INFO] >>> maven-source-plugin:2.1.2:jar (bundle-source-jar) > generate-sources
@ cayenne-java8 >>>
[INFO] 
[INFO] --- maven-cayenne-plugin:4.0.M5-SNAPSHOT:cgen (default-cli) @ cayenne-java8 ---
[INFO] 
[INFO] <<< maven-source-plugin:2.1.2:jar (bundle-source-jar) < generate-sources
@ cayenne-java8 <<<
[INFO] 
[INFO] --- maven-source-plugin:2.1.2:jar (bundle-source-jar) @ cayenne-java8 ---
[INFO] META-INF already added, skipping
[INFO] META-INF/services already added, skipping
[INFO] org already added, skipping
[INFO] org/apache already added, skipping
[INFO] org/apache/cayenne already added, skipping
[INFO] org/apache/cayenne/java8 already added, skipping
[INFO] org/apache/cayenne/java8/access already added, skipping
[INFO] org/apache/cayenne/java8/access/types already added, skipping
[INFO] META-INF/services/org.apache.cayenne.di.spi.ModuleProvider already added, skipping
[INFO] Building jar: <https://builds.apache.org/job/cayenne-master/cayenneTestConnection=derby,jdk=JDK%201.8%20(latest),slave=ubuntu/ws/cayenne-java8/target/cayenne-java8-4.0.M5-SNAPSHOT-sources.jar>
[INFO] META-INF already added, skipping
[INFO] META-INF/services already added, skipping
[INFO] org already added, skipping
[INFO] org/apache already added, skipping
[INFO] org/apache/cayenne already added, skipping
[INFO] org/apache/cayenne/java8 already added, skipping
[INFO] org/apache/cayenne/java8/access already added, skipping
[INFO] org/apache/cayenne/java8/access/types already added, skipping
[INFO] META-INF/services/org.apache.cayenne.di.spi.ModuleProvider already added, skipping
[INFO] 
[INFO] --- maven-failsafe-plugin:2.17:integration-test (integration-test) @ cayenne-java8
---
[INFO] Failsafe report directory: <https://builds.apache.org/job/cayenne-master/cayenneTestConnection=derby,jdk=JDK%201.8%20(latest),slave=ubuntu/ws/cayenne-java8/target/failsafe-reports>

-------------------------------------------------------
 T E S T S
-------------------------------------------------------
Running org.apache.cayenne.java8.Java8TimeIT
[main] INFO org.apache.cayenne.configuration.XMLDataChannelDescriptorLoader - Loading XML
configuration resource from <https://builds.apache.org/job/cayenne-master/cayenneTestConnection=derby,jdk=JDK%201.8%20(latest),slave=ubuntu/ws/cayenne-java8/target/test-classes/cayenne-java8.xml>
[main] INFO org.apache.cayenne.configuration.XMLDataChannelDescriptorLoader - Loading XML
DataMap resource from <https://builds.apache.org/job/cayenne-master/cayenneTestConnection=derby,jdk=JDK%201.8%20(latest),slave=ubuntu/ws/cayenne-java8/target/test-classes/java8.map.xml>
[main] INFO org.apache.cayenne.configuration.XMLDataChannelDescriptorLoader - loading user
name and password.
[main] INFO org.apache.cayenne.datasource.DriverDataSource - Connecting to 'jdbc:hsqldb:mem:java8'
as 'sa'
[main] INFO org.apache.cayenne.datasource.DriverDataSource - +++ Connecting: SUCCESS.
[main] INFO org.apache.cayenne.configuration.server.DataDomainProvider - setting DataNode
'datanode' as default, used by all unlinked DataMaps
[main] INFO org.apache.cayenne.log.CommonsJdbcEventLogger - Detected and installed adapter:
org.apache.cayenne.dba.hsqldb.HSQLDBNoSchemaAdapter
[main] INFO org.apache.cayenne.log.CommonsJdbcEventLogger - --- transaction started.
[main] INFO org.apache.cayenne.access.dbsync.CreateIfNoSchemaStrategy - No schema detected,
will create mapped tables
[main] INFO org.apache.cayenne.log.CommonsJdbcEventLogger - CREATE CACHED TABLE LOCAL_TIME_TEST
(ID INTEGER NOT NULL, Time TIME NULL, PRIMARY KEY (ID))
[main] INFO org.apache.cayenne.log.CommonsJdbcEventLogger - CREATE CACHED TABLE LOCAL_DATE_TEST
(Date DATE NULL, ID INTEGER NOT NULL, PRIMARY KEY (ID))
[main] INFO org.apache.cayenne.log.CommonsJdbcEventLogger - CREATE CACHED TABLE LOCAL_DATETIME_TEST
(ID INTEGER NOT NULL, Timestamp TIMESTAMP NULL, PRIMARY KEY (ID))
[main] INFO org.apache.cayenne.log.CommonsJdbcEventLogger - CREATE TABLE AUTO_PK_SUPPORT (
 TABLE_NAME CHAR(100) NOT NULL,  NEXT_ID BIGINT NOT NULL,  PRIMARY KEY(TABLE_NAME))
[main] INFO org.apache.cayenne.log.CommonsJdbcEventLogger - DELETE FROM AUTO_PK_SUPPORT WHERE
TABLE_NAME IN ('LOCAL_DATETIME_TEST', 'LOCAL_DATE_TEST', 'LOCAL_TIME_TEST')
[main] INFO org.apache.cayenne.log.CommonsJdbcEventLogger - INSERT INTO AUTO_PK_SUPPORT (TABLE_NAME,
NEXT_ID) VALUES ('LOCAL_DATETIME_TEST', 200)
[main] INFO org.apache.cayenne.log.CommonsJdbcEventLogger - INSERT INTO AUTO_PK_SUPPORT (TABLE_NAME,
NEXT_ID) VALUES ('LOCAL_DATE_TEST', 200)
[main] INFO org.apache.cayenne.log.CommonsJdbcEventLogger - INSERT INTO AUTO_PK_SUPPORT (TABLE_NAME,
NEXT_ID) VALUES ('LOCAL_TIME_TEST', 200)
[main] INFO org.apache.cayenne.log.CommonsJdbcEventLogger - SELECT NEXT_ID FROM AUTO_PK_SUPPORT
WHERE TABLE_NAME = 'LOCAL_DATE_TEST'
[main] INFO org.apache.cayenne.log.CommonsJdbcEventLogger - === returned 1 row. - took 10
ms.
[main] INFO org.apache.cayenne.log.CommonsJdbcEventLogger - UPDATE AUTO_PK_SUPPORT SET NEXT_ID
= NEXT_ID + 20 WHERE TABLE_NAME = 'LOCAL_DATE_TEST'
[main] INFO org.apache.cayenne.log.CommonsJdbcEventLogger - === updated 1 row.
[main] INFO org.apache.cayenne.log.CommonsJdbcEventLogger - INSERT INTO LOCAL_DATE_TEST (Date,
ID) VALUES (?, ?)
[main] INFO org.apache.cayenne.log.CommonsJdbcEventLogger - [bind: 1->Date:NULL, 2->ID:200]
[main] INFO org.apache.cayenne.log.CommonsJdbcEventLogger - === updated 1 row.
[main] INFO org.apache.cayenne.log.CommonsJdbcEventLogger - +++ transaction committed.
[main] INFO org.apache.cayenne.log.CommonsJdbcEventLogger - --- transaction started.
[main] INFO org.apache.cayenne.log.CommonsJdbcEventLogger - SELECT t0.Date, t0.ID FROM LOCAL_DATE_TEST
t0 
[main] INFO org.apache.cayenne.log.CommonsJdbcEventLogger - === returned 1 row. - took 9 ms.
[main] INFO org.apache.cayenne.log.CommonsJdbcEventLogger - +++ transaction committed.
[main] INFO org.apache.cayenne.configuration.XMLDataChannelDescriptorLoader - Loading XML
configuration resource from <https://builds.apache.org/job/cayenne-master/cayenneTestConnection=derby,jdk=JDK%201.8%20(latest),slave=ubuntu/ws/cayenne-java8/target/test-classes/cayenne-java8.xml>
[main] INFO org.apache.cayenne.configuration.XMLDataChannelDescriptorLoader - Loading XML
DataMap resource from <https://builds.apache.org/job/cayenne-master/cayenneTestConnection=derby,jdk=JDK%201.8%20(latest),slave=ubuntu/ws/cayenne-java8/target/test-classes/java8.map.xml>
[main] INFO org.apache.cayenne.configuration.XMLDataChannelDescriptorLoader - loading user
name and password.
[main] INFO org.apache.cayenne.datasource.DriverDataSource - Connecting to 'jdbc:hsqldb:mem:java8'
as 'sa'
[main] INFO org.apache.cayenne.datasource.DriverDataSource - +++ Connecting: SUCCESS.
[main] INFO org.apache.cayenne.configuration.server.DataDomainProvider - setting DataNode
'datanode' as default, used by all unlinked DataMaps
[main] INFO org.apache.cayenne.log.CommonsJdbcEventLogger - Detected and installed adapter:
org.apache.cayenne.dba.hsqldb.HSQLDBNoSchemaAdapter
[main] INFO org.apache.cayenne.log.CommonsJdbcEventLogger - --- transaction started.
[main] INFO org.apache.cayenne.access.dbsync.CreateIfNoSchemaStrategy - Full or partial schema
detected, skipping tables creation
[main] INFO org.apache.cayenne.log.CommonsJdbcEventLogger - SELECT NEXT_ID FROM AUTO_PK_SUPPORT
WHERE TABLE_NAME = 'LOCAL_DATE_TEST'
[main] INFO org.apache.cayenne.log.CommonsJdbcEventLogger - === returned 1 row. - took 0 ms.
[main] INFO org.apache.cayenne.log.CommonsJdbcEventLogger - UPDATE AUTO_PK_SUPPORT SET NEXT_ID
= NEXT_ID + 20 WHERE TABLE_NAME = 'LOCAL_DATE_TEST'
[main] INFO org.apache.cayenne.log.CommonsJdbcEventLogger - === updated 1 row.
[main] INFO org.apache.cayenne.log.CommonsJdbcEventLogger - INSERT INTO LOCAL_DATE_TEST (Date,
ID) VALUES (?, ?)
[main] INFO org.apache.cayenne.log.CommonsJdbcEventLogger - [bind: 1->Date:java.time.LocalDate@1995250556,
2->ID:220]
[main] INFO org.apache.cayenne.log.CommonsJdbcEventLogger - === updated 1 row.
[main] INFO org.apache.cayenne.log.CommonsJdbcEventLogger - +++ transaction committed.
[main] INFO org.apache.cayenne.log.CommonsJdbcEventLogger - --- transaction started.
[main] INFO org.apache.cayenne.log.CommonsJdbcEventLogger - SELECT t0.Date, t0.ID FROM LOCAL_DATE_TEST
t0 
[main] INFO org.apache.cayenne.log.CommonsJdbcEventLogger - === returned 2 rows. - took 0
ms.
[main] INFO org.apache.cayenne.log.CommonsJdbcEventLogger - +++ transaction committed.
[main] INFO org.apache.cayenne.configuration.XMLDataChannelDescriptorLoader - Loading XML
configuration resource from <https://builds.apache.org/job/cayenne-master/cayenneTestConnection=derby,jdk=JDK%201.8%20(latest),slave=ubuntu/ws/cayenne-java8/target/test-classes/cayenne-java8.xml>
[main] INFO org.apache.cayenne.configuration.XMLDataChannelDescriptorLoader - Loading XML
DataMap resource from <https://builds.apache.org/job/cayenne-master/cayenneTestConnection=derby,jdk=JDK%201.8%20(latest),slave=ubuntu/ws/cayenne-java8/target/test-classes/java8.map.xml>
[main] INFO org.apache.cayenne.configuration.XMLDataChannelDescriptorLoader - loading user
name and password.
[main] INFO org.apache.cayenne.datasource.DriverDataSource - Connecting to 'jdbc:hsqldb:mem:java8'
as 'sa'
[main] INFO org.apache.cayenne.datasource.DriverDataSource - +++ Connecting: SUCCESS.
[main] INFO org.apache.cayenne.configuration.server.DataDomainProvider - setting DataNode
'datanode' as default, used by all unlinked DataMaps
[main] INFO org.apache.cayenne.log.CommonsJdbcEventLogger - Detected and installed adapter:
org.apache.cayenne.dba.hsqldb.HSQLDBNoSchemaAdapter
[main] INFO org.apache.cayenne.log.CommonsJdbcEventLogger - --- transaction started.
[main] INFO org.apache.cayenne.access.dbsync.CreateIfNoSchemaStrategy - Full or partial schema
detected, skipping tables creation
[main] INFO org.apache.cayenne.log.CommonsJdbcEventLogger - SELECT NEXT_ID FROM AUTO_PK_SUPPORT
WHERE TABLE_NAME = 'LOCAL_TIME_TEST'
[main] INFO org.apache.cayenne.log.CommonsJdbcEventLogger - === returned 1 row. - took 0 ms.
[main] INFO org.apache.cayenne.log.CommonsJdbcEventLogger - UPDATE AUTO_PK_SUPPORT SET NEXT_ID
= NEXT_ID + 20 WHERE TABLE_NAME = 'LOCAL_TIME_TEST'
[main] INFO org.apache.cayenne.log.CommonsJdbcEventLogger - === updated 1 row.
[main] INFO org.apache.cayenne.log.CommonsJdbcEventLogger - INSERT INTO LOCAL_TIME_TEST (ID,
Time) VALUES (?, ?)
[main] INFO org.apache.cayenne.log.CommonsJdbcEventLogger - [bind: 1->ID:200, 2->Time:java.time.LocalTime@142247393]
[main] INFO org.apache.cayenne.log.CommonsJdbcEventLogger - === updated 1 row.
[main] INFO org.apache.cayenne.log.CommonsJdbcEventLogger - +++ transaction committed.
[main] INFO org.apache.cayenne.log.CommonsJdbcEventLogger - --- transaction started.
[main] INFO org.apache.cayenne.log.CommonsJdbcEventLogger - SELECT t0.Time, t0.ID FROM LOCAL_TIME_TEST
t0 
[main] INFO org.apache.cayenne.log.CommonsJdbcEventLogger - === returned 1 row. - took 1 ms.
[main] INFO org.apache.cayenne.log.CommonsJdbcEventLogger - +++ transaction committed.
[main] INFO org.apache.cayenne.configuration.XMLDataChannelDescriptorLoader - Loading XML
configuration resource from <https://builds.apache.org/job/cayenne-master/cayenneTestConnection=derby,jdk=JDK%201.8%20(latest),slave=ubuntu/ws/cayenne-java8/target/test-classes/cayenne-java8.xml>
[main] INFO org.apache.cayenne.configuration.XMLDataChannelDescriptorLoader - Loading XML
DataMap resource from <https://builds.apache.org/job/cayenne-master/cayenneTestConnection=derby,jdk=JDK%201.8%20(latest),slave=ubuntu/ws/cayenne-java8/target/test-classes/java8.map.xml>
[main] INFO org.apache.cayenne.configuration.XMLDataChannelDescriptorLoader - loading user
name and password.
[main] INFO org.apache.cayenne.datasource.DriverDataSource - Connecting to 'jdbc:hsqldb:mem:java8'
as 'sa'
[main] INFO org.apache.cayenne.datasource.DriverDataSource - +++ Connecting: SUCCESS.
[main] INFO org.apache.cayenne.configuration.server.DataDomainProvider - setting DataNode
'datanode' as default, used by all unlinked DataMaps
[main] INFO org.apache.cayenne.log.CommonsJdbcEventLogger - Detected and installed adapter:
org.apache.cayenne.dba.hsqldb.HSQLDBNoSchemaAdapter
[main] INFO org.apache.cayenne.log.CommonsJdbcEventLogger - --- transaction started.
[main] INFO org.apache.cayenne.access.dbsync.CreateIfNoSchemaStrategy - Full or partial schema
detected, skipping tables creation
[main] INFO org.apache.cayenne.log.CommonsJdbcEventLogger - SELECT NEXT_ID FROM AUTO_PK_SUPPORT
WHERE TABLE_NAME = 'LOCAL_DATETIME_TEST'
[main] INFO org.apache.cayenne.log.CommonsJdbcEventLogger - === returned 1 row. - took 0 ms.
[main] INFO org.apache.cayenne.log.CommonsJdbcEventLogger - UPDATE AUTO_PK_SUPPORT SET NEXT_ID
= NEXT_ID + 20 WHERE TABLE_NAME = 'LOCAL_DATETIME_TEST'
[main] INFO org.apache.cayenne.log.CommonsJdbcEventLogger - === updated 1 row.
[main] INFO org.apache.cayenne.log.CommonsJdbcEventLogger - INSERT INTO LOCAL_DATETIME_TEST
(ID, Timestamp) VALUES (?, ?)
[main] INFO org.apache.cayenne.log.CommonsJdbcEventLogger - [bind: 1->ID:200, 2->Timestamp:java.time.LocalDateTime@1311146128]
[main] INFO org.apache.cayenne.log.CommonsJdbcEventLogger - === updated 1 row.
[main] INFO org.apache.cayenne.log.CommonsJdbcEventLogger - +++ transaction committed.
[main] INFO org.apache.cayenne.log.CommonsJdbcEventLogger - --- transaction started.
[main] INFO org.apache.cayenne.log.CommonsJdbcEventLogger - SELECT t0.Timestamp, t0.ID FROM
LOCAL_DATETIME_TEST t0 
[main] INFO org.apache.cayenne.log.CommonsJdbcEventLogger - === returned 1 row. - took 1 ms.
[main] INFO org.apache.cayenne.log.CommonsJdbcEventLogger - +++ transaction committed.
Tests run: 4, Failures: 0, Errors: 1, Skipped: 0, Time elapsed: 1.123 sec <<< FAILURE!
- in org.apache.cayenne.java8.Java8TimeIT
testJava8LocalDate(org.apache.cayenne.java8.Java8TimeIT)  Time elapsed: 0.067 sec  <<<
ERROR!
org.apache.cayenne.CayenneRuntimeException: [v.4.0.M5-SNAPSHOT Jan 07 2017 15:21:51] Expected
zero or one object, instead query matched: 2
	at org.apache.cayenne.BaseContext.selectOne(BaseContext.java:320)
	at org.apache.cayenne.query.ObjectSelect.selectOne(ObjectSelect.java:669)
	at org.apache.cayenne.java8.Java8TimeIT.testJava8LocalDate(Java8TimeIT.java:63)


Results :

Tests in error: 
  Java8TimeIT.testJava8LocalDate:63 » CayenneRuntime [v.4.0.M5-SNAPSHOT Jan 07 2...

Tests run: 4, Failures: 0, Errors: 1, Skipped: 0

[INFO] 
[INFO] --- maven-failsafe-plugin:2.17:verify (integration-test) @ cayenne-java8 ---
[INFO] Failsafe report directory: <https://builds.apache.org/job/cayenne-master/cayenneTestConnection=derby,jdk=JDK%201.8%20(latest),slave=ubuntu/ws/cayenne-java8/target/failsafe-reports>
[INFO] ------------------------------------------------------------------------
[INFO] Reactor Summary:
[INFO] 
[INFO] cayenne-parent: Top-level parent of Cayenne mdoules  SUCCESS [  0.918 s]
[INFO] build-tools-parent: Cayenne Build Tools Parent ..... SUCCESS [  0.016 s]
[INFO] cayenne-legal: Cayenne License and Notice Bundle ... SUCCESS [  2.153 s]
[INFO] cayenne-test-utilities: Common Unit Test Utilities . SUCCESS [  1.273 s]
[INFO] cayenne-checkers: Cayenne Code Checkers ............ SUCCESS [  0.062 s]
[INFO] cayenne-di: Cayenne Dependency Injection Container . SUCCESS [ 10.522 s]
[INFO] cayenne-server: Cayenne Server ..................... SUCCESS [01:41 min]
[INFO] cayenne-client: Cayenne ROP Client ................. SUCCESS [ 29.103 s]
[INFO] cayenne-dbsync: Database Synchronization Tools ..... SUCCESS [ 26.765 s]
[INFO] cayenne-project: Cayenne Project ................... SUCCESS [  7.451 s]
[INFO] cayenne-tools: Cayenne Tools ....................... SUCCESS [  9.949 s]
[INFO] cayenne-lifecycle: Cayenne Lifecycle Utilities ..... SUCCESS [  9.753 s]
[INFO] cayenne-plugins-parent: Cayenne Maven Plugins parent SUCCESS [  0.656 s]
[INFO] maven-cayenne-plugin: Cayenne Maven Plugin ......... SUCCESS [ 19.400 s]
[INFO] cayenne-crypto: Cayenne Cryptography Extensions .... SUCCESS [  8.592 s]
[INFO] cayenne-joda: Cayenne Joda Extensions .............. SUCCESS [  4.320 s]
[INFO] cayenne-dbcp2: Cayenne DBCP2 Extension ............. SUCCESS [  2.627 s]
[INFO] cayenne-itests-parent: Integration Tests Parent .... SUCCESS [  0.005 s]
[INFO] cayenne-tools-itest: Tools integration tests ....... SUCCESS [  1.606 s]
[INFO] cayenne-modeler-parent: Cayenne Modeler Parent ..... SUCCESS [  0.011 s]
[INFO] cayenne-wocompat: WebObjects Compatibility Library . SUCCESS [  5.598 s]
[INFO] cayenne-modeler: Cayenne Modeler Core .............. SUCCESS [ 14.704 s]
[INFO] cayenne-modeler-generic-ext: Modeler Generic Extensions SUCCESS [  1.682 s]
[INFO] cayenne-modeler-generic: Modeler Generic Assembly .. SUCCESS [  0.551 s]
[INFO] cayenne-modeler-mac-ext: Modeler MacOS Extensions .. SUCCESS [  1.806 s]
[INFO] cayenne-modeler-mac: Modeler MacOS Assembly ........ SUCCESS [  0.532 s]
[INFO] cayenne-modeler-win-ext: Modeler Win Extensions .... SUCCESS [  1.429 s]
[INFO] cayenne-modeler-win: Modeler Windows Assembly ...... SUCCESS [  0.576 s]
[INFO] maven-cayenne-modeler-plugin: Cayenne Modeler Maven Plugin SUCCESS [  3.012 s]
[INFO] cayenne-tutorials-parent: Cayenne Tutorials ........ SUCCESS [  0.010 s]
[INFO] tutorial: ayenne Tutorial .......................... SUCCESS [  1.060 s]
[INFO] tutorial-rop-server: Cayenne ROP Server Tutorial ... SUCCESS [  1.886 s]
[INFO] tutorial-rop-client: Cayenne ROP Client Tutorial ... SUCCESS [  1.120 s]
[INFO] cayenne-java8: Cayenne Java8 Extensions ............ FAILURE [  4.816 s]
[INFO] cayenne-protostuff: Cayenne Protostuff Extension ... SKIPPED
[INFO] tutorial-rop-server-http2: Cayenne ROP HTTP/2 Server Tutorial SKIPPED
[INFO] cayenne-client-jetty: Cayenne ROP Client (Jetty) ... SKIPPED
[INFO] tutorial-rop-client-http2: Cayenne ROP HTTP/2 Client Tutorial SKIPPED
[INFO] cayenne-docs-parent: Cayenne Documenation Parent ... SKIPPED
[INFO] cayenne-doc: Cayenne Documentation ................. SKIPPED
[INFO] cayenne-docbook: Cayenne Docbook Documentation ..... SKIPPED
[INFO] docbook-stylesheets: Docbook - Cayenne Stylesheets . SKIPPED
[INFO] cayenne-guide: Docbook - Cayenne Guide ............. SKIPPED
[INFO] getting-started: Docbook - Getting Started with Cayenne SKIPPED
[INFO] getting-started-rop: Docbook - Getting Started with Cayenne ROP SKIPPED
[INFO] upgrade-guide: Docbook - Cayenne New Features and Upgrade Guide SKIPPED
[INFO] cayenne-assembly: Cayenne Release Assembly ......... SKIPPED
[INFO] ------------------------------------------------------------------------
[INFO] BUILD FAILURE
[INFO] ------------------------------------------------------------------------
[INFO] Total time: 04:37 min
[INFO] Finished at: 2017-01-07T15:26:28+00:00
[INFO] Final Memory: 256M/486M
[INFO] ------------------------------------------------------------------------
[ERROR] Failed to execute goal org.apache.maven.plugins:maven-failsafe-plugin:2.17:verify
(integration-test) on project cayenne-java8: There are test failures.
[ERROR] 
[ERROR] Please refer to <https://builds.apache.org/job/cayenne-master/cayenneTestConnection=derby,jdk=JDK%201.8%20(latest),slave=ubuntu/ws/cayenne-java8/target/failsafe-reports>
for the individual test results.
[ERROR] -> [Help 1]
org.apache.maven.lifecycle.LifecycleExecutionException: Failed to execute goal org.apache.maven.plugins:maven-failsafe-plugin:2.17:verify
(integration-test) on project cayenne-java8: There are test failures.

Please refer to <https://builds.apache.org/job/cayenne-master/cayenneTestConnection=derby,jdk=JDK%201.8%20(latest),slave=ubuntu/ws/cayenne-java8/target/failsafe-reports>
for the individual test results.
	at org.apache.maven.lifecycle.internal.MojoExecutor.execute(MojoExecutor.java:212)
	at org.apache.maven.lifecycle.internal.MojoExecutor.execute(MojoExecutor.java:153)
	at org.apache.maven.lifecycle.internal.MojoExecutor.execute(MojoExecutor.java:145)
	at org.apache.maven.lifecycle.internal.LifecycleModuleBuilder.buildProject(LifecycleModuleBuilder.java:116)
	at org.apache.maven.lifecycle.internal.LifecycleModuleBuilder.buildProject(LifecycleModuleBuilder.java:80)
	at org.apache.maven.lifecycle.internal.builder.singlethreaded.SingleThreadedBuilder.build(SingleThreadedBuilder.java:51)
	at org.apache.maven.lifecycle.internal.LifecycleStarter.execute(LifecycleStarter.java:128)
	at org.apache.maven.DefaultMaven.doExecute(DefaultMaven.java:307)
	at org.apache.maven.DefaultMaven.doExecute(DefaultMaven.java:193)
	at org.apache.maven.DefaultMaven.execute(DefaultMaven.java:106)
	at org.apache.maven.cli.MavenCli.execute(MavenCli.java:863)
	at org.apache.maven.cli.MavenCli.doMain(MavenCli.java:288)
	at org.apache.maven.cli.MavenCli.main(MavenCli.java:199)
	at sun.reflect.NativeMethodAccessorImpl.invoke0(Native Method)
	at sun.reflect.NativeMethodAccessorImpl.invoke(NativeMethodAccessorImpl.java:62)
	at sun.reflect.DelegatingMethodAccessorImpl.invoke(DelegatingMethodAccessorImpl.java:43)
	at java.lang.reflect.Method.invoke(Method.java:498)
	at org.codehaus.plexus.classworlds.launcher.Launcher.launchEnhanced(Launcher.java:289)
	at org.codehaus.plexus.classworlds.launcher.Launcher.launch(Launcher.java:229)
	at org.codehaus.plexus.classworlds.launcher.Launcher.mainWithExitCode(Launcher.java:415)
	at org.codehaus.plexus.classworlds.launcher.Launcher.main(Launcher.java:356)
Caused by: org.apache.maven.plugin.MojoFailureException: There are test failures.

Please refer to <https://builds.apache.org/job/cayenne-master/cayenneTestConnection=derby,jdk=JDK%201.8%20(latest),slave=ubuntu/ws/cayenne-java8/target/failsafe-reports>
for the individual test results.
	at org.apache.maven.plugin.surefire.SurefireHelper.reportExecution(SurefireHelper.java:82)
	at org.apache.maven.plugin.failsafe.VerifyMojo.execute(VerifyMojo.java:194)
	at org.apache.maven.plugin.DefaultBuildPluginManager.executeMojo(DefaultBuildPluginManager.java:134)
	at org.apache.maven.lifecycle.internal.MojoExecutor.execute(MojoExecutor.java:207)
	... 20 more
[ERROR] 
[ERROR] Re-run Maven using the -X switch to enable full debug logging.
[ERROR] 
[ERROR] For more information about the errors and possible solutions, please read the following
articles:
[ERROR] [Help 1] http://cwiki.apache.org/confluence/display/MAVEN/MojoFailureException
[ERROR] 
[ERROR] After correcting the problems, you can resume the build with the command
[ERROR]   mvn <goals> -rf :cayenne-java8
Build step 'Invoke top-level Maven targets' marked build as failure
Recording test results

Mime
View raw message