cayenne-commits mailing list archives

Site index · List index
Message view « Date » · « Thread »
Top « Date » · « Thread »
From Apache Jenkins Server <jenk...@builds.apache.org>
Subject Build failed in Jenkins: Cayenne pull requests #214
Date Fri, 02 Dec 2016 17:21:17 GMT
See <https://builds.apache.org/job/Cayenne%20pull%20requests/214/changes>

Changes:

[ruslan] Disable logs in all modules. Provide property for passing log level in

------------------------------------------
[...truncated 473 lines...]
[INFO] Cayenne Tutorials
[INFO] Cayenne Tutorial
[INFO] Cayenne ROP Server Tutorial
[INFO] Cayenne ROP Client Tutorial
[INFO] Cayenne Java8 Extensions
[INFO] Cayenne Protostuff Extension
[INFO] Cayenne ROP HTTP/2 Server Tutorial
[INFO] Cayenne ROP Client (Jetty)
[INFO] Cayenne ROP HTTP/2 Client Tutorial
[INFO] Cayenne Documenation Parent
[INFO] Cayenne Documentation
[INFO] Cayenne Docbook Documentation
[INFO] Docbook: Cayenne Stylesheets
[INFO] Docbook: Cayenne Guide
[INFO] Docbook: Getting Started with Cayenne
[INFO] Docbook: Getting Started with Cayenne ROP
[INFO] Docbook: Cayenne New Features and Upgrade Guide
[INFO] Cayenne Release Assembly
[INFO]                                                                         
[INFO] ------------------------------------------------------------------------
[INFO] Building Cayenne 4.0.M4-SNAPSHOT
[INFO] ------------------------------------------------------------------------
[INFO] 
[INFO] --- maven-clean-plugin:2.4.1:clean (default-clean) @ cayenne-parent ---
[WARNING] Failed to getClass for org.apache.maven.plugin.source.SourceJarMojo
[INFO] 
[INFO] --- maven-source-plugin:2.1.2:jar (bundle-source-jar) @ cayenne-parent ---
[INFO] 
[INFO] --- maven-failsafe-plugin:2.17:integration-test (integration-test) @ cayenne-parent
---
[INFO] No tests to run.
[JENKINS] Recording test results
[INFO] 
[INFO] --- maven-failsafe-plugin:2.17:verify (integration-test) @ cayenne-parent ---
[INFO] No tests to run.
[JENKINS] Recording test results[INFO] 
[INFO] --- maven-install-plugin:2.3.1:install (default-install) @ cayenne-parent ---

[INFO] Installing <https://builds.apache.org/job/Cayenne%20pull%20requests/ws/pom.xml>
to /home/jenkins/jenkins-slave/maven-repositories/1/org/apache/cayenne/cayenne-parent/4.0.M4-SNAPSHOT/cayenne-parent-4.0.M4-SNAPSHOT.pom
[INFO]                                                                         
[INFO] ------------------------------------------------------------------------
[INFO] Building Cayenne Build Tools Parent 4.0.M4-SNAPSHOT
[INFO] ------------------------------------------------------------------------
[INFO] 
[INFO] --- maven-clean-plugin:2.4.1:clean (default-clean) @ build-tools-parent ---
[WARNING] Failed to getClass for org.apache.maven.plugin.source.SourceJarMojo
[INFO] 
[INFO] --- maven-source-plugin:2.1.2:jar (bundle-source-jar) @ build-tools-parent ---
[INFO] 
[INFO] --- maven-failsafe-plugin:2.17:integration-test (integration-test) @ build-tools-parent
---
[INFO] No tests to run.
[JENKINS] Recording test results
[INFO] 
[INFO] --- maven-failsafe-plugin:2.17:verify (integration-test) @ build-tools-parent ---
[INFO] No tests to run.
[INFO] 
[INFO] --- maven-install-plugin:2.3.1:install (default-install) @ build-tools-parent ---
[INFO] Installing <https://builds.apache.org/job/Cayenne%20pull%20requests/ws/build-tools/pom.xml>
to /home/jenkins/jenkins-slave/maven-repositories/1/org/apache/cayenne/build-tools/build-tools-parent/4.0.M4-SNAPSHOT/build-tools-parent-4.0.M4-SNAPSHOT.pom
[JENKINS] Recording test results
[INFO]                                                                         
[INFO] ------------------------------------------------------------------------
[INFO] Building Cayenne License and Notice Bundle 4.0.M4-SNAPSHOT
[INFO] ------------------------------------------------------------------------
[INFO] 
[INFO] --- maven-clean-plugin:2.4.1:clean (default-clean) @ cayenne-legal ---
[INFO] 
[INFO] --- maven-remote-resources-plugin:1.5:bundle (default) @ cayenne-legal ---
[INFO] 
[INFO] --- maven-resources-plugin:2.4.3:resources (default-resources) @ cayenne-legal ---
[INFO] Using 'UTF-8' encoding to copy filtered resources.
[INFO] Copying 2 resources
[INFO] 
[INFO] --- maven-compiler-plugin:2.3.2:compile (default-compile) @ cayenne-legal ---
[INFO] No sources to compile
[INFO] 
[INFO] --- maven-resources-plugin:2.4.3:testResources (default-testResources) @ cayenne-legal
---
[INFO] Using 'UTF-8' encoding to copy filtered resources.
[INFO] skip non existing resourceDirectory <https://builds.apache.org/job/Cayenne%20pull%20requests/ws/build-tools/cayenne-legal/src/test/resources>
[INFO] 
[INFO] --- maven-compiler-plugin:2.3.2:testCompile (default-testCompile) @ cayenne-legal ---
[INFO] No sources to compile
[INFO] 
[INFO] --- maven-surefire-plugin:2.5:test (default-test) @ cayenne-legal ---
[INFO] No tests to run.
[JENKINS] Recording test results
[INFO] 
[INFO] --- maven-jar-plugin:2.4:jar (default-jar) @ cayenne-legal ---
[INFO] Building jar: <https://builds.apache.org/job/Cayenne%20pull%20requests/ws/build-tools/cayenne-legal/target/cayenne-legal-4.0.M4-SNAPSHOT.jar>
[WARNING] Failed to getClass for org.apache.maven.plugin.source.SourceJarMojo
[INFO] 
[INFO] --- maven-source-plugin:2.1.2:jar (bundle-source-jar) @ cayenne-legal ---
[INFO] Building jar: <https://builds.apache.org/job/Cayenne%20pull%20requests/ws/build-tools/cayenne-legal/target/cayenne-legal-4.0.M4-SNAPSHOT-sources.jar>
[INFO] 
[INFO] --- maven-failsafe-plugin:2.17:integration-test (integration-test) @ cayenne-legal
---
[INFO] No tests to run.
[JENKINS] Recording test results
[INFO] 
[INFO] --- maven-failsafe-plugin:2.17:verify (integration-test) @ cayenne-legal ---
[INFO] No tests to run.
[JENKINS] Recording test results[INFO] 

[INFO] --- maven-install-plugin:2.3.1:install (default-install) @ cayenne-legal ---
[INFO] Installing <https://builds.apache.org/job/Cayenne%20pull%20requests/ws/build-tools/cayenne-legal/target/cayenne-legal-4.0.M4-SNAPSHOT.jar>
to /home/jenkins/jenkins-slave/maven-repositories/1/org/apache/cayenne/build-tools/cayenne-legal/4.0.M4-SNAPSHOT/cayenne-legal-4.0.M4-SNAPSHOT.jar
[INFO] Installing <https://builds.apache.org/job/Cayenne%20pull%20requests/ws/build-tools/cayenne-legal/pom.xml>
to /home/jenkins/jenkins-slave/maven-repositories/1/org/apache/cayenne/build-tools/cayenne-legal/4.0.M4-SNAPSHOT/cayenne-legal-4.0.M4-SNAPSHOT.pom
[INFO] Installing <https://builds.apache.org/job/Cayenne%20pull%20requests/ws/build-tools/cayenne-legal/target/cayenne-legal-4.0.M4-SNAPSHOT-sources.jar>
to /home/jenkins/jenkins-slave/maven-repositories/1/org/apache/cayenne/build-tools/cayenne-legal/4.0.M4-SNAPSHOT/cayenne-legal-4.0.M4-SNAPSHOT-sources.jar
[INFO]                                                                         
[INFO] ------------------------------------------------------------------------
[INFO] Building Common Unit Test Utilities 4.0.M4-SNAPSHOT
[INFO] ------------------------------------------------------------------------
[INFO] 
[INFO] --- maven-clean-plugin:2.4.1:clean (default-clean) @ cayenne-test-utilities ---
[INFO] 
[INFO] --- maven-resources-plugin:2.4.3:resources (default-resources) @ cayenne-test-utilities
---
[INFO] Using 'UTF-8' encoding to copy filtered resources.
[INFO] skip non existing resourceDirectory <https://builds.apache.org/job/Cayenne%20pull%20requests/ws/build-tools/cayenne-test-utilities/src/main/resources>
[INFO] 
[INFO] --- maven-compiler-plugin:2.3.2:compile (default-compile) @ cayenne-test-utilities
---
[INFO] Compiling 14 source files to <https://builds.apache.org/job/Cayenne%20pull%20requests/ws/build-tools/cayenne-test-utilities/target/classes>
[INFO] -------------------------------------------------------------
[ERROR] COMPILATION ERROR : 
[INFO] -------------------------------------------------------------
[ERROR] Unable to locate the Javac Compiler in:
  /usr/lib/jvm/java-8-openjdk-amd64/jre/../lib/tools.jar
Please ensure you are using JDK 1.4 or above and
not a JRE (the com.sun.tools.javac.Main class is required).
In most cases you can change the location of your Java
installation by setting the JAVA_HOME environment variable.
[INFO] 1 error
[INFO] -------------------------------------------------------------
[INFO] ------------------------------------------------------------------------
[INFO] Reactor Summary:
[INFO] 
[INFO] Cayenne ........................................... SUCCESS [59.206s]
[INFO] Cayenne Build Tools Parent ........................ SUCCESS [0.904s]
[INFO] Cayenne License and Notice Bundle ................. SUCCESS [2.607s]
[INFO] Common Unit Test Utilities ........................ FAILURE [0.433s]
[INFO] Cayenne Code Checkers ............................. SKIPPED
[INFO] Cayenne Dependency Injection Container ............ SKIPPED
[INFO] Cayenne Server .................................... SKIPPED
[INFO] Cayenne ROP Client ................................ SKIPPED
[INFO] Cayenne Database Synchronization Tools ............ SKIPPED
[INFO] Cayenne Project ................................... SKIPPED
[INFO] Cayenne Tools ..................................... SKIPPED
[INFO] Cayenne Lifecycle Utilities ....................... SKIPPED
[INFO] Cayenne Maven Plugins ............................. SKIPPED
[INFO] Cayenne Maven Plugin .............................. SKIPPED
[INFO] Cayenne Cryptography Extensions ................... SKIPPED
[INFO] Cayenne Joda Extensions ........................... SKIPPED
[INFO] Cayenne DBCP2 Extension ........................... SKIPPED
[INFO] Cayenne Integration Tests Parent .................. SKIPPED
[INFO] Integration Tests - Cayenne Tools ................. SKIPPED
[INFO] Cayenne Modeler Parent ............................ SKIPPED
[INFO] Cayenne WebObjects Compatibility Library .......... SKIPPED
[INFO] Cayenne Modeler ................................... SKIPPED
[INFO] Cayenne Modeler Generic and Windows Extensions .... SKIPPED
[INFO] Cayenne Modeler Generic ........................... SKIPPED
[INFO] Cayenne Modeler Mac OS X Extensions ............... SKIPPED
[INFO] Cayenne Modeler Mac OS X .......................... SKIPPED
[INFO] Cayenne Modeler Win Extensions .................... SKIPPED
[INFO] Cayenne Modeler Windows ........................... SKIPPED
[INFO] Cayenne Modeler Maven Plugin ...................... SKIPPED
[INFO] Cayenne Tutorials ................................. SKIPPED
[INFO] Cayenne Tutorial .................................. SKIPPED
[INFO] Cayenne ROP Server Tutorial ....................... SKIPPED
[INFO] Cayenne ROP Client Tutorial ....................... SKIPPED
[INFO] Cayenne Java8 Extensions .......................... SKIPPED
[INFO] Cayenne Protostuff Extension ...................... SKIPPED
[INFO] Cayenne ROP HTTP/2 Server Tutorial ................ SKIPPED
[INFO] Cayenne ROP Client (Jetty) ........................ SKIPPED
[INFO] Cayenne ROP HTTP/2 Client Tutorial ................ SKIPPED
[INFO] Cayenne Documenation Parent ....................... SKIPPED
[INFO] Cayenne Documentation ............................. SKIPPED
[INFO] Cayenne Docbook Documentation ..................... SKIPPED
[INFO] Docbook: Cayenne Stylesheets ...................... SKIPPED
[INFO] Docbook: Cayenne Guide ............................ SKIPPED
[INFO] Docbook: Getting Started with Cayenne ............. SKIPPED
[INFO] Docbook: Getting Started with Cayenne ROP ......... SKIPPED
[INFO] Docbook: Cayenne New Features and Upgrade Guide ... SKIPPED
[INFO] Cayenne Release Assembly .......................... SKIPPED
[INFO] ------------------------------------------------------------------------
[INFO] BUILD FAILURE
[INFO] ------------------------------------------------------------------------
[INFO] Total time: 1:14.482s
[INFO] Finished at: Fri Dec 02 17:37:51 UTC 2016
[INFO] Final Memory: 20M/249M
[INFO] ------------------------------------------------------------------------
Waiting for Jenkins to finish collecting data
[ERROR] Failed to execute goal org.apache.maven.plugins:maven-compiler-plugin:2.3.2:compile
(default-compile) on project cayenne-test-utilities: Compilation failure
[ERROR] Unable to locate the Javac Compiler in:
[ERROR] /usr/lib/jvm/java-8-openjdk-amd64/jre/../lib/tools.jar
[ERROR] Please ensure you are using JDK 1.4 or above and
[ERROR] not a JRE (the com.sun.tools.javac.Main class is required).
[ERROR] In most cases you can change the location of your Java
[ERROR] installation by setting the JAVA_HOME environment variable.
[ERROR] -> [Help 1]
[ERROR] 
[ERROR] To see the full stack trace of the errors, re-run Maven with the -e switch.
[ERROR] Re-run Maven using the -X switch to enable full debug logging.
[ERROR] 
[ERROR] For more information about the errors and possible solutions, please read the following
articles:
[ERROR] [Help 1] http://cwiki.apache.org/confluence/display/MAVEN/MojoFailureException
[ERROR] 
[ERROR] After correcting the problems, you can resume the build with the command
[ERROR]   mvn <goals> -rf :cayenne-test-utilities
[JENKINS] Archiving <https://builds.apache.org/job/Cayenne%20pull%20requests/ws/docs/docbook/cayenne-guide/pom.xml>
to org.apache.cayenne.docs/cayenne-guide/4.0.M4-SNAPSHOT/cayenne-guide-4.0.M4-SNAPSHOT.pom
[JENKINS] Archiving <https://builds.apache.org/job/Cayenne%20pull%20requests/ws/cayenne-client/pom.xml>
to org.apache.cayenne/cayenne-client/4.0.M4-SNAPSHOT/cayenne-client-4.0.M4-SNAPSHOT.pom
[JENKINS] Archiving <https://builds.apache.org/job/Cayenne%20pull%20requests/ws/modeler/cayenne-wocompat/pom.xml>
to org.apache.cayenne.modeler/cayenne-wocompat/4.0.M4-SNAPSHOT/cayenne-wocompat-4.0.M4-SNAPSHOT.pom
[JENKINS] Archiving <https://builds.apache.org/job/Cayenne%20pull%20requests/ws/cayenne-lifecycle/pom.xml>
to org.apache.cayenne/cayenne-lifecycle/4.0.M4-SNAPSHOT/cayenne-lifecycle-4.0.M4-SNAPSHOT.pom
[JENKINS] Archiving <https://builds.apache.org/job/Cayenne%20pull%20requests/ws/tutorials/pom.xml>
to org.apache.cayenne.tutorials/cayenne-tutorials-parent/4.0.M4-SNAPSHOT/cayenne-tutorials-parent-4.0.M4-SNAPSHOT.pom
[JENKINS] Archiving <https://builds.apache.org/job/Cayenne%20pull%20requests/ws/pom.xml>
to org.apache.cayenne/cayenne-parent/4.0.M4-SNAPSHOT/cayenne-parent-4.0.M4-SNAPSHOT.pom
[JENKINS] Archiving <https://builds.apache.org/job/Cayenne%20pull%20requests/ws/cayenne-project/pom.xml>
to org.apache.cayenne/cayenne-project/4.0.M4-SNAPSHOT/cayenne-project-4.0.M4-SNAPSHOT.pom
[JENKINS] Archiving <https://builds.apache.org/job/Cayenne%20pull%20requests/ws/docs/doc/pom.xml>
to org.apache.cayenne.docs/cayenne-doc/4.0.M4-SNAPSHOT/cayenne-doc-4.0.M4-SNAPSHOT.pom
[JENKINS] Archiving <https://builds.apache.org/job/Cayenne%20pull%20requests/ws/docs/docbook/getting-started/pom.xml>
to org.apache.cayenne.docs/getting-started/4.0.M4-SNAPSHOT/getting-started-4.0.M4-SNAPSHOT.pom
[JENKINS] Archiving <https://builds.apache.org/job/Cayenne%20pull%20requests/ws/docs/docbook/docbook-stylesheets/pom.xml>
to org.apache.cayenne.docs/docbook-stylesheets/4.0.M4-SNAPSHOT/docbook-stylesheets-4.0.M4-SNAPSHOT.pom
[JENKINS] Archiving <https://builds.apache.org/job/Cayenne%20pull%20requests/ws/modeler/cayenne-modeler/pom.xml>
to org.apache.cayenne.modeler/cayenne-modeler/4.0.M4-SNAPSHOT/cayenne-modeler-4.0.M4-SNAPSHOT.pom
[JENKINS] Archiving <https://builds.apache.org/job/Cayenne%20pull%20requests/ws/modeler/cayenne-modeler-win/pom.xml>
to org.apache.cayenne.modeler/cayenne-modeler-win/4.0.M4-SNAPSHOT/cayenne-modeler-win-4.0.M4-SNAPSHOT.pom
[JENKINS] Archiving <https://builds.apache.org/job/Cayenne%20pull%20requests/ws/plugins/maven-cayenne-plugin/pom.xml>
to org.apache.cayenne.plugins/maven-cayenne-plugin/4.0.M4-SNAPSHOT/maven-cayenne-plugin-4.0.M4-SNAPSHOT.pom
[JENKINS] Archiving <https://builds.apache.org/job/Cayenne%20pull%20requests/ws/cayenne-tools/pom.xml>
to org.apache.cayenne/cayenne-tools/4.0.M4-SNAPSHOT/cayenne-tools-4.0.M4-SNAPSHOT.pom
[JENKINS] Archiving <https://builds.apache.org/job/Cayenne%20pull%20requests/ws/itests/cayenne-tools-itest/pom.xml>
to org.apache.cayenne.itests/cayenne-tools-itest/4.0.M4-SNAPSHOT/cayenne-tools-itest-4.0.M4-SNAPSHOT.pom
[JENKINS] Archiving <https://builds.apache.org/job/Cayenne%20pull%20requests/ws/cayenne-server/pom.xml>
to org.apache.cayenne/cayenne-server/4.0.M4-SNAPSHOT/cayenne-server-4.0.M4-SNAPSHOT.pom
[JENKINS] Archiving <https://builds.apache.org/job/Cayenne%20pull%20requests/ws/modeler/cayenne-modeler-generic/pom.xml>
to org.apache.cayenne.modeler/cayenne-modeler-generic/4.0.M4-SNAPSHOT/cayenne-modeler-generic-4.0.M4-SNAPSHOT.pom
[JENKINS] Archiving <https://builds.apache.org/job/Cayenne%20pull%20requests/ws/build-tools/pom.xml>
to org.apache.cayenne.build-tools/build-tools-parent/4.0.M4-SNAPSHOT/build-tools-parent-4.0.M4-SNAPSHOT.pom
[JENKINS] Archiving <https://builds.apache.org/job/Cayenne%20pull%20requests/ws/cayenne-dbsync/pom.xml>
to org.apache.cayenne/cayenne-dbsync/4.0.M4-SNAPSHOT/cayenne-dbsync-4.0.M4-SNAPSHOT.pom
[JENKINS] Archiving <https://builds.apache.org/job/Cayenne%20pull%20requests/ws/docs/docbook/upgrade-guide/pom.xml>
to org.apache.cayenne.docs/upgrade-guide/4.0.M4-SNAPSHOT/upgrade-guide-4.0.M4-SNAPSHOT.pom
[JENKINS] Archiving <https://builds.apache.org/job/Cayenne%20pull%20requests/ws/plugins/maven-cayenne-modeler-plugin/pom.xml>
to org.apache.cayenne.plugins/maven-cayenne-modeler-plugin/4.0.M4-SNAPSHOT/maven-cayenne-modeler-plugin-4.0.M4-SNAPSHOT.pom
[JENKINS] Archiving <https://builds.apache.org/job/Cayenne%20pull%20requests/ws/cayenne-joda/pom.xml>
to org.apache.cayenne/cayenne-joda/4.0.M4-SNAPSHOT/cayenne-joda-4.0.M4-SNAPSHOT.pom
[JENKINS] Archiving <https://builds.apache.org/job/Cayenne%20pull%20requests/ws/modeler/pom.xml>
to org.apache.cayenne.modeler/cayenne-modeler-parent/4.0.M4-SNAPSHOT/cayenne-modeler-parent-4.0.M4-SNAPSHOT.pom
[JENKINS] Archiving <https://builds.apache.org/job/Cayenne%20pull%20requests/ws/tutorials/tutorial-rop-server/pom.xml>
to org.apache.cayenne.tutorials/tutorial-rop-server/4.0.M4-SNAPSHOT/tutorial-rop-server-4.0.M4-SNAPSHOT.pom
[JENKINS] Archiving <https://builds.apache.org/job/Cayenne%20pull%20requests/ws/build-tools/cayenne-checkers/pom.xml>
to org.apache.cayenne.build-tools/cayenne-checkers/4.0.M4-SNAPSHOT/cayenne-checkers-4.0.M4-SNAPSHOT.pom
[JENKINS] Archiving <https://builds.apache.org/job/Cayenne%20pull%20requests/ws/docs/docbook/getting-started-rop/pom.xml>
to org.apache.cayenne.docs/getting-started-rop/4.0.M4-SNAPSHOT/getting-started-rop-4.0.M4-SNAPSHOT.pom
[JENKINS] Archiving <https://builds.apache.org/job/Cayenne%20pull%20requests/ws/modeler/cayenne-modeler-mac/pom.xml>
to org.apache.cayenne.modeler/cayenne-modeler-mac/4.0.M4-SNAPSHOT/cayenne-modeler-mac-4.0.M4-SNAPSHOT.pom
[JENKINS] Archiving <https://builds.apache.org/job/Cayenne%20pull%20requests/ws/modeler/cayenne-modeler-generic-ext/pom.xml>
to org.apache.cayenne.modeler/cayenne-modeler-generic-ext/4.0.M4-SNAPSHOT/cayenne-modeler-generic-ext-4.0.M4-SNAPSHOT.pom
[JENKINS] Archiving <https://builds.apache.org/job/Cayenne%20pull%20requests/ws/tutorials/tutorial/pom.xml>
to org.apache.cayenne.tutorials/tutorial/4.0.M4-SNAPSHOT/tutorial-4.0.M4-SNAPSHOT.pom
[JENKINS] Archiving <https://builds.apache.org/job/Cayenne%20pull%20requests/ws/modeler/cayenne-modeler-win-ext/pom.xml>
to org.apache.cayenne.modeler/cayenne-modeler-win-ext/4.0.M4-SNAPSHOT/cayenne-modeler-win-ext-4.0.M4-SNAPSHOT.pom
[JENKINS] Archiving <https://builds.apache.org/job/Cayenne%20pull%20requests/ws/docs/docbook/pom.xml>
to org.apache.cayenne.docs/cayenne-docbook/4.0.M4-SNAPSHOT/cayenne-docbook-4.0.M4-SNAPSHOT.pom
[JENKINS] Archiving <https://builds.apache.org/job/Cayenne%20pull%20requests/ws/plugins/pom.xml>
to org.apache.cayenne.plugins/cayenne-plugins-parent/4.0.M4-SNAPSHOT/cayenne-plugins-parent-4.0.M4-SNAPSHOT.pom
[JENKINS] Archiving <https://builds.apache.org/job/Cayenne%20pull%20requests/ws/modeler/cayenne-modeler-mac-ext/pom.xml>
to org.apache.cayenne.modeler/cayenne-modeler-mac-ext/4.0.M4-SNAPSHOT/cayenne-modeler-mac-ext-4.0.M4-SNAPSHOT.pom
[JENKINS] Archiving <https://builds.apache.org/job/Cayenne%20pull%20requests/ws/docs/pom.xml>
to org.apache.cayenne.docs/cayenne-docs-parent/4.0.M4-SNAPSHOT/cayenne-docs-parent-4.0.M4-SNAPSHOT.pom
[JENKINS] Archiving <https://builds.apache.org/job/Cayenne%20pull%20requests/ws/cayenne-dbcp2/pom.xml>
to org.apache.cayenne/cayenne-dbcp2/4.0.M4-SNAPSHOT/cayenne-dbcp2-4.0.M4-SNAPSHOT.pom
[JENKINS] Archiving <https://builds.apache.org/job/Cayenne%20pull%20requests/ws/cayenne-crypto/pom.xml>
to org.apache.cayenne/cayenne-crypto/4.0.M4-SNAPSHOT/cayenne-crypto-4.0.M4-SNAPSHOT.pom
[JENKINS] Archiving <https://builds.apache.org/job/Cayenne%20pull%20requests/ws/cayenne-di/pom.xml>
to org.apache.cayenne/cayenne-di/4.0.M4-SNAPSHOT/cayenne-di-4.0.M4-SNAPSHOT.pom
[JENKINS] Archiving <https://builds.apache.org/job/Cayenne%20pull%20requests/ws/build-tools/cayenne-legal/pom.xml>
to org.apache.cayenne.build-tools/cayenne-legal/4.0.M4-SNAPSHOT/cayenne-legal-4.0.M4-SNAPSHOT.pom
[JENKINS] Archiving <https://builds.apache.org/job/Cayenne%20pull%20requests/ws/build-tools/cayenne-legal/target/cayenne-legal-4.0.M4-SNAPSHOT.jar>
to org.apache.cayenne.build-tools/cayenne-legal/4.0.M4-SNAPSHOT/cayenne-legal-4.0.M4-SNAPSHOT.jar
[JENKINS] Archiving <https://builds.apache.org/job/Cayenne%20pull%20requests/ws/build-tools/cayenne-legal/target/cayenne-legal-4.0.M4-SNAPSHOT-sources.jar>
to org.apache.cayenne.build-tools/cayenne-legal/4.0.M4-SNAPSHOT/cayenne-legal-4.0.M4-SNAPSHOT-sources.jar
[JENKINS] Archiving <https://builds.apache.org/job/Cayenne%20pull%20requests/ws/build-tools/cayenne-test-utilities/pom.xml>
to org.apache.cayenne.build-tools/cayenne-test-utilities/4.0.M4-SNAPSHOT/cayenne-test-utilities-4.0.M4-SNAPSHOT.pom
[JENKINS] Archiving <https://builds.apache.org/job/Cayenne%20pull%20requests/ws/tutorials/tutorial-rop-client/pom.xml>
to org.apache.cayenne.tutorials/tutorial-rop-client/4.0.M4-SNAPSHOT/tutorial-rop-client-4.0.M4-SNAPSHOT.pom
[JENKINS] Archiving <https://builds.apache.org/job/Cayenne%20pull%20requests/ws/itests/pom.xml>
to org.apache.cayenne.itests/cayenne-itests-parent/4.0.M4-SNAPSHOT/cayenne-itests-parent-4.0.M4-SNAPSHOT.pom
channel stopped
Putting comment on the pull request
No JDK named ?jdk-1.8.0? found

Mime
View raw message