cayenne-commits mailing list archives

Site index · List index
Message view « Date » · « Thread »
Top « Date » · « Thread »
From Apache Jenkins Server <jenk...@builds.apache.org>
Subject Build failed in Jenkins: cayenne-master » h2,JDK 1.7 (latest),ubuntu #453
Date Tue, 06 Dec 2016 14:39:54 GMT
See <https://builds.apache.org/job/cayenne-master/cayenneTestConnection=h2,jdk=JDK%201.7%20(latest),slave=ubuntu/453/changes>

Changes:

[s.kolbachev] cleanup DbEntityTab

[s.kolbachev] [maven-release-plugin] prepare release 4.0.M4

[s.kolbachev] [maven-release-plugin] prepare for next development iteration

------------------------------------------
[...truncated 1419 lines...]
Running org.apache.cayenne.access.DataContextDelegateSharedCacheIT
Tests run: 4, Failures: 0, Errors: 0, Skipped: 0, Time elapsed: 0.952 sec - in org.apache.cayenne.access.DataContextDelegateSharedCacheIT
Running org.apache.cayenne.access.DataContextPaginatedQueryIT
Tests run: 1, Failures: 0, Errors: 0, Skipped: 0, Time elapsed: 0.013 sec - in org.apache.cayenne.access.DataContextPaginatedQueryIT
Running org.apache.cayenne.access.DataContextDisjointByIdPrefetchIT
Tests run: 4, Failures: 0, Errors: 0, Skipped: 0, Time elapsed: 0.048 sec - in org.apache.cayenne.access.DataContextDisjointByIdPrefetchIT
Running org.apache.cayenne.access.DataContextEJBQLNumericalFunctionalIT
Tests run: 4, Failures: 0, Errors: 0, Skipped: 0, Time elapsed: 0.047 sec - in org.apache.cayenne.access.DataContextEJBQLNumericalFunctionalIT
Running org.apache.cayenne.access.DataContextEJBQLArrayResultIT
Tests run: 3, Failures: 0, Errors: 0, Skipped: 0, Time elapsed: 0.036 sec - in org.apache.cayenne.access.DataContextEJBQLArrayResultIT
Running org.apache.cayenne.access.DataContextEJBQLConditionsPeopleIT
Tests run: 3, Failures: 0, Errors: 0, Skipped: 0, Time elapsed: 0.047 sec - in org.apache.cayenne.access.DataContextEJBQLConditionsPeopleIT
Running org.apache.cayenne.access.translator.select.OrderingTranslatorIT
Tests run: 6, Failures: 0, Errors: 0, Skipped: 0, Time elapsed: 0.06 sec - in org.apache.cayenne.access.translator.select.OrderingTranslatorIT
Running org.apache.cayenne.access.translator.select.DefaultSelectTranslatorIT
Tests run: 21, Failures: 0, Errors: 0, Skipped: 0, Time elapsed: 0.218 sec - in org.apache.cayenne.access.translator.select.DefaultSelectTranslatorIT
Running org.apache.cayenne.access.translator.select.QualifierTranslatorIT
Tests run: 11, Failures: 0, Errors: 0, Skipped: 0, Time elapsed: 0.09 sec - in org.apache.cayenne.access.translator.select.QualifierTranslatorIT
Running org.apache.cayenne.access.translator.select.QueryAssemblerIT
Tests run: 2, Failures: 0, Errors: 0, Skipped: 0, Time elapsed: 0.016 sec - in org.apache.cayenne.access.translator.select.QueryAssemblerIT
Running org.apache.cayenne.access.translator.ejbql.EJBQLSelectTranslatorIT
Tests run: 23, Failures: 0, Errors: 0, Skipped: 0, Time elapsed: 0.213 sec - in org.apache.cayenne.access.translator.ejbql.EJBQLSelectTranslatorIT
Running org.apache.cayenne.access.translator.batch.InsertBatchTranslatorIT
Tests run: 3, Failures: 0, Errors: 0, Skipped: 0, Time elapsed: 0.024 sec - in org.apache.cayenne.access.translator.batch.InsertBatchTranslatorIT
Running org.apache.cayenne.access.translator.batch.DefaultBatchTranslatorIT
Tests run: 3, Failures: 0, Errors: 0, Skipped: 0, Time elapsed: 0.036 sec - in org.apache.cayenne.access.translator.batch.DefaultBatchTranslatorIT
Running org.apache.cayenne.access.translator.batch.DeleteBatchTranslatorIT
Tests run: 5, Failures: 0, Errors: 0, Skipped: 0, Time elapsed: 0.042 sec - in org.apache.cayenne.access.translator.batch.DeleteBatchTranslatorIT
Running org.apache.cayenne.access.translator.batch.SoftDeleteBatchTranslatorIT
Tests run: 4, Failures: 0, Errors: 0, Skipped: 0, Time elapsed: 0.436 sec - in org.apache.cayenne.access.translator.batch.SoftDeleteBatchTranslatorIT
Running org.apache.cayenne.access.translator.batch.UpdateBatchTranslatorIT
Tests run: 5, Failures: 0, Errors: 0, Skipped: 0, Time elapsed: 0.05 sec - in org.apache.cayenne.access.translator.batch.UpdateBatchTranslatorIT
Running org.apache.cayenne.access.ObjectStoreGCIT
Tests run: 3, Failures: 0, Errors: 0, Skipped: 0, Time elapsed: 3.11 sec - in org.apache.cayenne.access.ObjectStoreGCIT
Running org.apache.cayenne.access.UserTransactionIT
Tests run: 1, Failures: 0, Errors: 0, Skipped: 0, Time elapsed: 0.019 sec - in org.apache.cayenne.access.UserTransactionIT
Running org.apache.cayenne.access.DataContextEJBQLUpdateIT
Tests run: 6, Failures: 0, Errors: 0, Skipped: 0, Time elapsed: 0.081 sec - in org.apache.cayenne.access.DataContextEJBQLUpdateIT
Running org.apache.cayenne.access.IncrementalFaultListIT
Tests run: 1, Failures: 0, Errors: 0, Skipped: 0, Time elapsed: 0.088 sec - in org.apache.cayenne.access.IncrementalFaultListIT
Running org.apache.cayenne.access.PrimitiveAttributesIT
Tests run: 1, Failures: 0, Errors: 0, Skipped: 0, Time elapsed: 0.011 sec - in org.apache.cayenne.access.PrimitiveAttributesIT
Running org.apache.cayenne.access.DataContextObjectIdQuery_PolymorphicIT
Tests run: 3, Failures: 0, Errors: 0, Skipped: 0, Time elapsed: 0.04 sec - in org.apache.cayenne.access.DataContextObjectIdQuery_PolymorphicIT
Running org.apache.cayenne.access.NestedDataContextRollbackIT
Tests run: 2, Failures: 0, Errors: 0, Skipped: 0, Time elapsed: 0.02 sec - in org.apache.cayenne.access.NestedDataContextRollbackIT
Running org.apache.cayenne.access.DataContextBinaryPKIT
Tests run: 2, Failures: 0, Errors: 0, Skipped: 0, Time elapsed: 0.019 sec - in org.apache.cayenne.access.DataContextBinaryPKIT
Running org.apache.cayenne.access.SimpleIdIncrementalFaultListIT
Tests run: 14, Failures: 0, Errors: 0, Skipped: 0, Time elapsed: 0.172 sec - in org.apache.cayenne.access.SimpleIdIncrementalFaultListIT
Running org.apache.cayenne.access.QuotedIdentifiersIT
Tests run: 4, Failures: 0, Errors: 0, Skipped: 0, Time elapsed: 0.055 sec - in org.apache.cayenne.access.QuotedIdentifiersIT
Running org.apache.cayenne.access.DataContextEJBQLFlattenedRelationshipsIT
Tests run: 10, Failures: 0, Errors: 0, Skipped: 0, Time elapsed: 0.119 sec - in org.apache.cayenne.access.DataContextEJBQLFlattenedRelationshipsIT
Running org.apache.cayenne.access.NestedDataContextWriteIT
artistArray
childGroupsArray
toParentGroup
Tests run: 11, Failures: 0, Errors: 0, Skipped: 0, Time elapsed: 0.119 sec - in org.apache.cayenne.access.NestedDataContextWriteIT
Running org.apache.cayenne.access.EntityInheritanceIT
Tests run: 2, Failures: 0, Errors: 0, Skipped: 0, Time elapsed: 0.014 sec - in org.apache.cayenne.access.EntityInheritanceIT
Running org.apache.cayenne.access.SimpleIdIncrementalFaultListPrefetchIT
Tests run: 4, Failures: 0, Errors: 0, Skipped: 0, Time elapsed: 0.056 sec - in org.apache.cayenne.access.SimpleIdIncrementalFaultListPrefetchIT
Running org.apache.cayenne.access.SimpleIdIncrementalFaultListDataRowsIT
Tests run: 6, Failures: 0, Errors: 0, Skipped: 0, Time elapsed: 0.071 sec - in org.apache.cayenne.access.SimpleIdIncrementalFaultListDataRowsIT
Running org.apache.cayenne.access.DataContextCharPKIT
Tests run: 3, Failures: 0, Errors: 0, Skipped: 0, Time elapsed: 0.026 sec - in org.apache.cayenne.access.DataContextCharPKIT
Running org.apache.cayenne.access.DeleteObjectIT
Tests run: 7, Failures: 0, Errors: 0, Skipped: 0, Time elapsed: 0.088 sec - in org.apache.cayenne.access.DeleteObjectIT
Running org.apache.cayenne.access.DataContextRefreshingIT
Tests run: 14, Failures: 0, Errors: 0, Skipped: 0, Time elapsed: 0.145 sec - in org.apache.cayenne.access.DataContextRefreshingIT
Running org.apache.cayenne.access.DataContextOrderingIT
Tests run: 2, Failures: 0, Errors: 0, Skipped: 0, Time elapsed: 0.022 sec - in org.apache.cayenne.access.DataContextOrderingIT
Running org.apache.cayenne.access.DataContextSelectQuerySplitAliasesIT
Tests run: 2, Failures: 0, Errors: 0, Skipped: 0, Time elapsed: 0.018 sec - in org.apache.cayenne.access.DataContextSelectQuerySplitAliasesIT
Running org.apache.cayenne.access.DataContextQueryChainIT
Tests run: 1, Failures: 0, Errors: 0, Skipped: 0, Time elapsed: 0.01 sec - in org.apache.cayenne.access.DataContextQueryChainIT
Running org.apache.cayenne.access.TransactionThreadIT
Tests run: 1, Failures: 0, Errors: 0, Skipped: 0, Time elapsed: 0.009 sec - in org.apache.cayenne.access.TransactionThreadIT
Running org.apache.cayenne.access.DataContextEJBQLDeletePKIT
Tests run: 1, Failures: 0, Errors: 0, Skipped: 0, Time elapsed: 0.011 sec - in org.apache.cayenne.access.DataContextEJBQLDeletePKIT
Running org.apache.cayenne.access.DataContextFlattenedAttributesIT
Tests run: 12, Failures: 0, Errors: 0, Skipped: 0, Time elapsed: 0.144 sec - in org.apache.cayenne.access.DataContextFlattenedAttributesIT
Running org.apache.cayenne.access.DataContextSQLTemplateIT
Tests run: 22, Failures: 0, Errors: 0, Skipped: 0, Time elapsed: 0.201 sec - in org.apache.cayenne.access.DataContextSQLTemplateIT
Running org.apache.cayenne.access.FlattenedArcKeyIT
Tests run: 3, Failures: 0, Errors: 0, Skipped: 0, Time elapsed: 0.021 sec - in org.apache.cayenne.access.FlattenedArcKeyIT
Running org.apache.cayenne.access.OptimisticLockingIT
Tests run: 17, Failures: 0, Errors: 0, Skipped: 0, Time elapsed: 0.154 sec - in org.apache.cayenne.access.OptimisticLockingIT
Running org.apache.cayenne.access.ToManyListIT
Tests run: 6, Failures: 0, Errors: 0, Skipped: 0, Time elapsed: 0.065 sec - in org.apache.cayenne.access.ToManyListIT
Running org.apache.cayenne.access.DeleteRulesIT
Tests run: 11, Failures: 0, Errors: 0, Skipped: 0, Time elapsed: 0.097 sec - in org.apache.cayenne.access.DeleteRulesIT
Running org.apache.cayenne.access.UUIDIT
Tests run: 3, Failures: 0, Errors: 0, Skipped: 0, Time elapsed: 0.029 sec - in org.apache.cayenne.access.UUIDIT
Running org.apache.cayenne.access.DataContextRelationshipQuery_PolymorphicIT
Tests run: 1, Failures: 0, Errors: 0, Skipped: 0, Time elapsed: 0.01 sec - in org.apache.cayenne.access.DataContextRelationshipQuery_PolymorphicIT
Running org.apache.cayenne.access.DataContextIteratedQueryIT
Tests run: 8, Failures: 0, Errors: 0, Skipped: 0, Time elapsed: 0.104 sec - in org.apache.cayenne.access.DataContextIteratedQueryIT
Running org.apache.cayenne.access.DataContextCharTypeIT
Tests run: 1, Failures: 0, Errors: 0, Skipped: 0, Time elapsed: 0.01 sec - in org.apache.cayenne.access.DataContextCharTypeIT
Running org.apache.cayenne.access.ObjectStoreIT
Tests run: 3, Failures: 0, Errors: 0, Skipped: 0, Time elapsed: 0.026 sec - in org.apache.cayenne.access.ObjectStoreIT
Running org.apache.cayenne.access.DataContextValidationIT
Tests run: 3, Failures: 0, Errors: 0, Skipped: 0, Time elapsed: 0.028 sec - in org.apache.cayenne.access.DataContextValidationIT
Running org.apache.cayenne.access.DataContextEJBQLIsNullIT
Tests run: 7, Failures: 0, Errors: 0, Skipped: 0, Time elapsed: 0.072 sec - in org.apache.cayenne.access.DataContextEJBQLIsNullIT
Running org.apache.cayenne.access.DataContextEJBQLInheritanceIT
Tests run: 1, Failures: 0, Errors: 0, Skipped: 0, Time elapsed: 0.011 sec - in org.apache.cayenne.access.DataContextEJBQLInheritanceIT
Running org.apache.cayenne.access.DataDomainQueryActionIT
Tests run: 1, Failures: 0, Errors: 0, Skipped: 0, Time elapsed: 0.009 sec - in org.apache.cayenne.access.DataDomainQueryActionIT
Running org.apache.cayenne.access.DataContextDataChannelEventsIT
Tests run: 5, Failures: 0, Errors: 0, Skipped: 0, Time elapsed: 1.562 sec - in org.apache.cayenne.access.DataContextDataChannelEventsIT
Running org.apache.cayenne.access.PrefetchProcessorTreeBuilderIT
Tests run: 2, Failures: 0, Errors: 0, Skipped: 0, Time elapsed: 0.019 sec - in org.apache.cayenne.access.PrefetchProcessorTreeBuilderIT
Running org.apache.cayenne.CayenneDataObjectSetToManyListIT
class:class java.util.ArrayList
Tests run: 9, Failures: 0, Errors: 0, Skipped: 0, Time elapsed: 0.086 sec - in org.apache.cayenne.CayenneDataObjectSetToManyListIT
Running org.apache.cayenne.map.EntityResolverIT
Tests run: 9, Failures: 0, Errors: 0, Skipped: 0, Time elapsed: 0.069 sec - in org.apache.cayenne.map.EntityResolverIT
Running org.apache.cayenne.map.ObjEntityIT
Tests run: 25, Failures: 0, Errors: 0, Skipped: 0, Time elapsed: 0.199 sec - in org.apache.cayenne.map.ObjEntityIT
Running org.apache.cayenne.map.EntityIT
Tests run: 10, Failures: 0, Errors: 0, Skipped: 0, Time elapsed: 0.088 sec - in org.apache.cayenne.map.EntityIT
Running org.apache.cayenne.map.EntityResolverInheritanceIT
Tests run: 4, Failures: 0, Errors: 0, Skipped: 0, Time elapsed: 0.03 sec - in org.apache.cayenne.map.EntityResolverInheritanceIT
Running org.apache.cayenne.map.ClientEntityResolverIT
Tests run: 3, Failures: 0, Errors: 0, Skipped: 0, Time elapsed: 0.023 sec - in org.apache.cayenne.map.ClientEntityResolverIT
Running org.apache.cayenne.map.EntityResolverGenericStackIT
Tests run: 1, Failures: 0, Errors: 0, Skipped: 0, Time elapsed: 0.005 sec - in org.apache.cayenne.map.EntityResolverGenericStackIT
Running org.apache.cayenne.map.DbEntityIT
Tests run: 16, Failures: 0, Errors: 0, Skipped: 0, Time elapsed: 0.118 sec - in org.apache.cayenne.map.DbEntityIT
Running org.apache.cayenne.map.EntityResolverClassDescriptorIT
Tests run: 3, Failures: 0, Errors: 0, Skipped: 0, Time elapsed: 0.027 sec - in org.apache.cayenne.map.EntityResolverClassDescriptorIT
Running org.apache.cayenne.map.DbRelationshipIT
Tests run: 4, Failures: 0, Errors: 0, Skipped: 0, Time elapsed: 0.028 sec - in org.apache.cayenne.map.DbRelationshipIT
Running org.apache.cayenne.map.ObjRelationshipIT
Tests run: 20, Failures: 0, Errors: 0, Skipped: 0, Time elapsed: 0.188 sec - in org.apache.cayenne.map.ObjRelationshipIT
Running org.apache.cayenne.CayenneIT
Tests run: 15, Failures: 0, Errors: 0, Skipped: 0, Time elapsed: 0.124 sec - in org.apache.cayenne.CayenneIT

Results :

Tests in error: 
  DataRowStoreIT.testConstructorWithProperties:90 » CayenneRuntime [v.4.0.M5-SNA...

Tests run: 1488, Failures: 0, Errors: 1, Skipped: 0

[INFO] 
[INFO] --- maven-failsafe-plugin:2.17:verify (integration-test) @ cayenne-server ---
[INFO] Failsafe report directory: <https://builds.apache.org/job/cayenne-master/cayenneTestConnection=h2,jdk=JDK%201.7%20(latest),slave=ubuntu/ws/cayenne-server/target/failsafe-reports>
[INFO] ------------------------------------------------------------------------
[INFO] Reactor Summary:
[INFO] 
[INFO] Cayenne ............................................ SUCCESS [  0.695 s]
[INFO] Cayenne Build Tools Parent ......................... SUCCESS [  0.019 s]
[INFO] Cayenne License and Notice Bundle .................. SUCCESS [  1.016 s]
[INFO] Common Unit Test Utilities ......................... SUCCESS [  1.153 s]
[INFO] Cayenne Code Checkers .............................. SUCCESS [  0.074 s]
[INFO] Cayenne Dependency Injection Container ............. SUCCESS [  8.544 s]
[INFO] Cayenne Server ..................................... FAILURE [01:23 min]
[INFO] Cayenne ROP Client ................................. SKIPPED
[INFO] Cayenne Database Synchronization Tools ............. SKIPPED
[INFO] Cayenne Project .................................... SKIPPED
[INFO] Cayenne Tools ...................................... SKIPPED
[INFO] Cayenne Lifecycle Utilities ........................ SKIPPED
[INFO] Cayenne Maven Plugins .............................. SKIPPED
[INFO] Cayenne Maven Plugin ............................... SKIPPED
[INFO] Cayenne Cryptography Extensions .................... SKIPPED
[INFO] Cayenne Joda Extensions ............................ SKIPPED
[INFO] Cayenne DBCP2 Extension ............................ SKIPPED
[INFO] Cayenne Integration Tests Parent ................... SKIPPED
[INFO] Integration Tests - Cayenne Tools .................. SKIPPED
[INFO] Cayenne Modeler Parent ............................. SKIPPED
[INFO] Cayenne WebObjects Compatibility Library ........... SKIPPED
[INFO] Cayenne Modeler .................................... SKIPPED
[INFO] Cayenne Modeler Generic and Windows Extensions ..... SKIPPED
[INFO] Cayenne Modeler Generic ............................ SKIPPED
[INFO] Cayenne Modeler Mac OS X Extensions ................ SKIPPED
[INFO] Cayenne Modeler Mac OS X ........................... SKIPPED
[INFO] Cayenne Modeler Win Extensions ..................... SKIPPED
[INFO] Cayenne Modeler Windows ............................ SKIPPED
[INFO] Cayenne Modeler Maven Plugin ....................... SKIPPED
[INFO] Cayenne Tutorials .................................. SKIPPED
[INFO] Cayenne Tutorial ................................... SKIPPED
[INFO] Cayenne ROP Server Tutorial ........................ SKIPPED
[INFO] Cayenne ROP Client Tutorial ........................ SKIPPED
[INFO] Cayenne Documenation Parent ........................ SKIPPED
[INFO] Cayenne Documentation .............................. SKIPPED
[INFO] Cayenne Docbook Documentation ...................... SKIPPED
[INFO] Docbook: Cayenne Stylesheets ....................... SKIPPED
[INFO] Docbook: Cayenne Guide ............................. SKIPPED
[INFO] Docbook: Getting Started with Cayenne .............. SKIPPED
[INFO] Docbook: Getting Started with Cayenne ROP .......... SKIPPED
[INFO] Docbook: Getting Started with Cayenne RE ........... SKIPPED
[INFO] Docbook: Cayenne New Features and Upgrade Guide .... SKIPPED
[INFO] ------------------------------------------------------------------------
[INFO] BUILD FAILURE
[INFO] ------------------------------------------------------------------------
[INFO] Total time: 01:36 min
[INFO] Finished at: 2016-12-06T14:37:50+00:00
[INFO] Final Memory: 87M/368M
[INFO] ------------------------------------------------------------------------
[ERROR] Failed to execute goal org.apache.maven.plugins:maven-failsafe-plugin:2.17:verify
(integration-test) on project cayenne-server: There are test failures.
[ERROR] 
[ERROR] Please refer to <https://builds.apache.org/job/cayenne-master/cayenneTestConnection=h2,jdk=JDK%201.7%20(latest),slave=ubuntu/ws/cayenne-server/target/failsafe-reports>
for the individual test results.
[ERROR] -> [Help 1]
org.apache.maven.lifecycle.LifecycleExecutionException: Failed to execute goal org.apache.maven.plugins:maven-failsafe-plugin:2.17:verify
(integration-test) on project cayenne-server: There are test failures.

Please refer to <https://builds.apache.org/job/cayenne-master/cayenneTestConnection=h2,jdk=JDK%201.7%20(latest),slave=ubuntu/ws/cayenne-server/target/failsafe-reports>
for the individual test results.
	at org.apache.maven.lifecycle.internal.MojoExecutor.execute(MojoExecutor.java:212)
	at org.apache.maven.lifecycle.internal.MojoExecutor.execute(MojoExecutor.java:153)
	at org.apache.maven.lifecycle.internal.MojoExecutor.execute(MojoExecutor.java:145)
	at org.apache.maven.lifecycle.internal.LifecycleModuleBuilder.buildProject(LifecycleModuleBuilder.java:116)
	at org.apache.maven.lifecycle.internal.LifecycleModuleBuilder.buildProject(LifecycleModuleBuilder.java:80)
	at org.apache.maven.lifecycle.internal.builder.singlethreaded.SingleThreadedBuilder.build(SingleThreadedBuilder.java:51)
	at org.apache.maven.lifecycle.internal.LifecycleStarter.execute(LifecycleStarter.java:128)
	at org.apache.maven.DefaultMaven.doExecute(DefaultMaven.java:307)
	at org.apache.maven.DefaultMaven.doExecute(DefaultMaven.java:193)
	at org.apache.maven.DefaultMaven.execute(DefaultMaven.java:106)
	at org.apache.maven.cli.MavenCli.execute(MavenCli.java:863)
	at org.apache.maven.cli.MavenCli.doMain(MavenCli.java:288)
	at org.apache.maven.cli.MavenCli.main(MavenCli.java:199)
	at sun.reflect.NativeMethodAccessorImpl.invoke0(Native Method)
	at sun.reflect.NativeMethodAccessorImpl.invoke(NativeMethodAccessorImpl.java:57)
	at sun.reflect.DelegatingMethodAccessorImpl.invoke(DelegatingMethodAccessorImpl.java:43)
	at java.lang.reflect.Method.invoke(Method.java:606)
	at org.codehaus.plexus.classworlds.launcher.Launcher.launchEnhanced(Launcher.java:289)
	at org.codehaus.plexus.classworlds.launcher.Launcher.launch(Launcher.java:229)
	at org.codehaus.plexus.classworlds.launcher.Launcher.mainWithExitCode(Launcher.java:415)
	at org.codehaus.plexus.classworlds.launcher.Launcher.main(Launcher.java:356)
Caused by: org.apache.maven.plugin.MojoFailureException: There are test failures.

Please refer to <https://builds.apache.org/job/cayenne-master/cayenneTestConnection=h2,jdk=JDK%201.7%20(latest),slave=ubuntu/ws/cayenne-server/target/failsafe-reports>
for the individual test results.
	at org.apache.maven.plugin.surefire.SurefireHelper.reportExecution(SurefireHelper.java:82)
	at org.apache.maven.plugin.failsafe.VerifyMojo.execute(VerifyMojo.java:194)
	at org.apache.maven.plugin.DefaultBuildPluginManager.executeMojo(DefaultBuildPluginManager.java:134)
	at org.apache.maven.lifecycle.internal.MojoExecutor.execute(MojoExecutor.java:207)
	... 20 more
[ERROR] 
[ERROR] Re-run Maven using the -X switch to enable full debug logging.
[ERROR] 
[ERROR] For more information about the errors and possible solutions, please read the following
articles:
[ERROR] [Help 1] http://cwiki.apache.org/confluence/display/MAVEN/MojoFailureException
[ERROR] 
[ERROR] After correcting the problems, you can resume the build with the command
[ERROR]   mvn <goals> -rf :cayenne-server
Build step 'Invoke top-level Maven targets' marked build as failure
Recording test results

Mime
View raw message