cayenne-commits mailing list archives

Site index · List index
Message view « Date » · « Thread »
Top « Date » · « Thread »
From Apache Jenkins Server <jenk...@builds.apache.org>
Subject Build failed in Jenkins: Cayenne pull requests #234
Date Fri, 16 Dec 2016 09:17:02 GMT
See <https://builds.apache.org/job/Cayenne%20pull%20requests/234/changes>

Changes:

[stariy95] Clean getting-started guide  - fix PDF output  - fix wrong screenshot

------------------------------------------
[...truncated 474 lines...]
[INFO] tutorial: ayenne Tutorial
[INFO] tutorial-rop-server: Cayenne ROP Server Tutorial
[INFO] tutorial-rop-client: Cayenne ROP Client Tutorial
[INFO] cayenne-java8: Cayenne Java8 Extensions
[INFO] cayenne-protostuff: Cayenne Protostuff Extension
[INFO] tutorial-rop-server-http2: Cayenne ROP HTTP/2 Server Tutorial
[INFO] cayenne-client-jetty: Cayenne ROP Client (Jetty)
[INFO] tutorial-rop-client-http2: Cayenne ROP HTTP/2 Client Tutorial
[INFO] cayenne-docs-parent: Cayenne Documenation Parent
[INFO] cayenne-doc: Cayenne Documentation
[INFO] cayenne-docbook: Cayenne Docbook Documentation
[INFO] docbook-stylesheets: Docbook - Cayenne Stylesheets
[INFO] cayenne-guide: Docbook - Cayenne Guide
[INFO] getting-started: Docbook - Getting Started with Cayenne
[INFO] getting-started-rop: Docbook - Getting Started with Cayenne ROP
[INFO] upgrade-guide: Docbook - Cayenne New Features and Upgrade Guide
[INFO] cayenne-assembly: Cayenne Release Assembly
[INFO]                                                                         
[INFO] ------------------------------------------------------------------------
[INFO] Building cayenne-parent: Top-level parent of Cayenne mdoules 4.0.M5-SNAPSHOT
[INFO] ------------------------------------------------------------------------
[INFO] 
[INFO] --- maven-clean-plugin:2.4.1:clean (default-clean) @ cayenne-parent ---
[WARNING] Failed to getClass for org.apache.maven.plugin.source.SourceJarMojo
[INFO] 
[INFO] --- maven-source-plugin:2.1.2:jar (bundle-source-jar) @ cayenne-parent ---
[INFO] 
[INFO] --- maven-failsafe-plugin:2.17:integration-test (integration-test) @ cayenne-parent
---
[INFO] No tests to run.
[JENKINS] Recording test results
[INFO] 
[INFO] --- maven-failsafe-plugin:2.17:verify (integration-test) @ cayenne-parent ---
[INFO] No tests to run.
[JENKINS] Recording test results[INFO] 
[INFO] --- maven-install-plugin:2.3.1:install (default-install) @ cayenne-parent ---

[INFO] Installing <https://builds.apache.org/job/Cayenne%20pull%20requests/ws/pom.xml>
to /home/jenkins/jenkins-slave/maven-repositories/1/org/apache/cayenne/cayenne-parent/4.0.M5-SNAPSHOT/cayenne-parent-4.0.M5-SNAPSHOT.pom
[INFO]                                                                         
[INFO] ------------------------------------------------------------------------
[INFO] Building build-tools-parent: Cayenne Build Tools Parent 4.0.M5-SNAPSHOT
[INFO] ------------------------------------------------------------------------
[INFO] 
[INFO] --- maven-clean-plugin:2.4.1:clean (default-clean) @ build-tools-parent ---
[WARNING] Failed to getClass for org.apache.maven.plugin.source.SourceJarMojo
[INFO] 
[INFO] --- maven-source-plugin:2.1.2:jar (bundle-source-jar) @ build-tools-parent ---
[INFO] 
[INFO] --- maven-failsafe-plugin:2.17:integration-test (integration-test) @ build-tools-parent
---
[INFO] No tests to run.
[JENKINS] Recording test results
[INFO] 
[INFO] --- maven-failsafe-plugin:2.17:verify (integration-test) @ build-tools-parent ---
[INFO] No tests to run.
[INFO] 
[INFO] --- maven-install-plugin:2.3.1:install (default-install) @ build-tools-parent ---
[JENKINS] Recording test results[INFO] Installing <https://builds.apache.org/job/Cayenne%20pull%20requests/ws/build-tools/pom.xml>
to /home/jenkins/jenkins-slave/maven-repositories/1/org/apache/cayenne/build-tools/build-tools-parent/4.0.M5-SNAPSHOT/build-tools-parent-4.0.M5-SNAPSHOT.pom

[INFO]                                                                         
[INFO] ------------------------------------------------------------------------
[INFO] Building cayenne-legal: Cayenne License and Notice Bundle 4.0.M5-SNAPSHOT
[INFO] ------------------------------------------------------------------------
[INFO] 
[INFO] --- maven-clean-plugin:2.4.1:clean (default-clean) @ cayenne-legal ---
[INFO] 
[INFO] --- maven-remote-resources-plugin:1.5:bundle (default) @ cayenne-legal ---
[INFO] 
[INFO] --- maven-resources-plugin:2.4.3:resources (default-resources) @ cayenne-legal ---
[INFO] Using 'UTF-8' encoding to copy filtered resources.
[INFO] Copying 2 resources
[INFO] 
[INFO] --- maven-compiler-plugin:2.3.2:compile (default-compile) @ cayenne-legal ---
[INFO] No sources to compile
[INFO] 
[INFO] --- maven-resources-plugin:2.4.3:testResources (default-testResources) @ cayenne-legal
---
[INFO] Using 'UTF-8' encoding to copy filtered resources.
[INFO] skip non existing resourceDirectory <https://builds.apache.org/job/Cayenne%20pull%20requests/ws/build-tools/cayenne-legal/src/test/resources>
[INFO] 
[INFO] --- maven-compiler-plugin:2.3.2:testCompile (default-testCompile) @ cayenne-legal ---
[INFO] No sources to compile
[INFO] 
[INFO] --- maven-surefire-plugin:2.5:test (default-test) @ cayenne-legal ---
[INFO] No tests to run.
[JENKINS] Recording test results
[INFO] 
[INFO] --- maven-jar-plugin:2.4:jar (default-jar) @ cayenne-legal ---
[INFO] Building jar: <https://builds.apache.org/job/Cayenne%20pull%20requests/ws/build-tools/cayenne-legal/target/cayenne-legal-4.0.M5-SNAPSHOT.jar>
[WARNING] Failed to getClass for org.apache.maven.plugin.source.SourceJarMojo
[INFO] 
[INFO] --- maven-source-plugin:2.1.2:jar (bundle-source-jar) @ cayenne-legal ---
[INFO] Building jar: <https://builds.apache.org/job/Cayenne%20pull%20requests/ws/build-tools/cayenne-legal/target/cayenne-legal-4.0.M5-SNAPSHOT-sources.jar>
[INFO] 
[INFO] --- maven-failsafe-plugin:2.17:integration-test (integration-test) @ cayenne-legal
---
[INFO] No tests to run.
[JENKINS] Recording test results
[INFO] 
[INFO] --- maven-failsafe-plugin:2.17:verify (integration-test) @ cayenne-legal ---
[INFO] No tests to run.
[JENKINS] Recording test results[INFO] 
[INFO] --- maven-install-plugin:2.3.1:install (default-install) @ cayenne-legal ---
[INFO] Installing <https://builds.apache.org/job/Cayenne%20pull%20requests/ws/build-tools/cayenne-legal/target/cayenne-legal-4.0.M5-SNAPSHOT.jar>
to /home/jenkins/jenkins-slave/maven-repositories/1/org/apache/cayenne/build-tools/cayenne-legal/4.0.M5-SNAPSHOT/cayenne-legal-4.0.M5-SNAPSHOT.jar

[INFO] Installing <https://builds.apache.org/job/Cayenne%20pull%20requests/ws/build-tools/cayenne-legal/pom.xml>
to /home/jenkins/jenkins-slave/maven-repositories/1/org/apache/cayenne/build-tools/cayenne-legal/4.0.M5-SNAPSHOT/cayenne-legal-4.0.M5-SNAPSHOT.pom
[INFO] Installing <https://builds.apache.org/job/Cayenne%20pull%20requests/ws/build-tools/cayenne-legal/target/cayenne-legal-4.0.M5-SNAPSHOT-sources.jar>
to /home/jenkins/jenkins-slave/maven-repositories/1/org/apache/cayenne/build-tools/cayenne-legal/4.0.M5-SNAPSHOT/cayenne-legal-4.0.M5-SNAPSHOT-sources.jar
[INFO]                                                                         
[INFO] ------------------------------------------------------------------------
[INFO] Building cayenne-test-utilities: Common Unit Test Utilities 4.0.M5-SNAPSHOT
[INFO] ------------------------------------------------------------------------
[INFO] 
[INFO] --- maven-clean-plugin:2.4.1:clean (default-clean) @ cayenne-test-utilities ---
[INFO] 
[INFO] --- maven-resources-plugin:2.4.3:resources (default-resources) @ cayenne-test-utilities
---
[INFO] Using 'UTF-8' encoding to copy filtered resources.
[INFO] skip non existing resourceDirectory <https://builds.apache.org/job/Cayenne%20pull%20requests/ws/build-tools/cayenne-test-utilities/src/main/resources>
[INFO] 
[INFO] --- maven-compiler-plugin:2.3.2:compile (default-compile) @ cayenne-test-utilities
---
[INFO] Compiling 14 source files to <https://builds.apache.org/job/Cayenne%20pull%20requests/ws/build-tools/cayenne-test-utilities/target/classes>
[INFO] -------------------------------------------------------------
[ERROR] COMPILATION ERROR : 
[INFO] -------------------------------------------------------------
[ERROR] Unable to locate the Javac Compiler in:
  /usr/lib/jvm/java-8-openjdk-amd64/jre/../lib/tools.jar
Please ensure you are using JDK 1.4 or above and
not a JRE (the com.sun.tools.javac.Main class is required).
In most cases you can change the location of your Java
installation by setting the JAVA_HOME environment variable.
[INFO] 1 error
[INFO] -------------------------------------------------------------
[INFO] ------------------------------------------------------------------------
[INFO] Reactor Summary:
[INFO] 
[INFO] cayenne-parent: Top-level parent of Cayenne mdoules  SUCCESS [18.555s]
[INFO] build-tools-parent: Cayenne Build Tools Parent .... SUCCESS [2.338s]
[INFO] cayenne-legal: Cayenne License and Notice Bundle .. SUCCESS [3.919s]
[INFO] cayenne-test-utilities: Common Unit Test Utilities  FAILURE [0.508s]
[INFO] cayenne-checkers: Cayenne Code Checkers ........... SKIPPED
[INFO] cayenne-di: Cayenne Dependency Injection Container  SKIPPED
[INFO] cayenne-server: Cayenne Server .................... SKIPPED
[INFO] cayenne-client: Cayenne ROP Client ................ SKIPPED
[INFO] cayenne-dbsync: Database Synchronization Tools .... SKIPPED
[INFO] cayenne-project: Cayenne Project .................. SKIPPED
[INFO] cayenne-tools: Cayenne Tools ...................... SKIPPED
[INFO] cayenne-lifecycle: Cayenne Lifecycle Utilities .... SKIPPED
[INFO] cayenne-plugins-parent: Cayenne Maven Plugins parent  SKIPPED
[INFO] maven-cayenne-plugin: Cayenne Maven Plugin ........ SKIPPED
[INFO] cayenne-crypto: Cayenne Cryptography Extensions ... SKIPPED
[INFO] cayenne-joda: Cayenne Joda Extensions ............. SKIPPED
[INFO] cayenne-dbcp2: Cayenne DBCP2 Extension ............ SKIPPED
[INFO] cayenne-itests-parent: Integration Tests Parent ... SKIPPED
[INFO] cayenne-tools-itest: Tools integration tests ...... SKIPPED
[INFO] cayenne-modeler-parent: Cayenne Modeler Parent .... SKIPPED
[INFO] cayenne-wocompat: WebObjects Compatibility Library  SKIPPED
[INFO] cayenne-modeler: Cayenne Modeler Core ............. SKIPPED
[INFO] cayenne-modeler-generic-ext: Modeler Generic Extensions  SKIPPED
[INFO] cayenne-modeler-generic: Modeler Generic Assembly . SKIPPED
[INFO] cayenne-modeler-mac-ext: Modeler MacOS Extensions . SKIPPED
[INFO] cayenne-modeler-mac: Modeler MacOS Assembly ....... SKIPPED
[INFO] cayenne-modeler-win-ext: Modeler Win Extensions ... SKIPPED
[INFO] cayenne-modeler-win: Modeler Windows Assembly ..... SKIPPED
[INFO] maven-cayenne-modeler-plugin: Cayenne Modeler Maven Plugin  SKIPPED
[INFO] cayenne-tutorials-parent: Cayenne Tutorials ....... SKIPPED
[INFO] tutorial: ayenne Tutorial ......................... SKIPPED
[INFO] tutorial-rop-server: Cayenne ROP Server Tutorial .. SKIPPED
[INFO] tutorial-rop-client: Cayenne ROP Client Tutorial .. SKIPPED
[INFO] cayenne-java8: Cayenne Java8 Extensions ........... SKIPPED
[INFO] cayenne-protostuff: Cayenne Protostuff Extension .. SKIPPED
[INFO] tutorial-rop-server-http2: Cayenne ROP HTTP/2 Server Tutorial  SKIPPED
[INFO] cayenne-client-jetty: Cayenne ROP Client (Jetty) .. SKIPPED
[INFO] tutorial-rop-client-http2: Cayenne ROP HTTP/2 Client Tutorial  SKIPPED
[INFO] cayenne-docs-parent: Cayenne Documenation Parent .. SKIPPED
[INFO] cayenne-doc: Cayenne Documentation ................ SKIPPED
[INFO] cayenne-docbook: Cayenne Docbook Documentation .... SKIPPED
[INFO] docbook-stylesheets: Docbook - Cayenne Stylesheets  SKIPPED
[INFO] cayenne-guide: Docbook - Cayenne Guide ............ SKIPPED
[INFO] getting-started: Docbook - Getting Started with Cayenne  SKIPPED
[INFO] getting-started-rop: Docbook - Getting Started with Cayenne ROP  SKIPPED
[INFO] upgrade-guide: Docbook - Cayenne New Features and Upgrade Guide  SKIPPED
[INFO] cayenne-assembly: Cayenne Release Assembly ........ SKIPPED
[INFO] ------------------------------------------------------------------------
[INFO] BUILD FAILURE
[INFO] ------------------------------------------------------------------------
[INFO] Total time: 33.480s
[INFO] Finished at: Fri Dec 16 09:47:11 UTC 2016
[INFO] Final Memory: 25M/386M
[INFO] ------------------------------------------------------------------------
Waiting for Jenkins to finish collecting data
[ERROR] Failed to execute goal org.apache.maven.plugins:maven-compiler-plugin:2.3.2:compile
(default-compile) on project cayenne-test-utilities: Compilation failure
[ERROR] Unable to locate the Javac Compiler in:
[ERROR] /usr/lib/jvm/java-8-openjdk-amd64/jre/../lib/tools.jar
[ERROR] Please ensure you are using JDK 1.4 or above and
[ERROR] not a JRE (the com.sun.tools.javac.Main class is required).
[ERROR] In most cases you can change the location of your Java
[ERROR] installation by setting the JAVA_HOME environment variable.
[ERROR] -> [Help 1]
[ERROR] 
[ERROR] To see the full stack trace of the errors, re-run Maven with the -e switch.
[ERROR] Re-run Maven using the -X switch to enable full debug logging.
[ERROR] 
[ERROR] For more information about the errors and possible solutions, please read the following
articles:
[ERROR] [Help 1] http://cwiki.apache.org/confluence/display/MAVEN/MojoFailureException
[ERROR] 
[ERROR] After correcting the problems, you can resume the build with the command
[ERROR]   mvn <goals> -rf :cayenne-test-utilities
[JENKINS] Archiving <https://builds.apache.org/job/Cayenne%20pull%20requests/ws/docs/docbook/cayenne-guide/pom.xml>
to org.apache.cayenne.docs/cayenne-guide/4.0.M5-SNAPSHOT/cayenne-guide-4.0.M5-SNAPSHOT.pom
[JENKINS] Archiving <https://builds.apache.org/job/Cayenne%20pull%20requests/ws/cayenne-client/pom.xml>
to org.apache.cayenne/cayenne-client/4.0.M5-SNAPSHOT/cayenne-client-4.0.M5-SNAPSHOT.pom
[JENKINS] Archiving <https://builds.apache.org/job/Cayenne%20pull%20requests/ws/modeler/cayenne-wocompat/pom.xml>
to org.apache.cayenne.modeler/cayenne-wocompat/4.0.M5-SNAPSHOT/cayenne-wocompat-4.0.M5-SNAPSHOT.pom
[JENKINS] Archiving <https://builds.apache.org/job/Cayenne%20pull%20requests/ws/cayenne-lifecycle/pom.xml>
to org.apache.cayenne/cayenne-lifecycle/4.0.M5-SNAPSHOT/cayenne-lifecycle-4.0.M5-SNAPSHOT.pom
[JENKINS] Archiving <https://builds.apache.org/job/Cayenne%20pull%20requests/ws/tutorials/pom.xml>
to org.apache.cayenne.tutorials/cayenne-tutorials-parent/4.0.M5-SNAPSHOT/cayenne-tutorials-parent-4.0.M5-SNAPSHOT.pom
[JENKINS] Archiving <https://builds.apache.org/job/Cayenne%20pull%20requests/ws/pom.xml>
to org.apache.cayenne/cayenne-parent/4.0.M5-SNAPSHOT/cayenne-parent-4.0.M5-SNAPSHOT.pom
Compressed 50.56 KB of artifacts by 63.3% relative to #233
[JENKINS] Archiving <https://builds.apache.org/job/Cayenne%20pull%20requests/ws/cayenne-project/pom.xml>
to org.apache.cayenne/cayenne-project/4.0.M5-SNAPSHOT/cayenne-project-4.0.M5-SNAPSHOT.pom
[JENKINS] Archiving <https://builds.apache.org/job/Cayenne%20pull%20requests/ws/docs/doc/pom.xml>
to org.apache.cayenne.docs/cayenne-doc/4.0.M5-SNAPSHOT/cayenne-doc-4.0.M5-SNAPSHOT.pom
[JENKINS] Archiving <https://builds.apache.org/job/Cayenne%20pull%20requests/ws/docs/docbook/getting-started/pom.xml>
to org.apache.cayenne.docs/getting-started/4.0.M5-SNAPSHOT/getting-started-4.0.M5-SNAPSHOT.pom
[JENKINS] Archiving <https://builds.apache.org/job/Cayenne%20pull%20requests/ws/docs/docbook/docbook-stylesheets/pom.xml>
to org.apache.cayenne.docs/docbook-stylesheets/4.0.M5-SNAPSHOT/docbook-stylesheets-4.0.M5-SNAPSHOT.pom
[JENKINS] Archiving <https://builds.apache.org/job/Cayenne%20pull%20requests/ws/modeler/cayenne-modeler/pom.xml>
to org.apache.cayenne.modeler/cayenne-modeler/4.0.M5-SNAPSHOT/cayenne-modeler-4.0.M5-SNAPSHOT.pom
[JENKINS] Archiving <https://builds.apache.org/job/Cayenne%20pull%20requests/ws/modeler/cayenne-modeler-win/pom.xml>
to org.apache.cayenne.modeler/cayenne-modeler-win/4.0.M5-SNAPSHOT/cayenne-modeler-win-4.0.M5-SNAPSHOT.pom
[JENKINS] Archiving <https://builds.apache.org/job/Cayenne%20pull%20requests/ws/plugins/maven-cayenne-plugin/pom.xml>
to org.apache.cayenne.plugins/maven-cayenne-plugin/4.0.M5-SNAPSHOT/maven-cayenne-plugin-4.0.M5-SNAPSHOT.pom
[JENKINS] Archiving <https://builds.apache.org/job/Cayenne%20pull%20requests/ws/cayenne-tools/pom.xml>
to org.apache.cayenne/cayenne-tools/4.0.M5-SNAPSHOT/cayenne-tools-4.0.M5-SNAPSHOT.pom
[JENKINS] Archiving <https://builds.apache.org/job/Cayenne%20pull%20requests/ws/itests/cayenne-tools-itest/pom.xml>
to org.apache.cayenne.itests/cayenne-tools-itest/4.0.M5-SNAPSHOT/cayenne-tools-itest-4.0.M5-SNAPSHOT.pom
[JENKINS] Archiving <https://builds.apache.org/job/Cayenne%20pull%20requests/ws/cayenne-server/pom.xml>
to org.apache.cayenne/cayenne-server/4.0.M5-SNAPSHOT/cayenne-server-4.0.M5-SNAPSHOT.pom
[JENKINS] Archiving <https://builds.apache.org/job/Cayenne%20pull%20requests/ws/modeler/cayenne-modeler-generic/pom.xml>
to org.apache.cayenne.modeler/cayenne-modeler-generic/4.0.M5-SNAPSHOT/cayenne-modeler-generic-4.0.M5-SNAPSHOT.pom
[JENKINS] Archiving <https://builds.apache.org/job/Cayenne%20pull%20requests/ws/build-tools/pom.xml>
to org.apache.cayenne.build-tools/build-tools-parent/4.0.M5-SNAPSHOT/build-tools-parent-4.0.M5-SNAPSHOT.pom
[JENKINS] Archiving <https://builds.apache.org/job/Cayenne%20pull%20requests/ws/cayenne-dbsync/pom.xml>
to org.apache.cayenne/cayenne-dbsync/4.0.M5-SNAPSHOT/cayenne-dbsync-4.0.M5-SNAPSHOT.pom
[JENKINS] Archiving <https://builds.apache.org/job/Cayenne%20pull%20requests/ws/docs/docbook/upgrade-guide/pom.xml>
to org.apache.cayenne.docs/upgrade-guide/4.0.M5-SNAPSHOT/upgrade-guide-4.0.M5-SNAPSHOT.pom
[JENKINS] Archiving <https://builds.apache.org/job/Cayenne%20pull%20requests/ws/plugins/maven-cayenne-modeler-plugin/pom.xml>
to org.apache.cayenne.plugins/maven-cayenne-modeler-plugin/4.0.M5-SNAPSHOT/maven-cayenne-modeler-plugin-4.0.M5-SNAPSHOT.pom
[JENKINS] Archiving <https://builds.apache.org/job/Cayenne%20pull%20requests/ws/cayenne-joda/pom.xml>
to org.apache.cayenne/cayenne-joda/4.0.M5-SNAPSHOT/cayenne-joda-4.0.M5-SNAPSHOT.pom
[JENKINS] Archiving <https://builds.apache.org/job/Cayenne%20pull%20requests/ws/modeler/pom.xml>
to org.apache.cayenne.modeler/cayenne-modeler-parent/4.0.M5-SNAPSHOT/cayenne-modeler-parent-4.0.M5-SNAPSHOT.pom
[JENKINS] Archiving <https://builds.apache.org/job/Cayenne%20pull%20requests/ws/tutorials/tutorial-rop-server/pom.xml>
to org.apache.cayenne.tutorials/tutorial-rop-server/4.0.M5-SNAPSHOT/tutorial-rop-server-4.0.M5-SNAPSHOT.pom
[JENKINS] Archiving <https://builds.apache.org/job/Cayenne%20pull%20requests/ws/build-tools/cayenne-checkers/pom.xml>
to org.apache.cayenne.build-tools/cayenne-checkers/4.0.M5-SNAPSHOT/cayenne-checkers-4.0.M5-SNAPSHOT.pom
[JENKINS] Archiving <https://builds.apache.org/job/Cayenne%20pull%20requests/ws/docs/docbook/getting-started-rop/pom.xml>
to org.apache.cayenne.docs/getting-started-rop/4.0.M5-SNAPSHOT/getting-started-rop-4.0.M5-SNAPSHOT.pom
[JENKINS] Archiving <https://builds.apache.org/job/Cayenne%20pull%20requests/ws/modeler/cayenne-modeler-mac/pom.xml>
to org.apache.cayenne.modeler/cayenne-modeler-mac/4.0.M5-SNAPSHOT/cayenne-modeler-mac-4.0.M5-SNAPSHOT.pom
[JENKINS] Archiving <https://builds.apache.org/job/Cayenne%20pull%20requests/ws/modeler/cayenne-modeler-generic-ext/pom.xml>
to org.apache.cayenne.modeler/cayenne-modeler-generic-ext/4.0.M5-SNAPSHOT/cayenne-modeler-generic-ext-4.0.M5-SNAPSHOT.pom
[JENKINS] Archiving <https://builds.apache.org/job/Cayenne%20pull%20requests/ws/tutorials/tutorial/pom.xml>
to org.apache.cayenne.tutorials/tutorial/4.0.M5-SNAPSHOT/tutorial-4.0.M5-SNAPSHOT.pom
[JENKINS] Archiving <https://builds.apache.org/job/Cayenne%20pull%20requests/ws/modeler/cayenne-modeler-win-ext/pom.xml>
to org.apache.cayenne.modeler/cayenne-modeler-win-ext/4.0.M5-SNAPSHOT/cayenne-modeler-win-ext-4.0.M5-SNAPSHOT.pom
[JENKINS] Archiving <https://builds.apache.org/job/Cayenne%20pull%20requests/ws/docs/docbook/pom.xml>
to org.apache.cayenne.docs/cayenne-docbook/4.0.M5-SNAPSHOT/cayenne-docbook-4.0.M5-SNAPSHOT.pom
[JENKINS] Archiving <https://builds.apache.org/job/Cayenne%20pull%20requests/ws/plugins/pom.xml>
to org.apache.cayenne.plugins/cayenne-plugins-parent/4.0.M5-SNAPSHOT/cayenne-plugins-parent-4.0.M5-SNAPSHOT.pom
[JENKINS] Archiving <https://builds.apache.org/job/Cayenne%20pull%20requests/ws/modeler/cayenne-modeler-mac-ext/pom.xml>
to org.apache.cayenne.modeler/cayenne-modeler-mac-ext/4.0.M5-SNAPSHOT/cayenne-modeler-mac-ext-4.0.M5-SNAPSHOT.pom
[JENKINS] Archiving <https://builds.apache.org/job/Cayenne%20pull%20requests/ws/docs/pom.xml>
to org.apache.cayenne.docs/cayenne-docs-parent/4.0.M5-SNAPSHOT/cayenne-docs-parent-4.0.M5-SNAPSHOT.pom
[JENKINS] Archiving <https://builds.apache.org/job/Cayenne%20pull%20requests/ws/cayenne-dbcp2/pom.xml>
to org.apache.cayenne/cayenne-dbcp2/4.0.M5-SNAPSHOT/cayenne-dbcp2-4.0.M5-SNAPSHOT.pom
[JENKINS] Archiving <https://builds.apache.org/job/Cayenne%20pull%20requests/ws/cayenne-crypto/pom.xml>
to org.apache.cayenne/cayenne-crypto/4.0.M5-SNAPSHOT/cayenne-crypto-4.0.M5-SNAPSHOT.pom
[JENKINS] Archiving <https://builds.apache.org/job/Cayenne%20pull%20requests/ws/cayenne-di/pom.xml>
to org.apache.cayenne/cayenne-di/4.0.M5-SNAPSHOT/cayenne-di-4.0.M5-SNAPSHOT.pom
[JENKINS] Archiving <https://builds.apache.org/job/Cayenne%20pull%20requests/ws/build-tools/cayenne-legal/pom.xml>
to org.apache.cayenne.build-tools/cayenne-legal/4.0.M5-SNAPSHOT/cayenne-legal-4.0.M5-SNAPSHOT.pom
[JENKINS] Archiving <https://builds.apache.org/job/Cayenne%20pull%20requests/ws/build-tools/cayenne-legal/target/cayenne-legal-4.0.M5-SNAPSHOT.jar>
to org.apache.cayenne.build-tools/cayenne-legal/4.0.M5-SNAPSHOT/cayenne-legal-4.0.M5-SNAPSHOT.jar
[JENKINS] Archiving <https://builds.apache.org/job/Cayenne%20pull%20requests/ws/build-tools/cayenne-legal/target/cayenne-legal-4.0.M5-SNAPSHOT-sources.jar>
to org.apache.cayenne.build-tools/cayenne-legal/4.0.M5-SNAPSHOT/cayenne-legal-4.0.M5-SNAPSHOT-sources.jar
[JENKINS] Archiving <https://builds.apache.org/job/Cayenne%20pull%20requests/ws/build-tools/cayenne-test-utilities/pom.xml>
to org.apache.cayenne.build-tools/cayenne-test-utilities/4.0.M5-SNAPSHOT/cayenne-test-utilities-4.0.M5-SNAPSHOT.pom
[JENKINS] Archiving <https://builds.apache.org/job/Cayenne%20pull%20requests/ws/tutorials/tutorial-rop-client/pom.xml>
to org.apache.cayenne.tutorials/tutorial-rop-client/4.0.M5-SNAPSHOT/tutorial-rop-client-4.0.M5-SNAPSHOT.pom
[JENKINS] Archiving <https://builds.apache.org/job/Cayenne%20pull%20requests/ws/itests/pom.xml>
to org.apache.cayenne.itests/cayenne-itests-parent/4.0.M5-SNAPSHOT/cayenne-itests-parent-4.0.M5-SNAPSHOT.pom
channel stopped
Putting comment on the pull request
No JDK named ?jdk-1.8.0? found

Mime
View raw message