cayenne-commits mailing list archives

Site index · List index
Message view « Date » · « Thread »
Top « Date » · « Thread »
From Apache Jenkins Server <jenk...@builds.apache.org>
Subject Build failed in Jenkins: cayenne-master » h2,JDK 1.7 (latest),Ubuntu #435
Date Fri, 18 Nov 2016 23:42:48 GMT
See <https://builds.apache.org/job/cayenne-master/cayenneTestConnection=h2,jdk=JDK%201.7%20(latest),label=Ubuntu/435/changes>

Changes:

[johnthuss] Catch conversion errors when setting property values in order to get an

------------------------------------------
[...truncated 7297 lines...]
5/35 KB   
8/35 KB   
11/35 KB   
13/35 KB   
16/35 KB   
19/35 KB   
21/35 KB   
24/35 KB   
27/35 KB   
29/35 KB   
32/35 KB   
35/35 KB   
           
Downloaded: https://repo.maven.apache.org/maven2/net/sf/ehcache/ehcache-core/2.4.3/ehcache-core-2.4.3.pom
(35 KB at 2275.5 KB/sec)
Downloading: http://maven.objectstyle.org/nexus/content/groups/cayenne-deps/net/sf/ehcache/ehcache-parent/2.2/ehcache-parent-2.2.pom
           
Downloading: https://repo.maven.apache.org/maven2/net/sf/ehcache/ehcache-parent/2.2/ehcache-parent-2.2.pom
3/20 KB    
5/20 KB   
8/20 KB   
11/20 KB   
13/20 KB   
16/20 KB   
19/20 KB   
20/20 KB   
           
Downloaded: https://repo.maven.apache.org/maven2/net/sf/ehcache/ehcache-parent/2.2/ehcache-parent-2.2.pom
(20 KB at 1422.2 KB/sec)
Downloading: http://maven.objectstyle.org/nexus/content/groups/cayenne-deps/org/apache/geronimo/specs/geronimo-jms_1.1_spec/1.1/geronimo-jms_1.1_spec-1.1.pom
           
Downloading: https://repo.maven.apache.org/maven2/org/apache/geronimo/specs/geronimo-jms_1.1_spec/1.1/geronimo-jms_1.1_spec-1.1.pom
2/2 KB     
         
Downloaded: https://repo.maven.apache.org/maven2/org/apache/geronimo/specs/geronimo-jms_1.1_spec/1.1/geronimo-jms_1.1_spec-1.1.pom
(2 KB at 114.2 KB/sec)
Downloading: http://maven.objectstyle.org/nexus/content/groups/cayenne-deps/org/apache/geronimo/specs/specs/1.2/specs-1.2.pom
         
Downloading: https://repo.maven.apache.org/maven2/org/apache/geronimo/specs/specs/1.2/specs-1.2.pom
3/3 KB   
3/3 KB   
         
Downloaded: https://repo.maven.apache.org/maven2/org/apache/geronimo/specs/specs/1.2/specs-1.2.pom
(3 KB at 329.1 KB/sec)
Downloading: http://maven.objectstyle.org/nexus/content/groups/cayenne-deps/org/apache/geronimo/genesis/config/project-config/1.1/project-config-1.1.pom
         
Downloading: https://repo.maven.apache.org/maven2/org/apache/geronimo/genesis/config/project-config/1.1/project-config-1.1.pom
3/15 KB   
5/15 KB   
8/15 KB   
11/15 KB   
13/15 KB   
15/15 KB   
           
Downloaded: https://repo.maven.apache.org/maven2/org/apache/geronimo/genesis/config/project-config/1.1/project-config-1.1.pom
(15 KB at 700.5 KB/sec)
Downloading: http://maven.objectstyle.org/nexus/content/groups/cayenne-deps/org/apache/geronimo/genesis/config/config/1.1/config-1.1.pom
           
Downloading: https://repo.maven.apache.org/maven2/org/apache/geronimo/genesis/config/config/1.1/config-1.1.pom
670/670 B   
            
Downloaded: https://repo.maven.apache.org/maven2/org/apache/geronimo/genesis/config/config/1.1/config-1.1.pom
(670 B at 34.4 KB/sec)
Downloading: http://maven.objectstyle.org/nexus/content/groups/cayenne-deps/org/apache/geronimo/genesis/genesis/1.1/genesis-1.1.pom
            
Downloading: https://repo.maven.apache.org/maven2/org/apache/geronimo/genesis/genesis/1.1/genesis-1.1.pom
3/7 KB      
5/7 KB   
7/7 KB   
         
Downloaded: https://repo.maven.apache.org/maven2/org/apache/geronimo/genesis/genesis/1.1/genesis-1.1.pom
(7 KB at 661.2 KB/sec)
Downloading: http://maven.objectstyle.org/nexus/content/groups/cayenne-deps/javax/servlet/servlet-api/2.4/servlet-api-2.4.pom
         
Downloading: https://repo.maven.apache.org/maven2/javax/servlet/servlet-api/2.4/servlet-api-2.4.pom
156/156 B   
            
Downloaded: https://repo.maven.apache.org/maven2/javax/servlet/servlet-api/2.4/servlet-api-2.4.pom
(156 B at 15.2 KB/sec)
Downloading: http://maven.objectstyle.org/nexus/content/groups/cayenne-deps/org/mockito/mockito-all/1.8.5/mockito-all-1.8.5.pom
            
Downloading: https://repo.maven.apache.org/maven2/org/mockito/mockito-all/1.8.5/mockito-all-1.8.5.pom
858/858 B   
            
Downloaded: https://repo.maven.apache.org/maven2/org/mockito/mockito-all/1.8.5/mockito-all-1.8.5.pom
(858 B at 83.8 KB/sec)
Downloading: http://maven.objectstyle.org/nexus/content/groups/cayenne-deps/org/springframework/spring-core/1.2.6/spring-core-1.2.6.pom
            
Downloading: https://repo.maven.apache.org/maven2/org/springframework/spring-core/1.2.6/spring-core-1.2.6.pom
2/2 KB      
         
Downloaded: https://repo.maven.apache.org/maven2/org/springframework/spring-core/1.2.6/spring-core-1.2.6.pom
(2 KB at 89.5 KB/sec)
Downloading: http://maven.objectstyle.org/nexus/content/groups/cayenne-deps/org/springframework/spring-parent/1.2.6/spring-parent-1.2.6.pom
         
Downloading: https://repo.maven.apache.org/maven2/org/springframework/spring-parent/1.2.6/spring-parent-1.2.6.pom
3/11 KB   
5/11 KB   
8/11 KB   
11/11 KB   
11/11 KB   
           
Downloaded: https://repo.maven.apache.org/maven2/org/springframework/spring-parent/1.2.6/spring-parent-1.2.6.pom
(11 KB at 960.2 KB/sec)
Downloading: http://maven.objectstyle.org/nexus/content/groups/cayenne-deps/org/springframework/spring-mock/2.0.8/spring-mock-2.0.8.pom
           
Downloading: https://repo.maven.apache.org/maven2/org/springframework/spring-mock/2.0.8/spring-mock-2.0.8.pom
3/5 KB     
5/5 KB   
         
Downloaded: https://repo.maven.apache.org/maven2/org/springframework/spring-mock/2.0.8/spring-mock-2.0.8.pom
(5 KB at 412.9 KB/sec)
Downloading: http://maven.objectstyle.org/nexus/content/groups/cayenne-deps/mockrunner/mockrunner/0.4.1/mockrunner-0.4.1.pom
         
Downloading: https://repo.maven.apache.org/maven2/mockrunner/mockrunner/0.4.1/mockrunner-0.4.1.pom
         
Downloading: http://maven.objectstyle.org/nexus/content/groups/cayenne-deps/org/slf4j/jcl-over-slf4j/1.7.7/jcl-over-slf4j-1.7.7.pom
         
Downloading: https://repo.maven.apache.org/maven2/org/slf4j/jcl-over-slf4j/1.7.7/jcl-over-slf4j-1.7.7.pom
2/2 KB   
         
Downloaded: https://repo.maven.apache.org/maven2/org/slf4j/jcl-over-slf4j/1.7.7/jcl-over-slf4j-1.7.7.pom
(2 KB at 181.1 KB/sec)
Downloading: http://maven.objectstyle.org/nexus/content/groups/cayenne-deps/org/slf4j/slf4j-simple/1.7.7/slf4j-simple-1.7.7.pom
         
Downloading: https://repo.maven.apache.org/maven2/org/slf4j/slf4j-simple/1.7.7/slf4j-simple-1.7.7.pom
2/2 KB   
         
Downloaded: https://repo.maven.apache.org/maven2/org/slf4j/slf4j-simple/1.7.7/slf4j-simple-1.7.7.pom
(2 KB at 130.7 KB/sec)
[INFO] ------------------------------------------------------------------------
[INFO] Reactor Summary:
[INFO] 
[INFO] Cayenne ............................................ SUCCESS [  1.724 s]
[INFO] Cayenne Build Tools Parent ......................... SUCCESS [  0.026 s]
[INFO] Cayenne License and Notice Bundle .................. SUCCESS [  2.628 s]
[INFO] Common Unit Test Utilities ......................... SUCCESS [  1.239 s]
[INFO] Cayenne Code Checkers .............................. SUCCESS [  0.086 s]
[INFO] Cayenne Dependency Injection Container ............. SUCCESS [ 17.769 s]
[INFO] Cayenne Server ..................................... FAILURE [  0.669 s]
[INFO] Cayenne ROP Client ................................. SKIPPED
[INFO] Cayenne Database Synchronization Tools ............. SKIPPED
[INFO] Cayenne Project .................................... SKIPPED
[INFO] Cayenne Tools ...................................... SKIPPED
[INFO] Cayenne Lifecycle Utilities ........................ SKIPPED
[INFO] Cayenne Maven Plugins .............................. SKIPPED
[INFO] Cayenne Maven Plugin ............................... SKIPPED
[INFO] Cayenne Cryptography Extensions .................... SKIPPED
[INFO] Cayenne Joda Extensions ............................ SKIPPED
[INFO] Cayenne DBCP2 Extension ............................ SKIPPED
[INFO] Cayenne Integration Tests Parent ................... SKIPPED
[INFO] Integration Tests - Cayenne Tools .................. SKIPPED
[INFO] Cayenne Modeler Parent ............................. SKIPPED
[INFO] Cayenne WebObjects Compatibility Library ........... SKIPPED
[INFO] Cayenne Modeler .................................... SKIPPED
[INFO] Cayenne Modeler Generic and Windows Extensions ..... SKIPPED
[INFO] Cayenne Modeler Generic ............................ SKIPPED
[INFO] Cayenne Modeler Mac OS X Extensions ................ SKIPPED
[INFO] Cayenne Modeler Mac OS X ........................... SKIPPED
[INFO] Cayenne Modeler Win Extensions ..................... SKIPPED
[INFO] Cayenne Modeler Windows ............................ SKIPPED
[INFO] Cayenne Modeler Maven Plugin ....................... SKIPPED
[INFO] Cayenne Tutorials .................................. SKIPPED
[INFO] Cayenne Tutorial ................................... SKIPPED
[INFO] Cayenne ROP Server Tutorial ........................ SKIPPED
[INFO] Cayenne ROP Client Tutorial ........................ SKIPPED
[INFO] Cayenne Documenation Parent ........................ SKIPPED
[INFO] Cayenne Documentation .............................. SKIPPED
[INFO] Cayenne Docbook Documentation ...................... SKIPPED
[INFO] Docbook: Cayenne Stylesheets ....................... SKIPPED
[INFO] Docbook: Cayenne Guide ............................. SKIPPED
[INFO] Docbook: Getting Started with Cayenne .............. SKIPPED
[INFO] Docbook: Getting Started with Cayenne ROP .......... SKIPPED
[INFO] Docbook: Cayenne New Features and Upgrade Guide .... SKIPPED
[INFO] ------------------------------------------------------------------------
[INFO] BUILD FAILURE
[INFO] ------------------------------------------------------------------------
[INFO] Total time: 27.340 s
[INFO] Finished at: 2016-11-18T23:42:52+00:00
[INFO] Final Memory: 42M/194M
[INFO] ------------------------------------------------------------------------
[ERROR] Failed to execute goal on project cayenne-server: Could not resolve dependencies for
project org.apache.cayenne:cayenne-server:jar:4.0.M4-SNAPSHOT: Failed to collect dependencies
at opensymphony:oscache:jar:2.3.2: Failed to read artifact descriptor for opensymphony:oscache:jar:2.3.2:
Could not transfer artifact opensymphony:oscache:pom:2.3.2 from/to objectstyle (http://maven.objectstyle.org/nexus/content/groups/cayenne-deps):
Failed to transfer file: http://maven.objectstyle.org/nexus/content/groups/cayenne-deps/opensymphony/oscache/2.3.2/oscache-2.3.2.pom.
Return code is: 503 , ReasonPhrase:Service Temporarily Unavailable. -> [Help 1]
org.apache.maven.lifecycle.LifecycleExecutionException: Failed to execute goal on project
cayenne-server: Could not resolve dependencies for project org.apache.cayenne:cayenne-server:jar:4.0.M4-SNAPSHOT:
Failed to collect dependencies at opensymphony:oscache:jar:2.3.2
	at org.apache.maven.lifecycle.internal.LifecycleDependencyResolver.getDependencies(LifecycleDependencyResolver.java:221)
	at org.apache.maven.lifecycle.internal.LifecycleDependencyResolver.resolveProjectDependencies(LifecycleDependencyResolver.java:127)
	at org.apache.maven.lifecycle.internal.MojoExecutor.ensureDependenciesAreResolved(MojoExecutor.java:245)
	at org.apache.maven.lifecycle.internal.MojoExecutor.execute(MojoExecutor.java:199)
	at org.apache.maven.lifecycle.internal.MojoExecutor.execute(MojoExecutor.java:153)
	at org.apache.maven.lifecycle.internal.MojoExecutor.execute(MojoExecutor.java:145)
	at org.apache.maven.lifecycle.internal.LifecycleModuleBuilder.buildProject(LifecycleModuleBuilder.java:116)
	at org.apache.maven.lifecycle.internal.LifecycleModuleBuilder.buildProject(LifecycleModuleBuilder.java:80)
	at org.apache.maven.lifecycle.internal.builder.singlethreaded.SingleThreadedBuilder.build(SingleThreadedBuilder.java:51)
	at org.apache.maven.lifecycle.internal.LifecycleStarter.execute(LifecycleStarter.java:128)
	at org.apache.maven.DefaultMaven.doExecute(DefaultMaven.java:307)
	at org.apache.maven.DefaultMaven.doExecute(DefaultMaven.java:193)
	at org.apache.maven.DefaultMaven.execute(DefaultMaven.java:106)
	at org.apache.maven.cli.MavenCli.execute(MavenCli.java:863)
	at org.apache.maven.cli.MavenCli.doMain(MavenCli.java:288)
	at org.apache.maven.cli.MavenCli.main(MavenCli.java:199)
	at sun.reflect.NativeMethodAccessorImpl.invoke0(Native Method)
	at sun.reflect.NativeMethodAccessorImpl.invoke(NativeMethodAccessorImpl.java:57)
	at sun.reflect.DelegatingMethodAccessorImpl.invoke(DelegatingMethodAccessorImpl.java:43)
	at java.lang.reflect.Method.invoke(Method.java:606)
	at org.codehaus.plexus.classworlds.launcher.Launcher.launchEnhanced(Launcher.java:289)
	at org.codehaus.plexus.classworlds.launcher.Launcher.launch(Launcher.java:229)
	at org.codehaus.plexus.classworlds.launcher.Launcher.mainWithExitCode(Launcher.java:415)
	at org.codehaus.plexus.classworlds.launcher.Launcher.main(Launcher.java:356)
Caused by: org.apache.maven.project.DependencyResolutionException: Could not resolve dependencies
for project org.apache.cayenne:cayenne-server:jar:4.0.M4-SNAPSHOT: Failed to collect dependencies
at opensymphony:oscache:jar:2.3.2
	at org.apache.maven.project.DefaultProjectDependenciesResolver.resolve(DefaultProjectDependenciesResolver.java:180)
	at org.apache.maven.lifecycle.internal.LifecycleDependencyResolver.getDependencies(LifecycleDependencyResolver.java:195)
	... 23 more
Caused by: org.eclipse.aether.collection.DependencyCollectionException: Failed to collect
dependencies at opensymphony:oscache:jar:2.3.2
	at org.eclipse.aether.internal.impl.DefaultDependencyCollector.collectDependencies(DefaultDependencyCollector.java:291)
	at org.eclipse.aether.internal.impl.DefaultRepositorySystem.collectDependencies(DefaultRepositorySystem.java:316)
	at org.apache.maven.project.DefaultProjectDependenciesResolver.resolve(DefaultProjectDependenciesResolver.java:172)
	... 24 more
Caused by: org.eclipse.aether.resolution.ArtifactDescriptorException: Failed to read artifact
descriptor for opensymphony:oscache:jar:2.3.2
	at org.apache.maven.repository.internal.DefaultArtifactDescriptorReader.loadPom(DefaultArtifactDescriptorReader.java:282)
	at org.apache.maven.repository.internal.DefaultArtifactDescriptorReader.readArtifactDescriptor(DefaultArtifactDescriptorReader.java:198)
	at org.eclipse.aether.internal.impl.DefaultDependencyCollector.resolveCachedArtifactDescriptor(DefaultDependencyCollector.java:535)
	at org.eclipse.aether.internal.impl.DefaultDependencyCollector.getArtifactDescriptorResult(DefaultDependencyCollector.java:519)
	at org.eclipse.aether.internal.impl.DefaultDependencyCollector.processDependency(DefaultDependencyCollector.java:409)
	at org.eclipse.aether.internal.impl.DefaultDependencyCollector.processDependency(DefaultDependencyCollector.java:363)
	at org.eclipse.aether.internal.impl.DefaultDependencyCollector.process(DefaultDependencyCollector.java:351)
	at org.eclipse.aether.internal.impl.DefaultDependencyCollector.collectDependencies(DefaultDependencyCollector.java:254)
	... 26 more
Caused by: org.eclipse.aether.resolution.ArtifactResolutionException: Could not transfer artifact
opensymphony:oscache:pom:2.3.2 from/to objectstyle (http://maven.objectstyle.org/nexus/content/groups/cayenne-deps):
Failed to transfer file: http://maven.objectstyle.org/nexus/content/groups/cayenne-deps/opensymphony/oscache/2.3.2/oscache-2.3.2.pom.
Return code is: 503 , ReasonPhrase:Service Temporarily Unavailable.
	at org.eclipse.aether.internal.impl.DefaultArtifactResolver.resolve(DefaultArtifactResolver.java:444)
	at org.eclipse.aether.internal.impl.DefaultArtifactResolver.resolveArtifacts(DefaultArtifactResolver.java:246)
	at org.eclipse.aether.internal.impl.DefaultArtifactResolver.resolveArtifact(DefaultArtifactResolver.java:223)
	at org.apache.maven.repository.internal.DefaultArtifactDescriptorReader.loadPom(DefaultArtifactDescriptorReader.java:267)
	... 33 more
Caused by: org.eclipse.aether.transfer.ArtifactTransferException: Could not transfer artifact
opensymphony:oscache:pom:2.3.2 from/to objectstyle (http://maven.objectstyle.org/nexus/content/groups/cayenne-deps):
Failed to transfer file: http://maven.objectstyle.org/nexus/content/groups/cayenne-deps/opensymphony/oscache/2.3.2/oscache-2.3.2.pom.
Return code is: 503 , ReasonPhrase:Service Temporarily Unavailable.
	at org.eclipse.aether.connector.basic.ArtifactTransportListener.transferFailed(ArtifactTransportListener.java:43)
	at org.eclipse.aether.connector.basic.BasicRepositoryConnector$TaskRunner.run(BasicRepositoryConnector.java:355)
	at org.eclipse.aether.util.concurrency.RunnableErrorForwarder$1.run(RunnableErrorForwarder.java:67)
	at org.eclipse.aether.connector.basic.BasicRepositoryConnector$DirectExecutor.execute(BasicRepositoryConnector.java:581)
	at org.eclipse.aether.connector.basic.BasicRepositoryConnector.get(BasicRepositoryConnector.java:249)
	at org.eclipse.aether.internal.impl.DefaultArtifactResolver.performDownloads(DefaultArtifactResolver.java:520)
	at org.eclipse.aether.internal.impl.DefaultArtifactResolver.resolve(DefaultArtifactResolver.java:421)
	... 36 more
Caused by: org.apache.maven.wagon.TransferFailedException: Failed to transfer file: http://maven.objectstyle.org/nexus/content/groups/cayenne-deps/opensymphony/oscache/2.3.2/oscache-2.3.2.pom.
Return code is: 503 , ReasonPhrase:Service Temporarily Unavailable.
	at org.apache.maven.wagon.providers.http.AbstractHttpClientWagon.fillInputData(AbstractHttpClientWagon.java:1021)
	at org.apache.maven.wagon.providers.http.AbstractHttpClientWagon.fillInputData(AbstractHttpClientWagon.java:960)
	at org.apache.maven.wagon.StreamWagon.getInputStream(StreamWagon.java:116)
	at org.apache.maven.wagon.StreamWagon.getIfNewer(StreamWagon.java:88)
	at org.apache.maven.wagon.StreamWagon.get(StreamWagon.java:61)
	at org.eclipse.aether.transport.wagon.WagonTransporter$GetTaskRunner.run(WagonTransporter.java:560)
	at org.eclipse.aether.transport.wagon.WagonTransporter.execute(WagonTransporter.java:427)
	at org.eclipse.aether.transport.wagon.WagonTransporter.get(WagonTransporter.java:404)
	at org.eclipse.aether.connector.basic.BasicRepositoryConnector$GetTaskRunner.runTask(BasicRepositoryConnector.java:447)
	at org.eclipse.aether.connector.basic.BasicRepositoryConnector$TaskRunner.run(BasicRepositoryConnector.java:350)
	... 41 more
[ERROR] 
[ERROR] Re-run Maven using the -X switch to enable full debug logging.
[ERROR] 
[ERROR] For more information about the errors and possible solutions, please read the following
articles:
[ERROR] [Help 1] http://cwiki.apache.org/confluence/display/MAVEN/DependencyResolutionException
[ERROR] 
[ERROR] After correcting the problems, you can resume the build with the command
[ERROR]   mvn <goals> -rf :cayenne-server
Build step 'Invoke top-level Maven targets' marked build as failure
Recording test results

Mime
View raw message