cayenne-commits mailing list archives

Site index · List index
Message view « Date » · « Thread »
Top « Date » · « Thread »
From Apache Jenkins Server <jenk...@builds.apache.org>
Subject Build failed in Jenkins: cayenne-master » hsql,JDK 1.7 (latest),Ubuntu #437
Date Thu, 24 Nov 2016 15:41:48 GMT
See <https://builds.apache.org/job/cayenne-master/cayenneTestConnection=hsql,jdk=JDK%201.7%20(latest),label=Ubuntu/437/changes>

Changes:

[stariy95] CAY-2144 cdbimport always fails for databases which don't support

[stariy95] CAY-2144 cdbimport always fails for databases which don't support

[stariy95] Fix for wrong getter for ObjEntity's abstract flag in class generation

[stariy95] CAY-2150 UI bug: PK generation custom sequence is getting reset Fix: UI

[stariy95] CAY-2148 Failure upgrading from 3.1 to M4 Fix notes: this is a hot-fix

[stariy95] CAY-2153 After reverse engineering is done all data map is checked for

[stariy95] CAY-2154 Migrate db: queries order Fix ensure this ordering: - Add

[s.kolbachev] cleanup DbEntityTab

------------------------------------------
[...truncated 8735 lines...]
880/1387 KB   
884/1387 KB   
888/1387 KB   
892/1387 KB   
896/1387 KB   
900/1387 KB   
904/1387 KB   
908/1387 KB   
912/1387 KB   
916/1387 KB   
920/1387 KB   
924/1387 KB   
928/1387 KB   
932/1387 KB   
936/1387 KB   
940/1387 KB   
944/1387 KB   
948/1387 KB   
952/1387 KB   
956/1387 KB   
960/1387 KB   
964/1387 KB   
968/1387 KB   
972/1387 KB   
976/1387 KB   
980/1387 KB   
984/1387 KB   
988/1387 KB   
992/1387 KB   
996/1387 KB   
1000/1387 KB   
1004/1387 KB   
1008/1387 KB   
1012/1387 KB   
1016/1387 KB   
1020/1387 KB   
1024/1387 KB   
1028/1387 KB   
1032/1387 KB   
1036/1387 KB   
1040/1387 KB   
1044/1387 KB   
1048/1387 KB   
1052/1387 KB   
1056/1387 KB   
1060/1387 KB   
1064/1387 KB   
1068/1387 KB   
1072/1387 KB   
1076/1387 KB   
1080/1387 KB   
1084/1387 KB   
1088/1387 KB   
1092/1387 KB   
1096/1387 KB   
1100/1387 KB   
1104/1387 KB   
1108/1387 KB   
1112/1387 KB   
1116/1387 KB   
1120/1387 KB   
1124/1387 KB   
1128/1387 KB   
1132/1387 KB   
1136/1387 KB   
1140/1387 KB   
1144/1387 KB   
1148/1387 KB   
1152/1387 KB   
1156/1387 KB   
1160/1387 KB   
1164/1387 KB   
1168/1387 KB   
1172/1387 KB   
1176/1387 KB   
1180/1387 KB   
1184/1387 KB   
1188/1387 KB   
1192/1387 KB   
1196/1387 KB   
1200/1387 KB   
1204/1387 KB   
1208/1387 KB   
1212/1387 KB   
1216/1387 KB   
1220/1387 KB   
1224/1387 KB   
1228/1387 KB   
1232/1387 KB   
1236/1387 KB   
1240/1387 KB   
1244/1387 KB   
1248/1387 KB   
1252/1387 KB   
1256/1387 KB   
1260/1387 KB   
1264/1387 KB   
1268/1387 KB   
1272/1387 KB   
1276/1387 KB   
1280/1387 KB   
1284/1387 KB   
1288/1387 KB   
1292/1387 KB   
1296/1387 KB   
1300/1387 KB   
1304/1387 KB   
1308/1387 KB   
1312/1387 KB   
1316/1387 KB   
1320/1387 KB   
1324/1387 KB   
1328/1387 KB   
1332/1387 KB   
1336/1387 KB   
1340/1387 KB   
1344/1387 KB   
1348/1387 KB   
1352/1387 KB   
1356/1387 KB   
1360/1387 KB   
1364/1387 KB   
1368/1387 KB   
1372/1387 KB   
1376/1387 KB   
1380/1387 KB   
1384/1387 KB   
1387/1387 KB   
               
Downloaded: https://repo.maven.apache.org/maven2/org/mockito/mockito-all/1.8.5/mockito-all-1.8.5.jar
(1387 KB at 3819.8 KB/sec)
[INFO] ------------------------------------------------------------------------
[INFO] Reactor Summary:
[INFO] 
[INFO] Cayenne ............................................ SUCCESS [  2.068 s]
[INFO] Cayenne Build Tools Parent ......................... SUCCESS [  0.016 s]
[INFO] Cayenne License and Notice Bundle .................. SUCCESS [  3.574 s]
[INFO] Common Unit Test Utilities ......................... SUCCESS [  1.254 s]
[INFO] Cayenne Code Checkers .............................. SUCCESS [  0.081 s]
[INFO] Cayenne Dependency Injection Container ............. SUCCESS [ 23.244 s]
[INFO] Cayenne Server ..................................... FAILURE [  8.959 s]
[INFO] Cayenne ROP Client ................................. SKIPPED
[INFO] Cayenne Database Synchronization Tools ............. SKIPPED
[INFO] Cayenne Project .................................... SKIPPED
[INFO] Cayenne Tools ...................................... SKIPPED
[INFO] Cayenne Lifecycle Utilities ........................ SKIPPED
[INFO] Cayenne Maven Plugins .............................. SKIPPED
[INFO] Cayenne Maven Plugin ............................... SKIPPED
[INFO] Cayenne Cryptography Extensions .................... SKIPPED
[INFO] Cayenne Joda Extensions ............................ SKIPPED
[INFO] Cayenne DBCP2 Extension ............................ SKIPPED
[INFO] Cayenne Integration Tests Parent ................... SKIPPED
[INFO] Integration Tests - Cayenne Tools .................. SKIPPED
[INFO] Cayenne Modeler Parent ............................. SKIPPED
[INFO] Cayenne WebObjects Compatibility Library ........... SKIPPED
[INFO] Cayenne Modeler .................................... SKIPPED
[INFO] Cayenne Modeler Generic and Windows Extensions ..... SKIPPED
[INFO] Cayenne Modeler Generic ............................ SKIPPED
[INFO] Cayenne Modeler Mac OS X Extensions ................ SKIPPED
[INFO] Cayenne Modeler Mac OS X ........................... SKIPPED
[INFO] Cayenne Modeler Win Extensions ..................... SKIPPED
[INFO] Cayenne Modeler Windows ............................ SKIPPED
[INFO] Cayenne Modeler Maven Plugin ....................... SKIPPED
[INFO] Cayenne Tutorials .................................. SKIPPED
[INFO] Cayenne Tutorial ................................... SKIPPED
[INFO] Cayenne ROP Server Tutorial ........................ SKIPPED
[INFO] Cayenne ROP Client Tutorial ........................ SKIPPED
[INFO] Cayenne Documenation Parent ........................ SKIPPED
[INFO] Cayenne Documentation .............................. SKIPPED
[INFO] Cayenne Docbook Documentation ...................... SKIPPED
[INFO] Docbook: Cayenne Stylesheets ....................... SKIPPED
[INFO] Docbook: Cayenne Guide ............................. SKIPPED
[INFO] Docbook: Getting Started with Cayenne .............. SKIPPED
[INFO] Docbook: Getting Started with Cayenne ROP .......... SKIPPED
[INFO] Docbook: Cayenne New Features and Upgrade Guide .... SKIPPED
[INFO] ------------------------------------------------------------------------
[INFO] BUILD FAILURE
[INFO] ------------------------------------------------------------------------
[INFO] Total time: 43.695 s
[INFO] Finished at: 2016-11-24T15:41:47+00:00
[INFO] Final Memory: 43M/192M
[INFO] ------------------------------------------------------------------------
[ERROR] Failed to execute goal on project cayenne-server: Could not resolve dependencies for
project org.apache.cayenne:cayenne-server:jar:4.0.M4-SNAPSHOT: Could not transfer artifact
mockrunner:mockrunner:jar:0.4.1 from/to objectstyle (http://maven.objectstyle.org/nexus/content/groups/cayenne-deps):
Failed to transfer file: http://maven.objectstyle.org/nexus/content/groups/cayenne-deps/mockrunner/mockrunner/0.4.1/mockrunner-0.4.1.jar.
Return code is: 502 , ReasonPhrase:Proxy Error. -> [Help 1]
org.apache.maven.lifecycle.LifecycleExecutionException: Failed to execute goal on project
cayenne-server: Could not resolve dependencies for project org.apache.cayenne:cayenne-server:jar:4.0.M4-SNAPSHOT:
Could not transfer artifact mockrunner:mockrunner:jar:0.4.1 from/to objectstyle (http://maven.objectstyle.org/nexus/content/groups/cayenne-deps):
Failed to transfer file: http://maven.objectstyle.org/nexus/content/groups/cayenne-deps/mockrunner/mockrunner/0.4.1/mockrunner-0.4.1.jar.
Return code is: 502 , ReasonPhrase:Proxy Error.
	at org.apache.maven.lifecycle.internal.LifecycleDependencyResolver.getDependencies(LifecycleDependencyResolver.java:221)
	at org.apache.maven.lifecycle.internal.LifecycleDependencyResolver.resolveProjectDependencies(LifecycleDependencyResolver.java:127)
	at org.apache.maven.lifecycle.internal.MojoExecutor.ensureDependenciesAreResolved(MojoExecutor.java:245)
	at org.apache.maven.lifecycle.internal.MojoExecutor.execute(MojoExecutor.java:199)
	at org.apache.maven.lifecycle.internal.MojoExecutor.execute(MojoExecutor.java:153)
	at org.apache.maven.lifecycle.internal.MojoExecutor.execute(MojoExecutor.java:145)
	at org.apache.maven.lifecycle.internal.LifecycleModuleBuilder.buildProject(LifecycleModuleBuilder.java:116)
	at org.apache.maven.lifecycle.internal.LifecycleModuleBuilder.buildProject(LifecycleModuleBuilder.java:80)
	at org.apache.maven.lifecycle.internal.builder.singlethreaded.SingleThreadedBuilder.build(SingleThreadedBuilder.java:51)
	at org.apache.maven.lifecycle.internal.LifecycleStarter.execute(LifecycleStarter.java:128)
	at org.apache.maven.DefaultMaven.doExecute(DefaultMaven.java:307)
	at org.apache.maven.DefaultMaven.doExecute(DefaultMaven.java:193)
	at org.apache.maven.DefaultMaven.execute(DefaultMaven.java:106)
	at org.apache.maven.cli.MavenCli.execute(MavenCli.java:863)
	at org.apache.maven.cli.MavenCli.doMain(MavenCli.java:288)
	at org.apache.maven.cli.MavenCli.main(MavenCli.java:199)
	at sun.reflect.NativeMethodAccessorImpl.invoke0(Native Method)
	at sun.reflect.NativeMethodAccessorImpl.invoke(NativeMethodAccessorImpl.java:57)
	at sun.reflect.DelegatingMethodAccessorImpl.invoke(DelegatingMethodAccessorImpl.java:43)
	at java.lang.reflect.Method.invoke(Method.java:606)
	at org.codehaus.plexus.classworlds.launcher.Launcher.launchEnhanced(Launcher.java:289)
	at org.codehaus.plexus.classworlds.launcher.Launcher.launch(Launcher.java:229)
	at org.codehaus.plexus.classworlds.launcher.Launcher.mainWithExitCode(Launcher.java:415)
	at org.codehaus.plexus.classworlds.launcher.Launcher.main(Launcher.java:356)
Caused by: org.apache.maven.project.DependencyResolutionException: Could not resolve dependencies
for project org.apache.cayenne:cayenne-server:jar:4.0.M4-SNAPSHOT: Could not transfer artifact
mockrunner:mockrunner:jar:0.4.1 from/to objectstyle (http://maven.objectstyle.org/nexus/content/groups/cayenne-deps):
Failed to transfer file: http://maven.objectstyle.org/nexus/content/groups/cayenne-deps/mockrunner/mockrunner/0.4.1/mockrunner-0.4.1.jar.
Return code is: 502 , ReasonPhrase:Proxy Error.
	at org.apache.maven.project.DefaultProjectDependenciesResolver.resolve(DefaultProjectDependenciesResolver.java:211)
	at org.apache.maven.lifecycle.internal.LifecycleDependencyResolver.getDependencies(LifecycleDependencyResolver.java:195)
	... 23 more
Caused by: org.eclipse.aether.resolution.DependencyResolutionException: Could not transfer
artifact mockrunner:mockrunner:jar:0.4.1 from/to objectstyle (http://maven.objectstyle.org/nexus/content/groups/cayenne-deps):
Failed to transfer file: http://maven.objectstyle.org/nexus/content/groups/cayenne-deps/mockrunner/mockrunner/0.4.1/mockrunner-0.4.1.jar.
Return code is: 502 , ReasonPhrase:Proxy Error.
	at org.eclipse.aether.internal.impl.DefaultRepositorySystem.resolveDependencies(DefaultRepositorySystem.java:384)
	at org.apache.maven.project.DefaultProjectDependenciesResolver.resolve(DefaultProjectDependenciesResolver.java:205)
	... 24 more
Caused by: org.eclipse.aether.resolution.ArtifactResolutionException: Could not transfer artifact
mockrunner:mockrunner:jar:0.4.1 from/to objectstyle (http://maven.objectstyle.org/nexus/content/groups/cayenne-deps):
Failed to transfer file: http://maven.objectstyle.org/nexus/content/groups/cayenne-deps/mockrunner/mockrunner/0.4.1/mockrunner-0.4.1.jar.
Return code is: 502 , ReasonPhrase:Proxy Error.
	at org.eclipse.aether.internal.impl.DefaultArtifactResolver.resolve(DefaultArtifactResolver.java:444)
	at org.eclipse.aether.internal.impl.DefaultArtifactResolver.resolveArtifacts(DefaultArtifactResolver.java:246)
	at org.eclipse.aether.internal.impl.DefaultRepositorySystem.resolveDependencies(DefaultRepositorySystem.java:367)
	... 25 more
Caused by: org.eclipse.aether.transfer.ArtifactTransferException: Could not transfer artifact
mockrunner:mockrunner:jar:0.4.1 from/to objectstyle (http://maven.objectstyle.org/nexus/content/groups/cayenne-deps):
Failed to transfer file: http://maven.objectstyle.org/nexus/content/groups/cayenne-deps/mockrunner/mockrunner/0.4.1/mockrunner-0.4.1.jar.
Return code is: 502 , ReasonPhrase:Proxy Error.
	at org.eclipse.aether.connector.basic.ArtifactTransportListener.transferFailed(ArtifactTransportListener.java:43)
	at org.eclipse.aether.connector.basic.BasicRepositoryConnector$TaskRunner.run(BasicRepositoryConnector.java:355)
	at org.eclipse.aether.util.concurrency.RunnableErrorForwarder$1.run(RunnableErrorForwarder.java:67)
	at java.util.concurrent.ThreadPoolExecutor.runWorker(ThreadPoolExecutor.java:1145)
	at java.util.concurrent.ThreadPoolExecutor$Worker.run(ThreadPoolExecutor.java:615)
	at java.lang.Thread.run(Thread.java:745)
Caused by: org.apache.maven.wagon.TransferFailedException: Failed to transfer file: http://maven.objectstyle.org/nexus/content/groups/cayenne-deps/mockrunner/mockrunner/0.4.1/mockrunner-0.4.1.jar.
Return code is: 502 , ReasonPhrase:Proxy Error.
	at org.apache.maven.wagon.providers.http.AbstractHttpClientWagon.fillInputData(AbstractHttpClientWagon.java:1021)
	at org.apache.maven.wagon.providers.http.AbstractHttpClientWagon.fillInputData(AbstractHttpClientWagon.java:960)
	at org.apache.maven.wagon.StreamWagon.getInputStream(StreamWagon.java:116)
	at org.apache.maven.wagon.StreamWagon.getIfNewer(StreamWagon.java:88)
	at org.apache.maven.wagon.StreamWagon.get(StreamWagon.java:61)
	at org.eclipse.aether.transport.wagon.WagonTransporter$GetTaskRunner.run(WagonTransporter.java:560)
	at org.eclipse.aether.transport.wagon.WagonTransporter.execute(WagonTransporter.java:427)
	at org.eclipse.aether.transport.wagon.WagonTransporter.get(WagonTransporter.java:404)
	at org.eclipse.aether.connector.basic.BasicRepositoryConnector$GetTaskRunner.runTask(BasicRepositoryConnector.java:447)
	at org.eclipse.aether.connector.basic.BasicRepositoryConnector$TaskRunner.run(BasicRepositoryConnector.java:350)
	... 4 more
[ERROR] 
[ERROR] Re-run Maven using the -X switch to enable full debug logging.
[ERROR] 
[ERROR] For more information about the errors and possible solutions, please read the following
articles:
[ERROR] [Help 1] http://cwiki.apache.org/confluence/display/MAVEN/DependencyResolutionException
[ERROR] 
[ERROR] After correcting the problems, you can resume the build with the command
[ERROR]   mvn <goals> -rf :cayenne-server
Build step 'Invoke top-level Maven targets' marked build as failure
Recording test results

Mime
View raw message