cayenne-commits mailing list archives

Site index · List index
Message view « Date » · « Thread »
Top « Date » · « Thread »
From Apache Jenkins Server <jenk...@builds.apache.org>
Subject Build failed in Jenkins: cayenne-master » hsql,JDK 1.8 (latest),Ubuntu #414
Date Thu, 03 Nov 2016 20:30:40 GMT
See <https://builds.apache.org/job/cayenne-master/cayenneTestConnection=hsql,jdk=JDK%201.8%20(latest),label=Ubuntu/414/changes>

Changes:

[s.kolbachev] Fix wrong selection of data source in reengineer dialog after editing it

[s.kolbachev] Correctly update data sources selection dialog after modifying or

[s.kolbachev] Modeler Reengineer dialog improvement\nSelect newly created data source

[s.kolbachev] Modeler Reengineer dialog improvement\nSelect newly created data source

[s.kolbachev] Modeler Reengineering dialog enhancement. Save last used data source in

[s.kolbachev] [CAY-2129] Modeler reengineer dialog improvements - updated release

------------------------------------------
[...truncated 48755 lines...]
[main] INFO org.apache.cayenne.test.jdbc.UtilityLogger - delete from FLATTENED_TEST_2
[main] INFO org.apache.cayenne.test.jdbc.UtilityLogger - delete from FLATTENED_CIRCULAR
[main] INFO org.apache.cayenne.test.jdbc.UtilityLogger - delete from FLATTENED_TEST_1
[main] INFO org.apache.cayenne.log.CommonsJdbcEventLogger - --- transaction started.
[main] INFO org.apache.cayenne.log.CommonsJdbcEventLogger - INSERT INTO FLATTENED_TEST_1 (FT1_ID,
NAME) VALUES (?, ?)
[main] INFO org.apache.cayenne.log.CommonsJdbcEventLogger - [bind: 1->FT1_ID:202, 2->NAME:'FT1Name']
[main] INFO org.apache.cayenne.log.CommonsJdbcEventLogger - === updated 1 row.
[main] INFO org.apache.cayenne.log.CommonsJdbcEventLogger - INSERT INTO FLATTENED_TEST_2 (FT1_ID,
FT2_ID, NAME) VALUES (?, ?, ?)
[main] INFO org.apache.cayenne.log.CommonsJdbcEventLogger - [bind: 1->FT1_ID:202, 2->FT2_ID:202,
3->NAME:'FT2Name']
[main] INFO org.apache.cayenne.log.CommonsJdbcEventLogger - === updated 1 row.
[main] INFO org.apache.cayenne.log.CommonsJdbcEventLogger - INSERT INTO FLATTENED_TEST_3 (FT2_ID,
FT3_ID, NAME) VALUES (?, ?, ?)
[main] INFO org.apache.cayenne.log.CommonsJdbcEventLogger - [bind: 1->FT2_ID:202, 2->FT3_ID:203,
3->NAME:'FT3Name']
[main] INFO org.apache.cayenne.log.CommonsJdbcEventLogger - === updated 1 row.
[main] INFO org.apache.cayenne.log.CommonsJdbcEventLogger - +++ transaction committed.
[main] INFO org.apache.cayenne.log.CommonsJdbcEventLogger - --- transaction started.
[main] INFO org.apache.cayenne.log.CommonsJdbcEventLogger - SELECT t0.NAME, t0.FT3_ID, t0.FT2_ID
FROM FLATTENED_TEST_3 t0 WHERE t0.NAME = ? [bind: 1->NAME:'FT3Name']
[main] INFO org.apache.cayenne.log.CommonsJdbcEventLogger - === returned 1 row. - took 0 ms.
[main] INFO org.apache.cayenne.log.CommonsJdbcEventLogger - +++ transaction committed.
[main] INFO org.apache.cayenne.log.CommonsJdbcEventLogger - --- transaction started.
[main] INFO org.apache.cayenne.log.CommonsJdbcEventLogger - SELECT DISTINCT t0.NAME, t0.FT1_ID
FROM FLATTENED_TEST_1 t0 JOIN FLATTENED_TEST_2 t1 ON (t0.FT1_ID = t1.FT1_ID) JOIN FLATTENED_TEST_3
t2 ON (t1.FT2_ID = t2.FT2_ID) WHERE t2.FT3_ID = ? [bind: 1->FT3_ID:203]
[main] INFO org.apache.cayenne.log.CommonsJdbcEventLogger - === returned 1 row. - took 0 ms.
[main] INFO org.apache.cayenne.log.CommonsJdbcEventLogger - +++ transaction committed.
[main] INFO org.apache.cayenne.configuration.XMLDataChannelDescriptorLoader - Loading XML
configuration resource from <https://builds.apache.org/job/cayenne-master/cayenneTestConnection=hsql,jdk=JDK%201.8%20(latest),label=Ubuntu/ws/cayenne-server/target/test-classes/cayenne-relationships-flattened.xml>
[main] INFO org.apache.cayenne.configuration.XMLDataChannelDescriptorLoader - Loading XML
DataMap resource from <https://builds.apache.org/job/cayenne-master/cayenneTestConnection=hsql,jdk=JDK%201.8%20(latest),label=Ubuntu/ws/cayenne-server/target/test-classes/relationships-flattened.map.xml>
[main] INFO org.apache.cayenne.configuration.XMLDataChannelDescriptorLoader - Loading XML
configuration resource from <https://builds.apache.org/job/cayenne-master/cayenneTestConnection=hsql,jdk=JDK%201.8%20(latest),label=Ubuntu/ws/cayenne-server/target/test-classes/cayenne-relationships-flattened.xml>
[main] INFO org.apache.cayenne.configuration.XMLDataChannelDescriptorLoader - Loading XML
DataMap resource from <https://builds.apache.org/job/cayenne-master/cayenneTestConnection=hsql,jdk=JDK%201.8%20(latest),label=Ubuntu/ws/cayenne-server/target/test-classes/relationships-flattened.map.xml>
[main] INFO org.apache.cayenne.test.jdbc.UtilityLogger - delete from COMPLEX_JOIN
[main] INFO org.apache.cayenne.test.jdbc.UtilityLogger - delete from FLATTENED_TEST_4
[main] INFO org.apache.cayenne.test.jdbc.UtilityLogger - delete from FLATTENED_TEST_3
[main] INFO org.apache.cayenne.test.jdbc.UtilityLogger - delete from FLATTENED_CIRCULAR_JOIN
[main] INFO org.apache.cayenne.test.jdbc.UtilityLogger - delete from FLATTENED_TEST_2
[main] INFO org.apache.cayenne.test.jdbc.UtilityLogger - delete from FLATTENED_CIRCULAR
[main] INFO org.apache.cayenne.test.jdbc.UtilityLogger - delete from FLATTENED_TEST_1
[main] INFO org.apache.cayenne.log.CommonsJdbcEventLogger - --- transaction started.
[main] INFO org.apache.cayenne.log.CommonsJdbcEventLogger - SELECT NEXT_ID FROM AUTO_PK_SUPPORT
WHERE TABLE_NAME = 'COMPLEX_JOIN'
[main] INFO org.apache.cayenne.log.CommonsJdbcEventLogger - === returned 1 row. - took 0 ms.
[main] INFO org.apache.cayenne.log.CommonsJdbcEventLogger - UPDATE AUTO_PK_SUPPORT SET NEXT_ID
= NEXT_ID + 20 WHERE TABLE_NAME = 'COMPLEX_JOIN'
[main] INFO org.apache.cayenne.log.CommonsJdbcEventLogger - === updated 1 row.
[main] INFO org.apache.cayenne.log.CommonsJdbcEventLogger - INSERT INTO FLATTENED_TEST_1 (FT1_ID,
NAME) VALUES (?, ?)
[main] INFO org.apache.cayenne.log.CommonsJdbcEventLogger - [bind: 1->FT1_ID:203, 2->NAME:'t01']
[main] INFO org.apache.cayenne.log.CommonsJdbcEventLogger - === updated 1 row.
[main] INFO org.apache.cayenne.log.CommonsJdbcEventLogger - INSERT INTO FLATTENED_TEST_3 (FT2_ID,
FT3_ID, NAME) VALUES (?, ?, ?)
[main] INFO org.apache.cayenne.log.CommonsJdbcEventLogger - [bind: 1->FT2_ID:NULL, 2->FT3_ID:204,
3->NAME:'t12']
[main] INFO org.apache.cayenne.log.CommonsJdbcEventLogger - === updated 1 row.
[main] INFO org.apache.cayenne.log.CommonsJdbcEventLogger - [bind: 1->FT2_ID:NULL, 2->FT3_ID:205,
3->NAME:'t11']
[main] INFO org.apache.cayenne.log.CommonsJdbcEventLogger - === updated 1 row.
[main] INFO org.apache.cayenne.log.CommonsJdbcEventLogger - INSERT INTO COMPLEX_JOIN (EXTRA_COLUMN,
FT1_FK, FT3_FK, PK) VALUES (?, ?, ?, ?)
[main] INFO org.apache.cayenne.log.CommonsJdbcEventLogger - [bind: 1->EXTRA_COLUMN:NULL,
2->FT1_FK:203, 3->FT3_FK:205, 4->PK:200]
[main] INFO org.apache.cayenne.log.CommonsJdbcEventLogger - === updated 1 row.
[main] INFO org.apache.cayenne.log.CommonsJdbcEventLogger - [bind: 1->EXTRA_COLUMN:NULL,
2->FT1_FK:203, 3->FT3_FK:204, 4->PK:201]
[main] INFO org.apache.cayenne.log.CommonsJdbcEventLogger - === updated 1 row.
[main] INFO org.apache.cayenne.log.CommonsJdbcEventLogger - +++ transaction committed.
[main] INFO org.apache.cayenne.log.CommonsJdbcEventLogger - --- transaction started.
[main] INFO org.apache.cayenne.log.CommonsJdbcEventLogger - SELECT t0.NAME, t0.FT1_ID FROM
FLATTENED_TEST_1 t0 WHERE t0.FT1_ID = ? [bind: 1->FT1_ID:203]
[main] INFO org.apache.cayenne.log.CommonsJdbcEventLogger - === returned 1 row. - took 0 ms.
[main] INFO org.apache.cayenne.log.CommonsJdbcEventLogger - +++ transaction committed.
[main] INFO org.apache.cayenne.log.CommonsJdbcEventLogger - --- transaction started.
[main] INFO org.apache.cayenne.log.CommonsJdbcEventLogger - SELECT DISTINCT t0.NAME, t0.FT3_ID,
t0.FT2_ID FROM FLATTENED_TEST_3 t0 JOIN COMPLEX_JOIN t1 ON (t0.FT3_ID = t1.FT3_FK) WHERE t1.FT1_FK
= ? [bind: 1->FT1_FK:203]
[main] INFO org.apache.cayenne.log.CommonsJdbcEventLogger - === returned 2 rows. - took 1
ms.
[main] INFO org.apache.cayenne.log.CommonsJdbcEventLogger - +++ transaction committed.
[main] INFO org.apache.cayenne.configuration.XMLDataChannelDescriptorLoader - Loading XML
configuration resource from <https://builds.apache.org/job/cayenne-master/cayenneTestConnection=hsql,jdk=JDK%201.8%20(latest),label=Ubuntu/ws/cayenne-server/target/test-classes/cayenne-relationships-flattened.xml>
[main] INFO org.apache.cayenne.configuration.XMLDataChannelDescriptorLoader - Loading XML
DataMap resource from <https://builds.apache.org/job/cayenne-master/cayenneTestConnection=hsql,jdk=JDK%201.8%20(latest),label=Ubuntu/ws/cayenne-server/target/test-classes/relationships-flattened.map.xml>
[main] INFO org.apache.cayenne.configuration.XMLDataChannelDescriptorLoader - Loading XML
configuration resource from <https://builds.apache.org/job/cayenne-master/cayenneTestConnection=hsql,jdk=JDK%201.8%20(latest),label=Ubuntu/ws/cayenne-server/target/test-classes/cayenne-relationships-flattened.xml>
[main] INFO org.apache.cayenne.configuration.XMLDataChannelDescriptorLoader - Loading XML
DataMap resource from <https://builds.apache.org/job/cayenne-master/cayenneTestConnection=hsql,jdk=JDK%201.8%20(latest),label=Ubuntu/ws/cayenne-server/target/test-classes/relationships-flattened.map.xml>
[main] INFO org.apache.cayenne.test.jdbc.UtilityLogger - delete from COMPLEX_JOIN
[main] INFO org.apache.cayenne.test.jdbc.UtilityLogger - delete from FLATTENED_TEST_4
[main] INFO org.apache.cayenne.test.jdbc.UtilityLogger - delete from FLATTENED_TEST_3
[main] INFO org.apache.cayenne.test.jdbc.UtilityLogger - delete from FLATTENED_CIRCULAR_JOIN
[main] INFO org.apache.cayenne.test.jdbc.UtilityLogger - delete from FLATTENED_TEST_2
[main] INFO org.apache.cayenne.test.jdbc.UtilityLogger - delete from FLATTENED_CIRCULAR
[main] INFO org.apache.cayenne.test.jdbc.UtilityLogger - delete from FLATTENED_TEST_1
[main] INFO org.apache.cayenne.test.jdbc.UtilityLogger - INSERT INTO FLATTENED_CIRCULAR (ID)
VALUES (?)
[main] INFO org.apache.cayenne.test.jdbc.UtilityLogger - INSERT INTO FLATTENED_CIRCULAR (ID)
VALUES (?)
[main] INFO org.apache.cayenne.test.jdbc.UtilityLogger - INSERT INTO FLATTENED_CIRCULAR (ID)
VALUES (?)
[main] INFO org.apache.cayenne.test.jdbc.UtilityLogger - INSERT INTO FLATTENED_CIRCULAR_JOIN
(SIDE1_ID, SIDE2_ID) VALUES (?, ?)
[main] INFO org.apache.cayenne.test.jdbc.UtilityLogger - INSERT INTO FLATTENED_CIRCULAR_JOIN
(SIDE1_ID, SIDE2_ID) VALUES (?, ?)
[main] INFO org.apache.cayenne.log.CommonsJdbcEventLogger - --- transaction started.
[main] INFO org.apache.cayenne.log.CommonsJdbcEventLogger - SELECT t0.ID FROM FLATTENED_CIRCULAR
t0 WHERE t0.ID = ? [bind: 1->ID:1]
[main] INFO org.apache.cayenne.log.CommonsJdbcEventLogger - === returned 1 row. - took 1 ms.
[main] INFO org.apache.cayenne.log.CommonsJdbcEventLogger - +++ transaction committed.
[main] INFO org.apache.cayenne.log.CommonsJdbcEventLogger - --- transaction started.
[main] INFO org.apache.cayenne.log.CommonsJdbcEventLogger - SELECT DISTINCT t0.ID FROM FLATTENED_CIRCULAR
t0 JOIN FLATTENED_CIRCULAR_JOIN t1 ON (t0.ID = t1.SIDE2_ID) WHERE t1.SIDE1_ID = ? [bind: 1->SIDE1_ID:1]
[main] INFO org.apache.cayenne.log.CommonsJdbcEventLogger - === returned 2 rows. - took 0
ms.
[main] INFO org.apache.cayenne.log.CommonsJdbcEventLogger - +++ transaction committed.
[main] INFO org.apache.cayenne.log.CommonsJdbcEventLogger - --- transaction started.
[main] INFO org.apache.cayenne.log.CommonsJdbcEventLogger - SELECT DISTINCT t0.ID FROM FLATTENED_CIRCULAR
t0 JOIN FLATTENED_CIRCULAR_JOIN t1 ON (t0.ID = t1.SIDE1_ID) WHERE t1.SIDE2_ID = ? [bind: 1->SIDE2_ID:1]
[main] INFO org.apache.cayenne.log.CommonsJdbcEventLogger - === returned 0 rows. - took 0
ms.
[main] INFO org.apache.cayenne.log.CommonsJdbcEventLogger - +++ transaction committed.
[main] INFO org.apache.cayenne.configuration.XMLDataChannelDescriptorLoader - Loading XML
configuration resource from <https://builds.apache.org/job/cayenne-master/cayenneTestConnection=hsql,jdk=JDK%201.8%20(latest),label=Ubuntu/ws/cayenne-server/target/test-classes/cayenne-relationships-flattened.xml>
[main] INFO org.apache.cayenne.configuration.XMLDataChannelDescriptorLoader - Loading XML
DataMap resource from <https://builds.apache.org/job/cayenne-master/cayenneTestConnection=hsql,jdk=JDK%201.8%20(latest),label=Ubuntu/ws/cayenne-server/target/test-classes/relationships-flattened.map.xml>
[main] INFO org.apache.cayenne.configuration.XMLDataChannelDescriptorLoader - Loading XML
configuration resource from <https://builds.apache.org/job/cayenne-master/cayenneTestConnection=hsql,jdk=JDK%201.8%20(latest),label=Ubuntu/ws/cayenne-server/target/test-classes/cayenne-relationships-flattened.xml>
[main] INFO org.apache.cayenne.configuration.XMLDataChannelDescriptorLoader - Loading XML
DataMap resource from <https://builds.apache.org/job/cayenne-master/cayenneTestConnection=hsql,jdk=JDK%201.8%20(latest),label=Ubuntu/ws/cayenne-server/target/test-classes/relationships-flattened.map.xml>
[main] INFO org.apache.cayenne.test.jdbc.UtilityLogger - delete from COMPLEX_JOIN
[main] INFO org.apache.cayenne.test.jdbc.UtilityLogger - delete from FLATTENED_TEST_4
[main] INFO org.apache.cayenne.test.jdbc.UtilityLogger - delete from FLATTENED_TEST_3
[main] INFO org.apache.cayenne.test.jdbc.UtilityLogger - delete from FLATTENED_CIRCULAR_JOIN
[main] INFO org.apache.cayenne.test.jdbc.UtilityLogger - delete from FLATTENED_TEST_2
[main] INFO org.apache.cayenne.test.jdbc.UtilityLogger - delete from FLATTENED_CIRCULAR
[main] INFO org.apache.cayenne.test.jdbc.UtilityLogger - delete from FLATTENED_TEST_1
[main] INFO org.apache.cayenne.test.jdbc.UtilityLogger - INSERT INTO FLATTENED_TEST_1 (FT1_ID,
NAME) VALUES (?, ?)
[main] INFO org.apache.cayenne.test.jdbc.UtilityLogger - INSERT INTO FLATTENED_TEST_1 (FT1_ID,
NAME) VALUES (?, ?)
[main] INFO org.apache.cayenne.test.jdbc.UtilityLogger - INSERT INTO FLATTENED_TEST_2 (FT2_ID,
FT1_ID, NAME) VALUES (?, ?, ?)
[main] INFO org.apache.cayenne.test.jdbc.UtilityLogger - INSERT INTO FLATTENED_TEST_3 (FT3_ID,
FT2_ID, NAME) VALUES (?, ?, ?)
[main] INFO org.apache.cayenne.log.CommonsJdbcEventLogger - --- transaction started.
[main] INFO org.apache.cayenne.log.CommonsJdbcEventLogger - SELECT t0.NAME, t0.FT3_ID, t0.FT2_ID
FROM FLATTENED_TEST_3 t0 
[main] INFO org.apache.cayenne.log.CommonsJdbcEventLogger - === returned 1 row. - took 0 ms.
[main] INFO org.apache.cayenne.log.CommonsJdbcEventLogger - +++ transaction committed.
[main] INFO org.apache.cayenne.log.CommonsJdbcEventLogger - --- transaction started.
[main] INFO org.apache.cayenne.log.CommonsJdbcEventLogger - SELECT t0.NAME, t0.FT3_ID, t0.FT2_ID
FROM FLATTENED_TEST_3 t0 
[main] INFO org.apache.cayenne.log.CommonsJdbcEventLogger - === returned 1 row. - took 0 ms.
[main] INFO org.apache.cayenne.log.CommonsJdbcEventLogger - +++ transaction committed.
Tests run: 7, Failures: 0, Errors: 0, Skipped: 0, Time elapsed: 0.074 sec - in org.apache.cayenne.FlattenedRelationshipsIT
Running org.apache.cayenne.PregeneratedPKIT
[main] INFO org.apache.cayenne.configuration.XMLDataChannelDescriptorLoader - Loading XML
configuration resource from <https://builds.apache.org/job/cayenne-master/cayenneTestConnection=hsql,jdk=JDK%201.8%20(latest),label=Ubuntu/ws/cayenne-server/target/test-classes/cayenne-testmap.xml>
[main] INFO org.apache.cayenne.configuration.XMLDataChannelDescriptorLoader - Loading XML
DataMap resource from <https://builds.apache.org/job/cayenne-master/cayenneTestConnection=hsql,jdk=JDK%201.8%20(latest),label=Ubuntu/ws/cayenne-server/target/test-classes/testmap.map.xml>
[main] INFO org.apache.cayenne.map.EntityResolver - added runtime complimentary DbRelationship
from ARTIST to PAINTING1
[main] INFO org.apache.cayenne.configuration.XMLDataChannelDescriptorLoader - Loading XML
configuration resource from <https://builds.apache.org/job/cayenne-master/cayenneTestConnection=hsql,jdk=JDK%201.8%20(latest),label=Ubuntu/ws/cayenne-server/target/test-classes/cayenne-testmap.xml>
[main] INFO org.apache.cayenne.configuration.XMLDataChannelDescriptorLoader - Loading XML
DataMap resource from <https://builds.apache.org/job/cayenne-master/cayenneTestConnection=hsql,jdk=JDK%201.8%20(latest),label=Ubuntu/ws/cayenne-server/target/test-classes/testmap.map.xml>
[main] INFO org.apache.cayenne.test.jdbc.UtilityLogger - delete from ARTIST_GROUP
[main] INFO org.apache.cayenne.test.jdbc.UtilityLogger - delete from PAINTING_INFO
[main] INFO org.apache.cayenne.test.jdbc.UtilityLogger - delete from ARTIST_CT
[main] INFO org.apache.cayenne.test.jdbc.UtilityLogger - delete from ARTIST_EXHIBIT
[main] INFO org.apache.cayenne.test.jdbc.UtilityLogger - delete from ARTGROUP
[main] INFO org.apache.cayenne.test.jdbc.UtilityLogger - delete from PAINTING1
[main] INFO org.apache.cayenne.test.jdbc.UtilityLogger - delete from NULL_TEST
[main] INFO org.apache.cayenne.test.jdbc.UtilityLogger - delete from EXHIBIT
[main] INFO org.apache.cayenne.test.jdbc.UtilityLogger - delete from PAINTING
[main] INFO org.apache.cayenne.test.jdbc.UtilityLogger - delete from GALLERY
[main] INFO org.apache.cayenne.test.jdbc.UtilityLogger - delete from GENERATED_COLUMN
[main] INFO org.apache.cayenne.test.jdbc.UtilityLogger - delete from ARTIST
[main] INFO org.apache.cayenne.log.CommonsJdbcEventLogger - --- transaction started.
[main] INFO org.apache.cayenne.log.CommonsJdbcEventLogger - INSERT INTO ARTIST (ARTIST_ID,
ARTIST_NAME, DATE_OF_BIRTH) VALUES (?, ?, ?)
[main] INFO org.apache.cayenne.log.CommonsJdbcEventLogger - [bind: 1->ARTIST_ID:332, 2->ARTIST_NAME:'XXX',
3->DATE_OF_BIRTH:NULL]
[main] INFO org.apache.cayenne.log.CommonsJdbcEventLogger - === updated 1 row.
[main] INFO org.apache.cayenne.log.CommonsJdbcEventLogger - +++ transaction committed.
Tests run: 1, Failures: 0, Errors: 0, Skipped: 0, Time elapsed: 0.011 sec - in org.apache.cayenne.PregeneratedPKIT

Results :

Failed tests: 
  DataContextBinaryPKIT.testFetchRelationshipBinaryPK:87 expected:<master1> but was:<null>

Tests run: 1486, Failures: 1, Errors: 0, Skipped: 0

[INFO] 
[INFO] --- maven-failsafe-plugin:2.17:verify (integration-test) @ cayenne-server ---
[INFO] Failsafe report directory: <https://builds.apache.org/job/cayenne-master/cayenneTestConnection=hsql,jdk=JDK%201.8%20(latest),label=Ubuntu/ws/cayenne-server/target/failsafe-reports>
[INFO] ------------------------------------------------------------------------
[INFO] Reactor Summary:
[INFO] 
[INFO] Cayenne ............................................ SUCCESS [  0.558 s]
[INFO] Cayenne Build Tools Parent ......................... SUCCESS [  0.017 s]
[INFO] Cayenne License and Notice Bundle .................. SUCCESS [  5.109 s]
[INFO] Common Unit Test Utilities ......................... SUCCESS [  3.752 s]
[INFO] Cayenne Code Checkers .............................. SUCCESS [  0.127 s]
[INFO] Cayenne Dependency Injection Container ............. SUCCESS [ 10.826 s]
[INFO] Cayenne Server ..................................... FAILURE [01:51 min]
[INFO] Cayenne ROP Client ................................. SKIPPED
[INFO] Cayenne Database Synchronization Tools ............. SKIPPED
[INFO] Cayenne Project .................................... SKIPPED
[INFO] Cayenne Tools ...................................... SKIPPED
[INFO] Cayenne Lifecycle Utilities ........................ SKIPPED
[INFO] Cayenne Maven Plugins .............................. SKIPPED
[INFO] Cayenne Maven Plugin ............................... SKIPPED
[INFO] Cayenne Cryptography Extensions .................... SKIPPED
[INFO] Cayenne Joda Extensions ............................ SKIPPED
[INFO] Cayenne DBCP2 Extension ............................ SKIPPED
[INFO] Cayenne Integration Tests Parent ................... SKIPPED
[INFO] Integration Tests - Cayenne Tools .................. SKIPPED
[INFO] Cayenne Modeler Parent ............................. SKIPPED
[INFO] Cayenne WebObjects Compatibility Library ........... SKIPPED
[INFO] Cayenne Modeler .................................... SKIPPED
[INFO] Cayenne Modeler Generic and Windows Extensions ..... SKIPPED
[INFO] Cayenne Modeler Generic ............................ SKIPPED
[INFO] Cayenne Modeler Mac OS X Extensions ................ SKIPPED
[INFO] Cayenne Modeler Mac OS X ........................... SKIPPED
[INFO] Cayenne Modeler Windows ............................ SKIPPED
[INFO] Cayenne Modeler Maven Plugin ....................... SKIPPED
[INFO] Cayenne Tutorials .................................. SKIPPED
[INFO] Cayenne Tutorial ................................... SKIPPED
[INFO] Cayenne ROP Server Tutorial ........................ SKIPPED
[INFO] Cayenne ROP Client Tutorial ........................ SKIPPED
[INFO] Cayenne Java8 Extensions ........................... SKIPPED
[INFO] Cayenne Protostuff Extension ....................... SKIPPED
[INFO] Cayenne ROP HTTP/2 Server Tutorial ................. SKIPPED
[INFO] Cayenne ROP Client (Jetty) ......................... SKIPPED
[INFO] Cayenne ROP HTTP/2 Client Tutorial ................. SKIPPED
[INFO] Cayenne Documenation Parent ........................ SKIPPED
[INFO] Cayenne Documentation .............................. SKIPPED
[INFO] Cayenne Docbook Documentation ...................... SKIPPED
[INFO] Docbook: Cayenne Stylesheets ....................... SKIPPED
[INFO] Docbook: Cayenne Guide ............................. SKIPPED
[INFO] Docbook: Getting Started with Cayenne .............. SKIPPED
[INFO] Docbook: Getting Started with Cayenne ROP .......... SKIPPED
[INFO] Docbook: Cayenne New Features and Upgrade Guide .... SKIPPED
[INFO] Cayenne Release Assembly ........................... SKIPPED
[INFO] ------------------------------------------------------------------------
[INFO] BUILD FAILURE
[INFO] ------------------------------------------------------------------------
[INFO] Total time: 02:14 min
[INFO] Finished at: 2016-11-03T20:30:35+00:00
[INFO] Final Memory: 69M/408M
[INFO] ------------------------------------------------------------------------
[ERROR] Failed to execute goal org.apache.maven.plugins:maven-failsafe-plugin:2.17:verify
(integration-test) on project cayenne-server: There are test failures.
[ERROR] 
[ERROR] Please refer to <https://builds.apache.org/job/cayenne-master/cayenneTestConnection=hsql,jdk=JDK%201.8%20(latest),label=Ubuntu/ws/cayenne-server/target/failsafe-reports>
for the individual test results.
[ERROR] -> [Help 1]
org.apache.maven.lifecycle.LifecycleExecutionException: Failed to execute goal org.apache.maven.plugins:maven-failsafe-plugin:2.17:verify
(integration-test) on project cayenne-server: There are test failures.

Please refer to <https://builds.apache.org/job/cayenne-master/cayenneTestConnection=hsql,jdk=JDK%201.8%20(latest),label=Ubuntu/ws/cayenne-server/target/failsafe-reports>
for the individual test results.
	at org.apache.maven.lifecycle.internal.MojoExecutor.execute(MojoExecutor.java:212)
	at org.apache.maven.lifecycle.internal.MojoExecutor.execute(MojoExecutor.java:153)
	at org.apache.maven.lifecycle.internal.MojoExecutor.execute(MojoExecutor.java:145)
	at org.apache.maven.lifecycle.internal.LifecycleModuleBuilder.buildProject(LifecycleModuleBuilder.java:116)
	at org.apache.maven.lifecycle.internal.LifecycleModuleBuilder.buildProject(LifecycleModuleBuilder.java:80)
	at org.apache.maven.lifecycle.internal.builder.singlethreaded.SingleThreadedBuilder.build(SingleThreadedBuilder.java:51)
	at org.apache.maven.lifecycle.internal.LifecycleStarter.execute(LifecycleStarter.java:128)
	at org.apache.maven.DefaultMaven.doExecute(DefaultMaven.java:307)
	at org.apache.maven.DefaultMaven.doExecute(DefaultMaven.java:193)
	at org.apache.maven.DefaultMaven.execute(DefaultMaven.java:106)
	at org.apache.maven.cli.MavenCli.execute(MavenCli.java:863)
	at org.apache.maven.cli.MavenCli.doMain(MavenCli.java:288)
	at org.apache.maven.cli.MavenCli.main(MavenCli.java:199)
	at sun.reflect.NativeMethodAccessorImpl.invoke0(Native Method)
	at sun.reflect.NativeMethodAccessorImpl.invoke(NativeMethodAccessorImpl.java:62)
	at sun.reflect.DelegatingMethodAccessorImpl.invoke(DelegatingMethodAccessorImpl.java:43)
	at java.lang.reflect.Method.invoke(Method.java:498)
	at org.codehaus.plexus.classworlds.launcher.Launcher.launchEnhanced(Launcher.java:289)
	at org.codehaus.plexus.classworlds.launcher.Launcher.launch(Launcher.java:229)
	at org.codehaus.plexus.classworlds.launcher.Launcher.mainWithExitCode(Launcher.java:415)
	at org.codehaus.plexus.classworlds.launcher.Launcher.main(Launcher.java:356)
Caused by: org.apache.maven.plugin.MojoFailureException: There are test failures.

Please refer to <https://builds.apache.org/job/cayenne-master/cayenneTestConnection=hsql,jdk=JDK%201.8%20(latest),label=Ubuntu/ws/cayenne-server/target/failsafe-reports>
for the individual test results.
	at org.apache.maven.plugin.surefire.SurefireHelper.reportExecution(SurefireHelper.java:82)
	at org.apache.maven.plugin.failsafe.VerifyMojo.execute(VerifyMojo.java:194)
	at org.apache.maven.plugin.DefaultBuildPluginManager.executeMojo(DefaultBuildPluginManager.java:134)
	at org.apache.maven.lifecycle.internal.MojoExecutor.execute(MojoExecutor.java:207)
	... 20 more
[ERROR] 
[ERROR] Re-run Maven using the -X switch to enable full debug logging.
[ERROR] 
[ERROR] For more information about the errors and possible solutions, please read the following
articles:
[ERROR] [Help 1] http://cwiki.apache.org/confluence/display/MAVEN/MojoFailureException
[ERROR] 
[ERROR] After correcting the problems, you can resume the build with the command
[ERROR]   mvn <goals> -rf :cayenne-server
Build step 'Invoke top-level Maven targets' marked build as failure
Recording test results

Mime
View raw message