cayenne-commits mailing list archives

Site index · List index
Message view « Date » · « Thread »
Top « Date » · « Thread »
From Apache Jenkins Server <jenk...@builds.apache.org>
Subject Build failed in Jenkins: cayenne-master » hsql,JDK 9 b128 (early access build),Ubuntu #351
Date Thu, 11 Aug 2016 09:34:40 GMT
See <https://builds.apache.org/job/cayenne-master/cayenneTestConnection=hsql,jdk=JDK%209%20b128%20(early%20access%20build),label=Ubuntu/351/changes>

Changes:

[s.kolbachev] refactor CAY-2100: add PostgresBatchAction;

------------------------------------------
[...truncated 219 lines...]
[INFO] 
[INFO] --- maven-compiler-plugin:2.3.2:compile (default-compile) @ cayenne-di ---
[INFO] Compiling 45 source files to <https://builds.apache.org/job/cayenne-master/cayenneTestConnection=hsql,jdk=JDK%209%20b128%20(early%20access%20build),label=Ubuntu/ws/cayenne-di/target/classes>
[INFO] 
[INFO] --- maven-bundle-plugin:2.3.7:manifest (bundle-manifest) @ cayenne-di ---
[INFO] 
[INFO] --- maven-resources-plugin:2.4.3:testResources (default-testResources) @ cayenne-di
---
[INFO] Using 'UTF-8' encoding to copy filtered resources.
[INFO] skip non existing resourceDirectory <https://builds.apache.org/job/cayenne-master/cayenneTestConnection=hsql,jdk=JDK%209%20b128%20(early%20access%20build),label=Ubuntu/ws/cayenne-di/src/test/resources>
[INFO] Copying 50 resources
[INFO] 
[INFO] --- maven-compiler-plugin:2.3.2:testCompile (default-testCompile) @ cayenne-di ---
[INFO] Compiling 40 source files to <https://builds.apache.org/job/cayenne-master/cayenneTestConnection=hsql,jdk=JDK%209%20b128%20(early%20access%20build),label=Ubuntu/ws/cayenne-di/target/test-classes>
[INFO] 
[INFO] --- maven-surefire-plugin:2.5:test (default-test) @ cayenne-di ---
[INFO] Surefire report directory: <https://builds.apache.org/job/cayenne-master/cayenneTestConnection=hsql,jdk=JDK%209%20b128%20(early%20access%20build),label=Ubuntu/ws/cayenne-di/target/surefire-reports>

-------------------------------------------------------
 T E S T S
-------------------------------------------------------
Running org.apache.cayenne.di.spi.DefaultInjectorCircularInjectionTest
Tests run: 4, Failures: 0, Errors: 0, Skipped: 0, Time elapsed: 0.24 sec
Running org.apache.cayenne.di.DIBootstrapTest
Tests run: 3, Failures: 0, Errors: 0, Skipped: 0, Time elapsed: 0.005 sec
Running org.apache.cayenne.di.KeyTest
Tests run: 3, Failures: 0, Errors: 0, Skipped: 0, Time elapsed: 0.004 sec
Running org.apache.cayenne.di.spi.DefaultInjectorBindingTest
Tests run: 5, Failures: 0, Errors: 0, Skipped: 0, Time elapsed: 0.008 sec
Running org.apache.cayenne.di.spi.DefaultInjectorScopeTest
Tests run: 6, Failures: 0, Errors: 0, Skipped: 0, Time elapsed: 0.021 sec
Running org.apache.cayenne.di.spi.DefaultInjectorDecorationTest
Tests run: 3, Failures: 0, Errors: 0, Skipped: 0, Time elapsed: 0.011 sec
Running org.apache.cayenne.di.spi.DefaultInjectorInjectionTest
Tests run: 19, Failures: 0, Errors: 0, Skipped: 0, Time elapsed: 0.088 sec
Running org.apache.cayenne.di.spi.DefaultInjectorTest
Tests run: 4, Failures: 0, Errors: 0, Skipped: 0, Time elapsed: 0.021 sec

Results :

Tests run: 47, Failures: 0, Errors: 0, Skipped: 0

[INFO] 
[INFO] --- maven-jar-plugin:2.4:jar (default-jar) @ cayenne-di ---
[INFO] Building jar: <https://builds.apache.org/job/cayenne-master/cayenneTestConnection=hsql,jdk=JDK%209%20b128%20(early%20access%20build),label=Ubuntu/ws/cayenne-di/target/cayenne-di-4.0.M4-SNAPSHOT.jar>
[INFO] 
[INFO] >>> maven-source-plugin:2.1.2:jar (bundle-source-jar) > generate-sources
@ cayenne-di >>>
[INFO] 
[INFO] <<< maven-source-plugin:2.1.2:jar (bundle-source-jar) < generate-sources
@ cayenne-di <<<
[INFO] 
[INFO] --- maven-source-plugin:2.1.2:jar (bundle-source-jar) @ cayenne-di ---
[INFO] org already added, skipping
[INFO] org/apache already added, skipping
[INFO] org/apache/cayenne already added, skipping
[INFO] org/apache/cayenne/di already added, skipping
[INFO] org/apache/cayenne/di/spi already added, skipping
[INFO] Building jar: <https://builds.apache.org/job/cayenne-master/cayenneTestConnection=hsql,jdk=JDK%209%20b128%20(early%20access%20build),label=Ubuntu/ws/cayenne-di/target/cayenne-di-4.0.M4-SNAPSHOT-sources.jar>
[INFO] org already added, skipping
[INFO] org/apache already added, skipping
[INFO] org/apache/cayenne already added, skipping
[INFO] org/apache/cayenne/di already added, skipping
[INFO] org/apache/cayenne/di/spi already added, skipping
[INFO]                                                                         
[INFO] ------------------------------------------------------------------------
[INFO] Building Cayenne Server 4.0.M4-SNAPSHOT
[INFO] ------------------------------------------------------------------------
[INFO] 
[INFO] --- maven-clean-plugin:2.5:clean (default-clean) @ cayenne-server ---
[INFO] 
[INFO] --- javacc-maven-plugin:2.6:jjtree-javacc (jjtree-ejbql) @ cayenne-server ---
Java Compiler Compiler Version 5.0 (Tree Builder)
(type "jjtree" with no arguments for help)
Reading from file <https://builds.apache.org/job/cayenne-master/cayenneTestConnection=hsql,jdk=JDK%209%20b128%20(early%20access%20build),label=Ubuntu/ws/cayenne-server/src/main/jjtree/org/apache/cayenne/ejbql/EJBQLParser.jjt>
. . .
File "Node.java" does not exist.  Will create one.
File "EJBQLTreeConstants.java" does not exist.  Will create one.
File "JJTEJBQLState.java" does not exist.  Will create one.
Annotated grammar generated successfully in <https://builds.apache.org/job/cayenne-master/cayenneTestConnection=hsql,jdk=JDK%209%20b128%20(early%20access%20build),label=Ubuntu/ws/cayenne-server/target/javacc-1470908014249/node/EJBQLParser.jj>
Java Compiler Compiler Version 5.0 (Parser Generator)
(type "javacc" with no arguments for help)
Reading from file <https://builds.apache.org/job/cayenne-master/cayenneTestConnection=hsql,jdk=JDK%209%20b128%20(early%20access%20build),label=Ubuntu/ws/cayenne-server/target/javacc-1470908014249/node/EJBQLParser.jj>
. . .
Warning: Choice conflict in (...)* construct at line 840, column 17.
         Expansion nested within construct and expansion following construct
         have common prefixes, one of which is: "+"
         Consider using a lookahead of 2 or more for nested expansion.
Warning: Choice conflict in (...)* construct at line 849, column 17.
         Expansion nested within construct and expansion following construct
         have common prefixes, one of which is: "*"
         Consider using a lookahead of 2 or more for nested expansion.
File "TokenMgrError.java" does not exist.  Will create one.
File "ParseException.java" does not exist.  Will create one.
File "Token.java" does not exist.  Will create one.
File "JavaCharStream.java" does not exist.  Will create one.
Parser generated with 0 errors and 2 warnings.
[INFO] Processed 1 grammar
[INFO] 
[INFO] --- maven-antrun-plugin:1.3:run (default) @ cayenne-server ---
[INFO] Executing tasks
[INFO] Executed tasks
[INFO] 
[INFO] --- maven-checkstyle-plugin:2.9.1:check (default) @ cayenne-server ---
[INFO] 
[INFO] >>> maven-pmd-plugin:3.2:check (default) > :pmd @ cayenne-server >>>
[INFO] 
[INFO] --- maven-pmd-plugin:3.2:pmd (pmd) @ cayenne-server ---
[INFO] 
[INFO] <<< maven-pmd-plugin:3.2:check (default) < :pmd @ cayenne-server <<<
[INFO] 
[INFO] --- maven-pmd-plugin:3.2:check (default) @ cayenne-server ---
[INFO] 
[INFO] --- maven-remote-resources-plugin:1.5:process (default) @ cayenne-server ---
[INFO] 
[INFO] --- maven-resources-plugin:2.4.3:resources (default-resources) @ cayenne-server ---
[INFO] Using 'UTF-8' encoding to copy filtered resources.
[INFO] Copying 19 resources
[INFO] Copying 21 resources
[INFO] 
[INFO] --- maven-compiler-plugin:2.3.2:compile (default-compile) @ cayenne-server ---
[INFO] Compiling 1031 source files to <https://builds.apache.org/job/cayenne-master/cayenneTestConnection=hsql,jdk=JDK%209%20b128%20(early%20access%20build),label=Ubuntu/ws/cayenne-server/target/classes>
[INFO] -------------------------------------------------------------
[ERROR] COMPILATION ERROR : 
[INFO] -------------------------------------------------------------
[ERROR] <https://builds.apache.org/job/cayenne-master/cayenneTestConnection=hsql,jdk=JDK%209%20b128%20(early%20access%20build),label=Ubuntu/ws/cayenne-server/src/main/java/org/apache/cayenne/ObjectId.java>:[145,23]
error: incompatible types: HashMap<String,CAP#1> cannot be converted to Map<String,Object>
[ERROR] 
    CAP#1 extends Object from capture of ?
<https://builds.apache.org/job/cayenne-master/cayenneTestConnection=hsql,jdk=JDK%209%20b128%20(early%20access%20build),label=Ubuntu/ws/cayenne-server/src/main/java/org/apache/cayenne/query/AbstractMappedQuery.java>:[44,26]
error: incompatible types: HashMap<String,CAP#1> cannot be converted to Map<String,Object>
[ERROR] 
    CAP#1 extends Object from capture of ?
<https://builds.apache.org/job/cayenne-master/cayenneTestConnection=hsql,jdk=JDK%209%20b128%20(early%20access%20build),label=Ubuntu/ws/cayenne-server/src/main/java/org/apache/cayenne/query/SQLSelect.java>:[179,17]
error: incompatible types: HashMap<String,CAP#1> cannot be converted to Map<String,Object>
[ERROR] 
    CAP#1 extends Object from capture of ?
<https://builds.apache.org/job/cayenne-master/cayenneTestConnection=hsql,jdk=JDK%209%20b128%20(early%20access%20build),label=Ubuntu/ws/cayenne-server/src/main/java/org/apache/cayenne/query/NamedQuery.java>:[64,30]
error: incompatible types: HashMap<String,CAP#1> cannot be converted to Map<String,Object>
[ERROR] 
    CAP#1 extends Object from capture of ?
<https://builds.apache.org/job/cayenne-master/cayenneTestConnection=hsql,jdk=JDK%209%20b128%20(early%20access%20build),label=Ubuntu/ws/cayenne-server/src/main/java/org/apache/cayenne/query/ProcedureCall.java>:[87,26]
error: incompatible types: HashMap<String,CAP#1> cannot be converted to Map<String,Object>
[ERROR] 
    CAP#1 extends Object from capture of ?
<https://builds.apache.org/job/cayenne-master/cayenneTestConnection=hsql,jdk=JDK%209%20b128%20(early%20access%20build),label=Ubuntu/ws/cayenne-server/src/main/java/org/apache/cayenne/velocity/VelocitySQLTemplateProcessor.java>:[133,89]
error: incompatible types: HashMap<String,? extends Object> cannot be converted to Map<String,Object>
[INFO] 6 errors 
[INFO] -------------------------------------------------------------
[INFO] ------------------------------------------------------------------------
[INFO] Reactor Summary:
[INFO] 
[INFO] Cayenne ............................................ SUCCESS [  0.509 s]
[INFO] Cayenne Build Tools Parent ......................... SUCCESS [  0.006 s]
[INFO] Cayenne License and Notice Bundle .................. SUCCESS [  2.211 s]
[INFO] Common Unit Test Utilities ......................... SUCCESS [  2.549 s]
[INFO] Cayenne Code Checkers .............................. SUCCESS [  0.065 s]
[INFO] Cayenne Dependency Injection Container ............. SUCCESS [ 13.124 s]
[INFO] Cayenne Server ..................................... FAILURE [ 21.241 s]
[INFO] Cayenne ROP Client ................................. SKIPPED
[INFO] Cayenne Project .................................... SKIPPED
[INFO] Cayenne Tools ...................................... SKIPPED
[INFO] Cayenne Lifecycle Utilities ........................ SKIPPED
[INFO] Cayenne Maven Plugins .............................. SKIPPED
[INFO] Cayenne Maven Plugin ............................... SKIPPED
[INFO] Cayenne Cryptography Extensions .................... SKIPPED
[INFO] Cayenne Joda Extensions ............................ SKIPPED
[INFO] Cayenne DBCP2 Extension ............................ SKIPPED
[INFO] Cayenne Integration Tests Parent ................... SKIPPED
[INFO] Integration Tests - Cayenne Tools .................. SKIPPED
[INFO] Cayenne Modeler Parent ............................. SKIPPED
[INFO] Cayenne WebObjects Compatibility Library ........... SKIPPED
[INFO] Cayenne Modeler .................................... SKIPPED
[INFO] Cayenne Modeler Generic and Windows Extensions ..... SKIPPED
[INFO] Cayenne Modeler Generic ............................ SKIPPED
[INFO] Cayenne Modeler Mac OS X Extensions ................ SKIPPED
[INFO] Cayenne Modeler Mac OS X ........................... SKIPPED
[INFO] Cayenne Modeler Windows ............................ SKIPPED
[INFO] Cayenne Modeler Maven Plugin ....................... SKIPPED
[INFO] Cayenne Tutorials .................................. SKIPPED
[INFO] Cayenne Tutorial ................................... SKIPPED
[INFO] Cayenne ROP Server Tutorial ........................ SKIPPED
[INFO] Cayenne ROP Client Tutorial ........................ SKIPPED
[INFO] Cayenne Java8 Extensions ........................... SKIPPED
[INFO] Cayenne Protostuff Extension ....................... SKIPPED
[INFO] Cayenne ROP HTTP/2 Server Tutorial ................. SKIPPED
[INFO] Cayenne ROP Client (Jetty) ......................... SKIPPED
[INFO] Cayenne ROP HTTP/2 Client Tutorial ................. SKIPPED
[INFO] Cayenne Documenation Parent ........................ SKIPPED
[INFO] Cayenne Documentation .............................. SKIPPED
[INFO] Cayenne Docbook Documentation ...................... SKIPPED
[INFO] Docbook: Cayenne Stylesheets ....................... SKIPPED
[INFO] Docbook: Cayenne Guide ............................. SKIPPED
[INFO] Docbook: Getting Started with Cayenne .............. SKIPPED
[INFO] Docbook: Getting Started with Cayenne ROP .......... SKIPPED
[INFO] Docbook: Cayenne New Features and Upgrade Guide .... SKIPPED
[INFO] Cayenne Release Assembly ........................... SKIPPED
[INFO] ------------------------------------------------------------------------
[INFO] BUILD FAILURE
[INFO] ------------------------------------------------------------------------
[INFO] Total time: 41.520 s
[INFO] Finished at: 2016-08-11T09:33:54+00:00
[INFO] Final Memory: 63M/512M
[INFO] ------------------------------------------------------------------------
[ERROR] Failed to execute goal org.apache.maven.plugins:maven-compiler-plugin:2.3.2:compile
(default-compile) on project cayenne-server: Compilation failure: Compilation failure:
[ERROR] <https://builds.apache.org/job/cayenne-master/cayenneTestConnection=hsql,jdk=JDK%209%20b128%20(early%20access%20build),label=Ubuntu/ws/cayenne-server/src/main/java/org/apache/cayenne/ObjectId.java>:[145,23]
error: incompatible types: HashMap<String,CAP#1> cannot be converted to Map<String,Object>
[ERROR] 
[ERROR] CAP#1 extends Object from capture of ?
[ERROR] <https://builds.apache.org/job/cayenne-master/cayenneTestConnection=hsql,jdk=JDK%209%20b128%20(early%20access%20build),label=Ubuntu/ws/cayenne-server/src/main/java/org/apache/cayenne/query/AbstractMappedQuery.java>:[44,26]
error: incompatible types: HashMap<String,CAP#1> cannot be converted to Map<String,Object>
[ERROR] 
[ERROR] CAP#1 extends Object from capture of ?
[ERROR] <https://builds.apache.org/job/cayenne-master/cayenneTestConnection=hsql,jdk=JDK%209%20b128%20(early%20access%20build),label=Ubuntu/ws/cayenne-server/src/main/java/org/apache/cayenne/query/SQLSelect.java>:[179,17]
error: incompatible types: HashMap<String,CAP#1> cannot be converted to Map<String,Object>
[ERROR] 
[ERROR] CAP#1 extends Object from capture of ?
[ERROR] <https://builds.apache.org/job/cayenne-master/cayenneTestConnection=hsql,jdk=JDK%209%20b128%20(early%20access%20build),label=Ubuntu/ws/cayenne-server/src/main/java/org/apache/cayenne/query/NamedQuery.java>:[64,30]
error: incompatible types: HashMap<String,CAP#1> cannot be converted to Map<String,Object>
[ERROR] 
[ERROR] CAP#1 extends Object from capture of ?
[ERROR] <https://builds.apache.org/job/cayenne-master/cayenneTestConnection=hsql,jdk=JDK%209%20b128%20(early%20access%20build),label=Ubuntu/ws/cayenne-server/src/main/java/org/apache/cayenne/query/ProcedureCall.java>:[87,26]
error: incompatible types: HashMap<String,CAP#1> cannot be converted to Map<String,Object>
[ERROR] 
[ERROR] CAP#1 extends Object from capture of ?
[ERROR] <https://builds.apache.org/job/cayenne-master/cayenneTestConnection=hsql,jdk=JDK%209%20b128%20(early%20access%20build),label=Ubuntu/ws/cayenne-server/src/main/java/org/apache/cayenne/velocity/VelocitySQLTemplateProcessor.java>:[133,89]
error: incompatible types: HashMap<String,? extends Object> cannot be converted to Map<String,Object>
[ERROR] -> [Help 1]
org.apache.maven.lifecycle.LifecycleExecutionException: Failed to execute goal org.apache.maven.plugins:maven-compiler-plugin:2.3.2:compile
(default-compile) on project cayenne-server: Compilation failure
	at org.apache.maven.lifecycle.internal.MojoExecutor.execute(MojoExecutor.java:212)
	at org.apache.maven.lifecycle.internal.MojoExecutor.execute(MojoExecutor.java:153)
	at org.apache.maven.lifecycle.internal.MojoExecutor.execute(MojoExecutor.java:145)
	at org.apache.maven.lifecycle.internal.LifecycleModuleBuilder.buildProject(LifecycleModuleBuilder.java:116)
	at org.apache.maven.lifecycle.internal.LifecycleModuleBuilder.buildProject(LifecycleModuleBuilder.java:80)
	at org.apache.maven.lifecycle.internal.builder.singlethreaded.SingleThreadedBuilder.build(SingleThreadedBuilder.java:51)
	at org.apache.maven.lifecycle.internal.LifecycleStarter.execute(LifecycleStarter.java:128)
	at org.apache.maven.DefaultMaven.doExecute(DefaultMaven.java:307)
	at org.apache.maven.DefaultMaven.doExecute(DefaultMaven.java:193)
	at org.apache.maven.DefaultMaven.execute(DefaultMaven.java:106)
	at org.apache.maven.cli.MavenCli.execute(MavenCli.java:863)
	at org.apache.maven.cli.MavenCli.doMain(MavenCli.java:288)
	at org.apache.maven.cli.MavenCli.main(MavenCli.java:199)
	at jdk.internal.reflect.NativeMethodAccessorImpl.invoke0(java.base@9-ea/Native Method)
	at jdk.internal.reflect.NativeMethodAccessorImpl.invoke(java.base@9-ea/NativeMethodAccessorImpl.java:62)
	at jdk.internal.reflect.DelegatingMethodAccessorImpl.invoke(java.base@9-ea/DelegatingMethodAccessorImpl.java:43)
	at java.lang.reflect.Method.invoke(java.base@9-ea/Method.java:533)
	at org.codehaus.plexus.classworlds.launcher.Launcher.launchEnhanced(Launcher.java:289)
	at org.codehaus.plexus.classworlds.launcher.Launcher.launch(Launcher.java:229)
	at org.codehaus.plexus.classworlds.launcher.Launcher.mainWithExitCode(Launcher.java:415)
	at org.codehaus.plexus.classworlds.launcher.Launcher.main(Launcher.java:356)
Caused by: org.apache.maven.plugin.CompilationFailureException: Compilation failure
	at org.apache.maven.plugin.AbstractCompilerMojo.execute(AbstractCompilerMojo.java:656)
	at org.apache.maven.plugin.CompilerMojo.execute(CompilerMojo.java:128)
	at org.apache.maven.plugin.DefaultBuildPluginManager.executeMojo(DefaultBuildPluginManager.java:134)
	at org.apache.maven.lifecycle.internal.MojoExecutor.execute(MojoExecutor.java:207)
	... 20 more
[ERROR] 
[ERROR] Re-run Maven using the -X switch to enable full debug logging.
[ERROR] 
[ERROR] For more information about the errors and possible solutions, please read the following
articles:
[ERROR] [Help 1] http://cwiki.apache.org/confluence/display/MAVEN/MojoFailureException
[ERROR] 
[ERROR] After correcting the problems, you can resume the build with the command
[ERROR]   mvn <goals> -rf :cayenne-server
Build step 'Invoke top-level Maven targets' marked build as failure
Recording test results

Mime
View raw message